mesos-dev mailing list archives

Site index · List index
Message view « Date » · « Thread »
Top « Date » · « Thread »
From Benjamin Mahler <benjamin.mah...@gmail.com>
Subject Re: Build failed in Jenkins: Mesos-Trunk-Ubuntu-Build-Out-Of-Src-Set-JAVA_HOME #2275
Date Wed, 30 Jul 2014 20:40:16 GMT
Will push a fix for this shortly.


On Wed, Jul 30, 2014 at 1:59 AM, Apache Jenkins Server <
jenkins@builds.apache.org> wrote:

> See <
> https://builds.apache.org/job/Mesos-Trunk-Ubuntu-Build-Out-Of-Src-Set-JAVA_HOME/2275/changes
> >
>
> Changes:
>
> [adam] MESOS-1616 Changed ReregisterCompletedFrameworks to use stout JSON
> framework
>
> ------------------------------------------
> [...truncated 60832 lines...]
> I0730 08:59:08.667371 29458 authenticatee.hpp:265] Received SASL
> authentication step
> I0730 08:59:08.667403 29458 authenticator.hpp:290] Received SASL
> authentication step
> I0730 08:59:08.667417 29458 auxprop.cpp:81] Request to lookup properties
> for user: 'benh' realm: 'hemera.apache.org' server FQDN: '
> hemera.apache.org' SASL_AUXPROP_VERIFY_AGAINST_HASH: false
> SASL_AUXPROP_OVERRIDE: false SASL_AUXPROP_AUTHZID: false
> I0730 08:59:08.667423 29458 auxprop.cpp:153] Looking up auxiliary property
> '*userPassword'
> I0730 08:59:08.667433 29458 auxprop.cpp:153] Looking up auxiliary property
> '*cmusaslsecretCRAM-MD5'
> I0730 08:59:08.667443 29458 auxprop.cpp:81] Request to lookup properties
> for user: 'benh' realm: 'hemera.apache.org' server FQDN: '
> hemera.apache.org' SASL_AUXPROP_VERIFY_AGAINST_HASH: false
> SASL_AUXPROP_OVERRIDE: false SASL_AUXPROP_AUTHZID: true
> I0730 08:59:08.667448 29458 auxprop.cpp:103] Skipping auxiliary property
> '*userPassword' since SASL_AUXPROP_AUTHZID == true
> I0730 08:59:08.667454 29458 auxprop.cpp:103] Skipping auxiliary property
> '*cmusaslsecretCRAM-MD5' since SASL_AUXPROP_AUTHZID == true
> W0730 08:59:08.667469 29458 authenticator.hpp:390] Authentication failure:
> authentication failure
> [       OK ] SASL.failed1 (1 ms)
> [ RUN      ] SASL.success
> I0730 08:59:08.667825 29458 authenticatee.hpp:128] Creating new client
> SASL connection
> I0730 08:59:08.677729 29458 authenticator.hpp:156] Creating new server
> SASL connection
> I0730 08:59:08.677822 29458 authenticatee.hpp:219] Received SASL
> authentication mechanisms: CRAM-MD5
> I0730 08:59:08.677836 29458 authenticatee.hpp:245] Attempting to
> authenticate with mechanism 'CRAM-MD5'
> I0730 08:59:08.677858 29458 authenticator.hpp:262] Received SASL
> authentication start
> I0730 08:59:08.677891 29458 authenticator.hpp:384] Authentication requires
> more steps
> I0730 08:59:08.677913 29458 authenticatee.hpp:265] Received SASL
> authentication step
> I0730 08:59:08.677942 29458 authenticator.hpp:290] Received SASL
> authentication step
> I0730 08:59:08.677953 29458 auxprop.cpp:81] Request to lookup properties
> for user: 'benh' realm: 'hemera.apache.org' server FQDN: '
> hemera.apache.org' SASL_AUXPROP_VERIFY_AGAINST_HASH: false
> SASL_AUXPROP_OVERRIDE: false SASL_AUXPROP_AUTHZID: false
> I0730 08:59:08.677959 29458 auxprop.cpp:153] Looking up auxiliary property
> '*userPassword'
> I0730 08:59:08.677968 29458 auxprop.cpp:153] Looking up auxiliary property
> '*cmusaslsecretCRAM-MD5'
> I0730 08:59:08.677975 29458 auxprop.cpp:81] Request to lookup properties
> for user: 'benh' realm: 'hemera.apache.org' server FQDN: '
> hemera.apache.org' SASL_AUXPROP_VERIFY_AGAINST_HASH: false
> SASL_AUXPROP_OVERRIDE: false SASL_AUXPROP_AUTHZID: true
> I0730 08:59:08.677981 29458 auxprop.cpp:103] Skipping auxiliary property
> '*userPassword' since SASL_AUXPROP_AUTHZID == true
> I0730 08:59:08.677986 29458 auxprop.cpp:103] Skipping auxiliary property
> '*cmusaslsecretCRAM-MD5' since SASL_AUXPROP_AUTHZID == true
> I0730 08:59:08.677996 29458 authenticator.hpp:376] Authentication success
> I0730 08:59:08.678016 29458 authenticatee.hpp:305] Authentication success
> [       OK ] SASL.success (11 ms)
> [ RUN      ] SASL.failed2
> I0730 08:59:08.681679 29458 authenticatee.hpp:128] Creating new client
> SASL connection
> I0730 08:59:08.681913 29476 authenticator.hpp:156] Creating new server
> SASL connection
> I0730 08:59:08.682051 29470 authenticatee.hpp:219] Received SASL
> authentication mechanisms: CRAM-MD5
> I0730 08:59:08.682073 29470 authenticatee.hpp:245] Attempting to
> authenticate with mechanism 'CRAM-MD5'
> I0730 08:59:08.682107 29470 authenticator.hpp:262] Received SASL
> authentication start
> I0730 08:59:08.682154 29470 authenticator.hpp:384] Authentication requires
> more steps
> I0730 08:59:08.682181 29470 authenticatee.hpp:265] Received SASL
> authentication step
> I0730 08:59:08.682214 29470 authenticator.hpp:290] Received SASL
> authentication step
> I0730 08:59:08.682229 29470 auxprop.cpp:81] Request to lookup properties
> for user: 'benh' realm: 'hemera.apache.org' server FQDN: '
> hemera.apache.org' SASL_AUXPROP_VERIFY_AGAINST_HASH: false
> SASL_AUXPROP_OVERRIDE: false SASL_AUXPROP_AUTHZID: false
> I0730 08:59:08.682236 29470 auxprop.cpp:153] Looking up auxiliary property
> '*userPassword'
> I0730 08:59:08.682243 29470 auxprop.cpp:153] Looking up auxiliary property
> '*cmusaslsecretCRAM-MD5'
> I0730 08:59:08.682251 29470 auxprop.cpp:81] Request to lookup properties
> for user: 'benh' realm: 'hemera.apache.org' server FQDN: '
> hemera.apache.org' SASL_AUXPROP_VERIFY_AGAINST_HASH: false
> SASL_AUXPROP_OVERRIDE: false SASL_AUXPROP_AUTHZID: true
> I0730 08:59:08.682257 29470 auxprop.cpp:103] Skipping auxiliary property
> '*userPassword' since SASL_AUXPROP_AUTHZID == true
> I0730 08:59:08.682262 29470 auxprop.cpp:103] Skipping auxiliary property
> '*cmusaslsecretCRAM-MD5' since SASL_AUXPROP_AUTHZID == true
> W0730 08:59:08.682271 29470 authenticator.hpp:390] Authentication failure:
> user not found
> [       OK ] SASL.failed2 (4 ms)
> [----------] 3 tests from SASL (16 ms total)
>
> [----------] 2 tests from LogTest
> [ RUN      ] LogTest.Position
> Using temporary directory '/tmp/LogTest_Position_CcNYzg'
> I0730 08:59:08.722321 28022 leveldb.cpp:176] Opened db in 39.677421ms
> I0730 08:59:08.747655 28022 leveldb.cpp:183] Compacted db in 25.30729ms
> I0730 08:59:08.747679 28022 leveldb.cpp:198] Created db iterator in 3101ns
> I0730 08:59:08.747686 28022 leveldb.cpp:204] Seeked to beginning of db in
> 485ns
> I0730 08:59:08.747694 28022 leveldb.cpp:273] Iterated through 0 keys in
> the db in 213ns
> I0730 08:59:08.747706 28022 replica.cpp:741] Replica recovered with log
> positions 0 -> 0 with 1 holes and 0 unlearned
> I0730 08:59:08.777663 29481 leveldb.cpp:306] Persisting metadata (8 bytes)
> to leveldb took 24.002458ms
> I0730 08:59:08.777691 29481 replica.cpp:320] Persisted replica status to
> VOTING
> I0730 08:59:08.815881 28022 leveldb.cpp:176] Opened db in 36.665786ms
> I0730 08:59:08.841671 28022 leveldb.cpp:183] Compacted db in 25.768732ms
> I0730 08:59:08.841692 28022 leveldb.cpp:198] Created db iterator in 2006ns
> I0730 08:59:08.841701 28022 leveldb.cpp:204] Seeked to beginning of db in
> 326ns
> I0730 08:59:08.841706 28022 leveldb.cpp:273] Iterated through 0 keys in
> the db in 105ns
> I0730 08:59:08.841717 28022 replica.cpp:741] Replica recovered with log
> positions 0 -> 0 with 1 holes and 0 unlearned
> I0730 08:59:08.865669 29472 leveldb.cpp:306] Persisting metadata (8 bytes)
> to leveldb took 16.00977ms
> I0730 08:59:08.865692 29472 replica.cpp:320] Persisted replica status to
> VOTING
> I0730 08:59:08.909801 28022 leveldb.cpp:176] Opened db in 43.937433ms
> I0730 08:59:08.979387 28022 leveldb.cpp:183] Compacted db in 69.557004ms
> I0730 08:59:08.979416 28022 leveldb.cpp:198] Created db iterator in 4760ns
> I0730 08:59:08.979431 28022 leveldb.cpp:204] Seeked to beginning of db in
> 6882ns
> I0730 08:59:08.979449 28022 leveldb.cpp:273] Iterated through 1 keys in
> the db in 10833ns
> I0730 08:59:08.979462 28022 replica.cpp:741] Replica recovered with log
> positions 0 -> 0 with 1 holes and 0 unlearned
> I0730 08:59:09.019577 28022 leveldb.cpp:176] Opened db in 40.050813ms
> I0730 08:59:09.089656 28022 leveldb.cpp:183] Compacted db in 70.049954ms
> I0730 08:59:09.089691 28022 leveldb.cpp:198] Created db iterator in 5366ns
> I0730 08:59:09.089706 28022 leveldb.cpp:204] Seeked to beginning of db in
> 7536ns
> I0730 08:59:09.089725 28022 leveldb.cpp:273] Iterated through 1 keys in
> the db in 11895ns
> I0730 08:59:09.089740 28022 replica.cpp:741] Replica recovered with log
> positions 0 -> 0 with 1 holes and 0 unlearned
> I0730 08:59:09.093750 29472 recover.cpp:425] Starting replica recovery
> I0730 08:59:09.093811 29472 recover.cpp:451] Replica is in VOTING status
> I0730 08:59:09.093844 29472 recover.cpp:440] Recover process terminated
> I0730 08:59:09.093909 29472 log.cpp:656] Attempting to start the writer
> I0730 08:59:09.094166 29472 replica.cpp:474] Replica received implicit
> promise request with proposal 1
> I0730 08:59:09.097664 29463 replica.cpp:474] Replica received implicit
> promise request with proposal 1
> I0730 08:59:09.113651 29472 leveldb.cpp:306] Persisting metadata (8 bytes)
> to leveldb took 19.470909ms
> I0730 08:59:09.113656 29463 leveldb.cpp:306] Persisting metadata (8 bytes)
> to leveldb took 15.973663ms
> I0730 08:59:09.113670 29472 replica.cpp:342] Persisted promised to 1
> I0730 08:59:09.113674 29463 replica.cpp:342] Persisted promised to 1
> I0730 08:59:09.125784 29482 coordinator.cpp:230] Coordinator attemping to
> fill missing position
> I0730 08:59:09.126142 29461 replica.cpp:375] Replica received explicit
> promise request for position 0 with proposal 2
> I0730 08:59:09.129657 29472 replica.cpp:375] Replica received explicit
> promise request for position 0 with proposal 2
> I0730 08:59:09.136698 29461 leveldb.cpp:343] Persisting action (8 bytes)
> to leveldb took 10.535097ms
> I0730 08:59:09.136719 29461 replica.cpp:676] Persisted action at 0
> I0730 08:59:09.149652 29472 leveldb.cpp:343] Persisting action (8 bytes)
> to leveldb took 19.976824ms
> I0730 08:59:09.149672 29472 replica.cpp:676] Persisted action at 0
> I0730 08:59:09.149902 29472 replica.cpp:508] Replica received write
> request for position 0
> I0730 08:59:09.149925 29472 leveldb.cpp:438] Reading position from leveldb
> took 10897ns
> I0730 08:59:09.150070 29461 replica.cpp:508] Replica received write
> request for position 0
> I0730 08:59:09.150094 29461 leveldb.cpp:438] Reading position from
> leveldb took 10082ns
> I0730 08:59:09.165652 29461 leveldb.cpp:343] Persisting action (14 bytes)
> to leveldb took 15.543712ms
> I0730 08:59:09.165678 29461 replica.cpp:676] Persisted action at 0
> I0730 08:59:09.165655 29472 leveldb.cpp:343] Persisting action (14 bytes)
> to leveldb took 15.715688ms
> I0730 08:59:09.165748 29472 replica.cpp:676] Persisted action at 0
> I0730 08:59:09.165850 29472 replica.cpp:655] Replica received learned
> notice for position 0
> I0730 08:59:09.165915 29461 replica.cpp:655] Replica received learned
> notice for position 0
> I0730 08:59:09.181005 29461 leveldb.cpp:343] Persisting action (16 bytes)
> to leveldb took 15.06275ms
> I0730 08:59:09.181025 29461 replica.cpp:676] Persisted action at 0
> I0730 08:59:09.181035 29461 replica.cpp:661] Replica learned NOP action
> at position 0
> I0730 08:59:09.181169 29461 log.cpp:672] Writer started with ending
> position 0
> I0730 08:59:09.181278 29461 log.cpp:680] Attempting to append 11 bytes to
> the log
> I0730 08:59:09.181313 29461 coordinator.cpp:340] Coordinator attempting to
> write APPEND action at position 1
> I0730 08:59:09.181478 29461 replica.cpp:508] Replica received write
> request for position 1
> I0730 08:59:09.181565 29472 leveldb.cpp:343] Persisting action (16 bytes)
> to leveldb took 15.693466ms
> I0730 08:59:09.181583 29472 replica.cpp:676] Persisted action at 0
> I0730 08:59:09.181591 29472 replica.cpp:661] Replica learned NOP action
> at position 0
> I0730 08:59:09.181603 29472 replica.cpp:508] Replica received write
> request for position 1
> I0730 08:59:09.197651 29461 leveldb.cpp:343] Persisting action (27 bytes)
> to leveldb took 16.158279ms
> I0730 08:59:09.197674 29461 replica.cpp:676] Persisted action at 1
> I0730 08:59:09.197728 29472 leveldb.cpp:343] Persisting action (27 bytes)
> to leveldb took 16.116161ms
> I0730 08:59:09.197744 29472 replica.cpp:676] Persisted action at 1
> I0730 08:59:09.197867 29472 replica.cpp:655] Replica received learned
> notice for position 1
> I0730 08:59:09.197933 29461 replica.cpp:655] Replica received learned
> notice for position 1
> I0730 08:59:09.213210 29461 leveldb.cpp:343] Persisting action (29 bytes)
> to leveldb took 15.263673ms
> I0730 08:59:09.213232 29461 replica.cpp:676] Persisted action at 1
> I0730 08:59:09.213239 29461 replica.cpp:661] Replica learned APPEND action
> at position 1
> I0730 08:59:09.213521 29472 leveldb.cpp:343] Persisting action (29 bytes)
> to leveldb took 15.632486ms
> I0730 08:59:09.213538 29472 replica.cpp:676] Persisted action at 1
> I0730 08:59:09.213546 29472 replica.cpp:661] Replica learned APPEND action
> at position 1
> [       OK ] LogTest.Position (532 ms)
> [ RUN      ] LogTest.WriteRead
> Using temporary directory '/tmp/LogTest_WriteRead_2OXNh7'
> I0730 08:59:09.269763 28022 leveldb.cpp:176] Opened db in 55.555742ms
> I0730 08:59:09.305647 28022 leveldb.cpp:183] Compacted db in 35.86122ms
> I0730 08:59:09.305670 28022 leveldb.cpp:198] Created db iterator in 2269ns
> I0730 08:59:09.305677 28022 leveldb.cpp:204] Seeked to beginning of db in
> 330ns
> I0730 08:59:09.305683 28022 leveldb.cpp:273] Iterated through 0 keys in
> the db in 103ns
> I0730 08:59:09.305693 28022 replica.cpp:741] Replica recovered with log
> positions 0 -> 0 with 1 holes and 0 unlearned
> I0730 08:59:09.319334 29461 leveldb.cpp:306] Persisting metadata (8 bytes)
> to leveldb took 13.523279ms
> I0730 08:59:09.319355 29461 replica.cpp:320] Persisted replica status to
> VOTING
> I0730 08:59:09.365774 28022 leveldb.cpp:176] Opened db in 46.258071ms
> I0730 08:59:09.397650 28022 leveldb.cpp:183] Compacted db in 31.852805ms
> I0730 08:59:09.397671 28022 leveldb.cpp:198] Created db iterator in 2172ns
> I0730 08:59:09.397680 28022 leveldb.cpp:204] Seeked to beginning of db in
> 334ns
> I0730 08:59:09.397686 28022 leveldb.cpp:273] Iterated through 0 keys in
> the db in 110ns
> I0730 08:59:09.397696 28022 replica.cpp:741] Replica recovered with log
> positions 0 -> 0 with 1 holes and 0 unlearned
> I0730 08:59:09.421655 29469 leveldb.cpp:306] Persisting metadata (8 bytes)
> to leveldb took 11.993012ms
> I0730 08:59:09.421677 29469 replica.cpp:320] Persisted replica status to
> VOTING
> I0730 08:59:09.477787 28022 leveldb.cpp:176] Opened db in 52.021161ms
> I0730 08:59:09.561650 28022 leveldb.cpp:183] Compacted db in 83.839448ms
> I0730 08:59:09.561673 28022 leveldb.cpp:198] Created db iterator in 3302ns
> I0730 08:59:09.561686 28022 leveldb.cpp:204] Seeked to beginning of db in
> 5617ns
> I0730 08:59:09.561699 28022 leveldb.cpp:273] Iterated through 1 keys in
> the db in 5901ns
> I0730 08:59:09.561709 28022 replica.cpp:741] Replica recovered with log
> positions 0 -> 0 with 1 holes and 0 unlearned
> I0730 08:59:09.613788 28022 leveldb.cpp:176] Opened db in 51.90222ms
> I0730 08:59:09.681648 28022 leveldb.cpp:183] Compacted db in 67.836634ms
> I0730 08:59:09.681673 28022 leveldb.cpp:198] Created db iterator in 3388ns
> I0730 08:59:09.681684 28022 leveldb.cpp:204] Seeked to beginning of db in
> 5565ns
> I0730 08:59:09.681697 28022 leveldb.cpp:273] Iterated through 1 keys in
> the db in 5802ns
> I0730 08:59:09.681707 28022 replica.cpp:741] Replica recovered with log
> positions 0 -> 0 with 1 holes and 0 unlearned
> I0730 08:59:09.685742 29484 recover.cpp:425] Starting replica recovery
> I0730 08:59:09.685797 29484 recover.cpp:451] Replica is in VOTING status
> I0730 08:59:09.685824 29484 recover.cpp:440] Recover process terminated
> I0730 08:59:09.685883 29484 log.cpp:656] Attempting to start the writer
> I0730 08:59:09.686115 29484 replica.cpp:474] Replica received implicit
> promise request with proposal 1
> I0730 08:59:09.689669 29464 replica.cpp:474] Replica received implicit
> promise request with proposal 1
> I0730 08:59:09.701653 29464 leveldb.cpp:306] Persisting metadata (8 bytes)
> to leveldb took 11.966106ms
> I0730 08:59:09.701673 29464 replica.cpp:342] Persisted promised to 1
> I0730 08:59:09.705657 29484 leveldb.cpp:306] Persisting metadata (8 bytes)
> to leveldb took 19.521659ms
> I0730 08:59:09.705680 29484 replica.cpp:342] Persisted promised to 1
> I0730 08:59:09.705791 29484 coordinator.cpp:230] Coordinator attemping to
> fill missing position
> I0730 08:59:09.706049 29484 replica.cpp:375] Replica received explicit
> promise request for position 0 with proposal 2
> I0730 08:59:09.706126 29459 replica.cpp:375] Replica received explicit
> promise request for position 0 with proposal 2
> I0730 08:59:09.721264 29459 leveldb.cpp:343] Persisting action (8 bytes)
> to leveldb took 15.123709ms
> I0730 08:59:09.721285 29459 replica.cpp:676] Persisted action at 0
> I0730 08:59:09.721391 29484 leveldb.cpp:343] Persisting action (8 bytes)
> to leveldb took 15.32699ms
> I0730 08:59:09.721410 29484 replica.cpp:676] Persisted action at 0
> I0730 08:59:09.721598 29484 replica.cpp:508] Replica received write
> request for position 0
> I0730 08:59:09.721616 29484 leveldb.cpp:438] Reading position from leveldb
> took 7828ns
> I0730 08:59:09.721657 29478 replica.cpp:508] Replica received write
> request for position 0
> I0730 08:59:09.721679 29478 leveldb.cpp:438] Reading position from leveldb
> took 8827ns
> I0730 08:59:09.737393 29484 leveldb.cpp:343] Persisting action (14 bytes)
> to leveldb took 15.764753ms
> I0730 08:59:09.737417 29484 replica.cpp:676] Persisted action at 0
> I0730 08:59:09.737396 29478 leveldb.cpp:343] Persisting action (14 bytes)
> to leveldb took 15.70342ms
> I0730 08:59:09.739713 29478 replica.cpp:676] Persisted action at 0
> I0730 08:59:09.745728 29478 replica.cpp:655] Replica received learned
> notice for position 0
> I0730 08:59:09.745790 29476 replica.cpp:655] Replica received learned
> notice for position 0
> I0730 08:59:09.761499 29476 leveldb.cpp:343] Persisting action (16 bytes)
> to leveldb took 15.695516ms
> I0730 08:59:09.761507 29478 leveldb.cpp:343] Persisting action (16 bytes)
> to leveldb took 15.76005ms
> I0730 08:59:09.761520 29476 replica.cpp:676] Persisted action at 0
> I0730 08:59:09.761525 29478 replica.cpp:676] Persisted action at 0
> I0730 08:59:09.761528 29476 replica.cpp:661] Replica learned NOP action at
> position 0
> I0730 08:59:09.761533 29478 replica.cpp:661] Replica learned NOP action at
> position 0
> I0730 08:59:09.761651 29461 log.cpp:672] Writer started with ending
> position 0
> I0730 08:59:09.769656 29459 log.cpp:680] Attempting to append 11 bytes to
> the log
> I0730 08:59:09.769704 29459 coordinator.cpp:340] Coordinator attempting to
> write APPEND action at position 1
> I0730 08:59:09.769894 29459 replica.cpp:508] Replica received write
> request for position 1
> I0730 08:59:09.769973 29481 replica.cpp:508] Replica received write
> request for position 1
> I0730 08:59:09.785655 29481 leveldb.cpp:343] Persisting action (27 bytes)
> to leveldb took 15.666688ms
> I0730 08:59:09.785684 29481 replica.cpp:676] Persisted action at 1
> I0730 08:59:09.785655 29459 leveldb.cpp:343] Persisting action (27 bytes)
> to leveldb took 15.74335ms
> I0730 08:59:09.787716 29459 replica.cpp:676] Persisted action at 1
> I0730 08:59:09.787838 29459 replica.cpp:655] Replica received learned
> notice for position 1
> I0730 08:59:09.787914 29482 replica.cpp:655] Replica received learned
> notice for position 1
> I0730 08:59:09.805234 29459 leveldb.cpp:343] Persisting action (29 bytes)
> to leveldb took 17.382106ms
> I0730 08:59:09.805256 29459 replica.cpp:676] Persisted action at 1
> I0730 08:59:09.805264 29459 replica.cpp:661] Replica learned APPEND action
> at position 1
> I0730 08:59:09.805316 29482 leveldb.cpp:343] Persisting action (29 bytes)
> to leveldb took 17.390026ms
> I0730 08:59:09.805333 29482 replica.cpp:676] Persisted action at 1
> I0730 08:59:09.805341 29482 replica.cpp:661] Replica learned APPEND action
> at position 1
> I0730 08:59:09.805598 29482 leveldb.cpp:438] Reading position from leveldb
> took 9634ns
> [       OK ] LogTest.WriteRead (592 ms)
> [----------] 2 tests from LogTest (1124 ms total)
>
> [----------] 7 tests from InMemoryStateTest
> [ RUN      ] InMemoryStateTest.Names
> [       OK ] InMemoryStateTest.Names (11 ms)
> [ RUN      ] InMemoryStateTest.FetchAndStoreAndExpungeAndFetch
> [       OK ] InMemoryStateTest.FetchAndStoreAndExpungeAndFetch (26 ms)
> [ RUN      ] InMemoryStateTest.FetchAndStoreAndStoreFailAndFetch
> [       OK ] InMemoryStateTest.FetchAndStoreAndStoreFailAndFetch (50 ms)
> [ RUN      ] InMemoryStateTest.FetchAndStoreAndExpungeAndExpunge
> [       OK ] InMemoryStateTest.FetchAndStoreAndExpungeAndExpunge (54 ms)
> [ RUN      ] InMemoryStateTest.FetchAndStoreAndStoreAndFetch
> [       OK ] InMemoryStateTest.FetchAndStoreAndStoreAndFetch (46 ms)
> [ RUN      ] InMemoryStateTest.FetchAndStoreAndExpungeAndStoreAndFetch
> [       OK ] InMemoryStateTest.FetchAndStoreAndExpungeAndStoreAndFetch (60
> ms)
> [ RUN      ] InMemoryStateTest.FetchAndStoreAndFetch
> [       OK ] InMemoryStateTest.FetchAndStoreAndFetch (84 ms)
> [----------] 7 tests from InMemoryStateTest (331 ms total)
>
> [----------] Global test environment tear-down
> [==========] 391 tests from 64 test cases ran. (470181 ms total)
> [  PASSED  ] 390 tests.
> [  FAILED  ] 1 test, listed below:
> [  FAILED  ] SlaveRecoveryTest/0.MultipleFrameworks, where TypeParam =
> mesos::internal::slave::MesosContainerizer
>
>  1 FAILED TEST
>   YOU HAVE 4 DISABLED TESTS
>
> make[4]: *** [check-local] Error 1
> make[4]: Leaving directory
> `/x1/jenkins/jenkins-slave/workspace/Mesos-Trunk-Ubuntu-Build-Out-Of-Src-Set-JAVA_HOME/build/mesos-0.20.0/_build/src'
> make[3]: *** [check-am] Error 2
> make[3]: Leaving directory
> `/x1/jenkins/jenkins-slave/workspace/Mesos-Trunk-Ubuntu-Build-Out-Of-Src-Set-JAVA_HOME/build/mesos-0.20.0/_build/src'
> make[2]: *** [check] Error 2
> make[2]: Leaving directory
> `/x1/jenkins/jenkins-slave/workspace/Mesos-Trunk-Ubuntu-Build-Out-Of-Src-Set-JAVA_HOME/build/mesos-0.20.0/_build/src'
> make[1]: *** [check-recursive] Error 1
> make[1]: Leaving directory
> `/x1/jenkins/jenkins-slave/workspace/Mesos-Trunk-Ubuntu-Build-Out-Of-Src-Set-JAVA_HOME/build/mesos-0.20.0/_build'
> make: *** [distcheck] Error 1
> Build step 'Execute shell' marked build as failure
>

Mime
  • Unnamed multipart/alternative (inline, None, 0 bytes)
View raw message