mesos-dev mailing list archives

Site index · List index
Message view « Date » · « Thread »
Top « Date » · « Thread »
From Apache Jenkins Server <jenk...@builds.apache.org>
Subject Build failed in Jenkins: Mesos-Trunk-Ubuntu-Build-Out-Of-Src-Set-JAVA_HOME #2278
Date Thu, 31 Jul 2014 23:54:53 GMT
See <https://builds.apache.org/job/Mesos-Trunk-Ubuntu-Build-Out-Of-Src-Set-JAVA_HOME/2278/changes>

Changes:

[dhamon] Fix network isolator build

[adam] Fixed 3rdparty stout namespace and todo style

[adam] Fixed 3rdparty libprocess todo and namespace style

[adam] Fixed namespace and todo styles in mesos source

[adam] Enabled todo and namespace rules in style check

[adam] Fixed lingering namespace style error

------------------------------------------
[...truncated 3546 lines...]
byte-compiling build/bdist.linux-x86_64/egg/containerizer_pb2.py to containerizer_pb2.pyc
byte-compiling build/bdist.linux-x86_64/egg/mesos_pb2.py to mesos_pb2.pyc
byte-compiling build/bdist.linux-x86_64/egg/mesos.py to mesos.pyc
creating stub loader for _mesos.so
byte-compiling build/bdist.linux-x86_64/egg/_mesos.py to _mesos.pyc
creating build/bdist.linux-x86_64/egg/EGG-INFO
copying src/mesos.egg-info/PKG-INFO -> build/bdist.linux-x86_64/egg/EGG-INFO
copying src/mesos.egg-info/SOURCES.txt -> build/bdist.linux-x86_64/egg/EGG-INFO
copying src/mesos.egg-info/dependency_links.txt -> build/bdist.linux-x86_64/egg/EGG-INFO
copying src/mesos.egg-info/requires.txt -> build/bdist.linux-x86_64/egg/EGG-INFO
copying src/mesos.egg-info/top_level.txt -> build/bdist.linux-x86_64/egg/EGG-INFO
writing build/bdist.linux-x86_64/egg/EGG-INFO/native_libs.txt
zip_safe flag not set; analyzing archive contents...
creating dist
creating 'dist/mesos-0.20.0-py2.7-linux-x86_64.egg' and adding 'build/bdist.linux-x86_64/egg' to it
removing 'build/bdist.linux-x86_64/egg' (and everything under it)
make[3]: Leaving directory `<https://builds.apache.org/job/Mesos-Trunk-Ubuntu-Build-Out-Of-Src-Set-JAVA_HOME/ws/build/mesos-0.20.0/_build/src'>
make[2]: Leaving directory `<https://builds.apache.org/job/Mesos-Trunk-Ubuntu-Build-Out-Of-Src-Set-JAVA_HOME/ws/build/mesos-0.20.0/_build/src'>
Making all in ec2
make[2]: Entering directory `<https://builds.apache.org/job/Mesos-Trunk-Ubuntu-Build-Out-Of-Src-Set-JAVA_HOME/ws/build/mesos-0.20.0/_build/ec2'>
make[2]: Nothing to be done for `all'.
make[2]: Leaving directory `<https://builds.apache.org/job/Mesos-Trunk-Ubuntu-Build-Out-Of-Src-Set-JAVA_HOME/ws/build/mesos-0.20.0/_build/ec2'>
make[1]: Leaving directory `<https://builds.apache.org/job/Mesos-Trunk-Ubuntu-Build-Out-Of-Src-Set-JAVA_HOME/ws/build/mesos-0.20.0/_build'>
make[1]: Entering directory `<https://builds.apache.org/job/Mesos-Trunk-Ubuntu-Build-Out-Of-Src-Set-JAVA_HOME/ws/build/mesos-0.20.0/_build'>
Making dvi in .
make[2]: Entering directory `<https://builds.apache.org/job/Mesos-Trunk-Ubuntu-Build-Out-Of-Src-Set-JAVA_HOME/ws/build/mesos-0.20.0/_build'>
make[2]: Nothing to be done for `dvi-am'.
make[2]: Leaving directory `<https://builds.apache.org/job/Mesos-Trunk-Ubuntu-Build-Out-Of-Src-Set-JAVA_HOME/ws/build/mesos-0.20.0/_build'>
Making dvi in 3rdparty
make[2]: Entering directory `<https://builds.apache.org/job/Mesos-Trunk-Ubuntu-Build-Out-Of-Src-Set-JAVA_HOME/ws/build/mesos-0.20.0/_build/3rdparty'>
Making dvi in libprocess
make[3]: Entering directory `<https://builds.apache.org/job/Mesos-Trunk-Ubuntu-Build-Out-Of-Src-Set-JAVA_HOME/ws/build/mesos-0.20.0/_build/3rdparty/libprocess'>
Making dvi in 3rdparty
make[4]: Entering directory `<https://builds.apache.org/job/Mesos-Trunk-Ubuntu-Build-Out-Of-Src-Set-JAVA_HOME/ws/build/mesos-0.20.0/_build/3rdparty/libprocess/3rdparty'>
Making dvi in stout
make[5]: Entering directory `<https://builds.apache.org/job/Mesos-Trunk-Ubuntu-Build-Out-Of-Src-Set-JAVA_HOME/ws/build/mesos-0.20.0/_build/3rdparty/libprocess/3rdparty/stout'>
Making dvi in .
make[6]: Entering directory `<https://builds.apache.org/job/Mesos-Trunk-Ubuntu-Build-Out-Of-Src-Set-JAVA_HOME/ws/build/mesos-0.20.0/_build/3rdparty/libprocess/3rdparty/stout'>
make[6]: Nothing to be done for `dvi-am'.
make[6]: Leaving directory `<https://builds.apache.org/job/Mesos-Trunk-Ubuntu-Build-Out-Of-Src-Set-JAVA_HOME/ws/build/mesos-0.20.0/_build/3rdparty/libprocess/3rdparty/stout'>
Making dvi in include
make[6]: Entering directory `<https://builds.apache.org/job/Mesos-Trunk-Ubuntu-Build-Out-Of-Src-Set-JAVA_HOME/ws/build/mesos-0.20.0/_build/3rdparty/libprocess/3rdparty/stout/include'>
make[6]: Nothing to be done for `dvi'.
make[6]: Leaving directory `<https://builds.apache.org/job/Mesos-Trunk-Ubuntu-Build-Out-Of-Src-Set-JAVA_HOME/ws/build/mesos-0.20.0/_build/3rdparty/libprocess/3rdparty/stout/include'>
make[5]: Leaving directory `<https://builds.apache.org/job/Mesos-Trunk-Ubuntu-Build-Out-Of-Src-Set-JAVA_HOME/ws/build/mesos-0.20.0/_build/3rdparty/libprocess/3rdparty/stout'>
make[5]: Entering directory `<https://builds.apache.org/job/Mesos-Trunk-Ubuntu-Build-Out-Of-Src-Set-JAVA_HOME/ws/build/mesos-0.20.0/_build/3rdparty/libprocess/3rdparty'>
make[5]: Nothing to be done for `dvi-am'.
make[5]: Leaving directory `<https://builds.apache.org/job/Mesos-Trunk-Ubuntu-Build-Out-Of-Src-Set-JAVA_HOME/ws/build/mesos-0.20.0/_build/3rdparty/libprocess/3rdparty'>
make[4]: Leaving directory `<https://builds.apache.org/job/Mesos-Trunk-Ubuntu-Build-Out-Of-Src-Set-JAVA_HOME/ws/build/mesos-0.20.0/_build/3rdparty/libprocess/3rdparty'>
Making dvi in .
make[4]: Entering directory `<https://builds.apache.org/job/Mesos-Trunk-Ubuntu-Build-Out-Of-Src-Set-JAVA_HOME/ws/build/mesos-0.20.0/_build/3rdparty/libprocess'>
make[4]: Nothing to be done for `dvi-am'.
make[4]: Leaving directory `<https://builds.apache.org/job/Mesos-Trunk-Ubuntu-Build-Out-Of-Src-Set-JAVA_HOME/ws/build/mesos-0.20.0/_build/3rdparty/libprocess'>
Making dvi in include
make[4]: Entering directory `<https://builds.apache.org/job/Mesos-Trunk-Ubuntu-Build-Out-Of-Src-Set-JAVA_HOME/ws/build/mesos-0.20.0/_build/3rdparty/libprocess/include'>
make[4]: Nothing to be done for `dvi'.
make[4]: Leaving directory `<https://builds.apache.org/job/Mesos-Trunk-Ubuntu-Build-Out-Of-Src-Set-JAVA_HOME/ws/build/mesos-0.20.0/_build/3rdparty/libprocess/include'>
make[3]: Leaving directory `<https://builds.apache.org/job/Mesos-Trunk-Ubuntu-Build-Out-Of-Src-Set-JAVA_HOME/ws/build/mesos-0.20.0/_build/3rdparty/libprocess'>
make[3]: Entering directory `<https://builds.apache.org/job/Mesos-Trunk-Ubuntu-Build-Out-Of-Src-Set-JAVA_HOME/ws/build/mesos-0.20.0/_build/3rdparty'>
make[3]: Nothing to be done for `dvi-am'.
make[3]: Leaving directory `<https://builds.apache.org/job/Mesos-Trunk-Ubuntu-Build-Out-Of-Src-Set-JAVA_HOME/ws/build/mesos-0.20.0/_build/3rdparty'>
make[2]: Leaving directory `<https://builds.apache.org/job/Mesos-Trunk-Ubuntu-Build-Out-Of-Src-Set-JAVA_HOME/ws/build/mesos-0.20.0/_build/3rdparty'>
Making dvi in src
make[2]: Entering directory `<https://builds.apache.org/job/Mesos-Trunk-Ubuntu-Build-Out-Of-Src-Set-JAVA_HOME/ws/build/mesos-0.20.0/_build/src'>
make[2]: Nothing to be done for `dvi'.
make[2]: Leaving directory `<https://builds.apache.org/job/Mesos-Trunk-Ubuntu-Build-Out-Of-Src-Set-JAVA_HOME/ws/build/mesos-0.20.0/_build/src'>
Making dvi in ec2
make[2]: Entering directory `<https://builds.apache.org/job/Mesos-Trunk-Ubuntu-Build-Out-Of-Src-Set-JAVA_HOME/ws/build/mesos-0.20.0/_build/ec2'>
make[2]: Nothing to be done for `dvi'.
make[2]: Leaving directory `<https://builds.apache.org/job/Mesos-Trunk-Ubuntu-Build-Out-Of-Src-Set-JAVA_HOME/ws/build/mesos-0.20.0/_build/ec2'>
make[1]: Leaving directory `<https://builds.apache.org/job/Mesos-Trunk-Ubuntu-Build-Out-Of-Src-Set-JAVA_HOME/ws/build/mesos-0.20.0/_build'>
make[1]: Entering directory `<https://builds.apache.org/job/Mesos-Trunk-Ubuntu-Build-Out-Of-Src-Set-JAVA_HOME/ws/build/mesos-0.20.0/_build'>
Making check in .
make[2]: Entering directory `<https://builds.apache.org/job/Mesos-Trunk-Ubuntu-Build-Out-Of-Src-Set-JAVA_HOME/ws/build/mesos-0.20.0/_build'>
make[2]: Nothing to be done for `check-am'.
make[2]: Leaving directory `<https://builds.apache.org/job/Mesos-Trunk-Ubuntu-Build-Out-Of-Src-Set-JAVA_HOME/ws/build/mesos-0.20.0/_build'>
Making check in 3rdparty
make[2]: Entering directory `<https://builds.apache.org/job/Mesos-Trunk-Ubuntu-Build-Out-Of-Src-Set-JAVA_HOME/ws/build/mesos-0.20.0/_build/3rdparty'>
make  check-recursive
make[3]: Entering directory `<https://builds.apache.org/job/Mesos-Trunk-Ubuntu-Build-Out-Of-Src-Set-JAVA_HOME/ws/build/mesos-0.20.0/_build/3rdparty'>
Making check in libprocess
make[4]: Entering directory `<https://builds.apache.org/job/Mesos-Trunk-Ubuntu-Build-Out-Of-Src-Set-JAVA_HOME/ws/build/mesos-0.20.0/_build/3rdparty/libprocess'>
Making check in 3rdparty
make[5]: Entering directory `<https://builds.apache.org/job/Mesos-Trunk-Ubuntu-Build-Out-Of-Src-Set-JAVA_HOME/ws/build/mesos-0.20.0/_build/3rdparty/libprocess/3rdparty'>
make  check-recursive
make[6]: Entering directory `<https://builds.apache.org/job/Mesos-Trunk-Ubuntu-Build-Out-Of-Src-Set-JAVA_HOME/ws/build/mesos-0.20.0/_build/3rdparty/libprocess/3rdparty'>
Making check in stout
make[7]: Entering directory `<https://builds.apache.org/job/Mesos-Trunk-Ubuntu-Build-Out-Of-Src-Set-JAVA_HOME/ws/build/mesos-0.20.0/_build/3rdparty/libprocess/3rdparty/stout'>
Making check in .
make[8]: Entering directory `<https://builds.apache.org/job/Mesos-Trunk-Ubuntu-Build-Out-Of-Src-Set-JAVA_HOME/ws/build/mesos-0.20.0/_build/3rdparty/libprocess/3rdparty/stout'>
make[8]: Nothing to be done for `check-am'.
make[8]: Leaving directory `<https://builds.apache.org/job/Mesos-Trunk-Ubuntu-Build-Out-Of-Src-Set-JAVA_HOME/ws/build/mesos-0.20.0/_build/3rdparty/libprocess/3rdparty/stout'>
Making check in include
make[8]: Entering directory `<https://builds.apache.org/job/Mesos-Trunk-Ubuntu-Build-Out-Of-Src-Set-JAVA_HOME/ws/build/mesos-0.20.0/_build/3rdparty/libprocess/3rdparty/stout/include'>
make[8]: Nothing to be done for `check'.
make[8]: Leaving directory `<https://builds.apache.org/job/Mesos-Trunk-Ubuntu-Build-Out-Of-Src-Set-JAVA_HOME/ws/build/mesos-0.20.0/_build/3rdparty/libprocess/3rdparty/stout/include'>
make[7]: Leaving directory `<https://builds.apache.org/job/Mesos-Trunk-Ubuntu-Build-Out-Of-Src-Set-JAVA_HOME/ws/build/mesos-0.20.0/_build/3rdparty/libprocess/3rdparty/stout'>
make[7]: Entering directory `<https://builds.apache.org/job/Mesos-Trunk-Ubuntu-Build-Out-Of-Src-Set-JAVA_HOME/ws/build/mesos-0.20.0/_build/3rdparty/libprocess/3rdparty'>
make  libgmock.la stout-tests
make[8]: Entering directory `<https://builds.apache.org/job/Mesos-Trunk-Ubuntu-Build-Out-Of-Src-Set-JAVA_HOME/ws/build/mesos-0.20.0/_build/3rdparty/libprocess/3rdparty'>
/bin/bash ../libtool  --tag=CXX   --mode=compile g++ -DPACKAGE_NAME=\"libprocess\" -DPACKAGE_TARNAME=\"libprocess\" -DPACKAGE_VERSION=\"0.0.1\" -DPACKAGE_STRING=\"libprocess\ 0.0.1\" -DPACKAGE_BUGREPORT=\"\" -DPACKAGE_URL=\"\" -DPACKAGE=\"libprocess\" -DVERSION=\"0.0.1\" -DSTDC_HEADERS=1 -DHAVE_SYS_TYPES_H=1 -DHAVE_SYS_STAT_H=1 -DHAVE_STDLIB_H=1 -DHAVE_STRING_H=1 -DHAVE_MEMORY_H=1 -DHAVE_STRINGS_H=1 -DHAVE_INTTYPES_H=1 -DHAVE_STDINT_H=1 -DHAVE_UNISTD_H=1 -DHAVE_DLFCN_H=1 -DLT_OBJDIR=\".libs/\" -DHAVE_PTHREAD=1 -DHAVE_LIBZ=1 -I. -I../../../../3rdparty/libprocess/3rdparty  -Igmock-1.6.0/gtest/include -Igmock-1.6.0/gtest -Igmock-1.6.0/include -Igmock-1.6.0 -Iparser/include  -g -g2 -O2 -Wno-unused-local-typedefs -std=c++11 -MT libgmock_la-gtest-all.lo -MD -MP -MF .deps/libgmock_la-gtest-all.Tpo -c -o libgmock_la-gtest-all.lo `test -f 'gmock-1.6.0/gtest/src/gtest-all.cc' || echo '../../../../3rdparty/libprocess/3rdparty/'`gmock-1.6.0/gtest/src/gtest-all.cc
libtool: compile:  g++ -DPACKAGE_NAME=\"libprocess\" -DPACKAGE_TARNAME=\"libprocess\" -DPACKAGE_VERSION=\"0.0.1\" "-DPACKAGE_STRING=\"libprocess 0.0.1\"" -DPACKAGE_BUGREPORT=\"\" -DPACKAGE_URL=\"\" -DPACKAGE=\"libprocess\" -DVERSION=\"0.0.1\" -DSTDC_HEADERS=1 -DHAVE_SYS_TYPES_H=1 -DHAVE_SYS_STAT_H=1 -DHAVE_STDLIB_H=1 -DHAVE_STRING_H=1 -DHAVE_MEMORY_H=1 -DHAVE_STRINGS_H=1 -DHAVE_INTTYPES_H=1 -DHAVE_STDINT_H=1 -DHAVE_UNISTD_H=1 -DHAVE_DLFCN_H=1 -DLT_OBJDIR=\".libs/\" -DHAVE_PTHREAD=1 -DHAVE_LIBZ=1 -I. -I../../../../3rdparty/libprocess/3rdparty -Igmock-1.6.0/gtest/include -Igmock-1.6.0/gtest -Igmock-1.6.0/include -Igmock-1.6.0 -Iparser/include -g -g2 -O2 -Wno-unused-local-typedefs -std=c++11 -MT libgmock_la-gtest-all.lo -MD -MP -MF .deps/libgmock_la-gtest-all.Tpo -c gmock-1.6.0/gtest/src/gtest-all.cc  -fPIC -DPIC -o libgmock_la-gtest-all.o
mv -f .deps/libgmock_la-gtest-all.Tpo .deps/libgmock_la-gtest-all.Plo
/bin/bash ../libtool  --tag=CXX   --mode=compile g++ -DPACKAGE_NAME=\"libprocess\" -DPACKAGE_TARNAME=\"libprocess\" -DPACKAGE_VERSION=\"0.0.1\" -DPACKAGE_STRING=\"libprocess\ 0.0.1\" -DPACKAGE_BUGREPORT=\"\" -DPACKAGE_URL=\"\" -DPACKAGE=\"libprocess\" -DVERSION=\"0.0.1\" -DSTDC_HEADERS=1 -DHAVE_SYS_TYPES_H=1 -DHAVE_SYS_STAT_H=1 -DHAVE_STDLIB_H=1 -DHAVE_STRING_H=1 -DHAVE_MEMORY_H=1 -DHAVE_STRINGS_H=1 -DHAVE_INTTYPES_H=1 -DHAVE_STDINT_H=1 -DHAVE_UNISTD_H=1 -DHAVE_DLFCN_H=1 -DLT_OBJDIR=\".libs/\" -DHAVE_PTHREAD=1 -DHAVE_LIBZ=1 -I. -I../../../../3rdparty/libprocess/3rdparty  -Igmock-1.6.0/gtest/include -Igmock-1.6.0/gtest -Igmock-1.6.0/include -Igmock-1.6.0 -Iparser/include  -g -g2 -O2 -Wno-unused-local-typedefs -std=c++11 -MT libgmock_la-gmock-all.lo -MD -MP -MF .deps/libgmock_la-gmock-all.Tpo -c -o libgmock_la-gmock-all.lo `test -f 'gmock-1.6.0/src/gmock-all.cc' || echo '../../../../3rdparty/libprocess/3rdparty/'`gmock-1.6.0/src/gmock-all.cc
libtool: compile:  g++ -DPACKAGE_NAME=\"libprocess\" -DPACKAGE_TARNAME=\"libprocess\" -DPACKAGE_VERSION=\"0.0.1\" "-DPACKAGE_STRING=\"libprocess 0.0.1\"" -DPACKAGE_BUGREPORT=\"\" -DPACKAGE_URL=\"\" -DPACKAGE=\"libprocess\" -DVERSION=\"0.0.1\" -DSTDC_HEADERS=1 -DHAVE_SYS_TYPES_H=1 -DHAVE_SYS_STAT_H=1 -DHAVE_STDLIB_H=1 -DHAVE_STRING_H=1 -DHAVE_MEMORY_H=1 -DHAVE_STRINGS_H=1 -DHAVE_INTTYPES_H=1 -DHAVE_STDINT_H=1 -DHAVE_UNISTD_H=1 -DHAVE_DLFCN_H=1 -DLT_OBJDIR=\".libs/\" -DHAVE_PTHREAD=1 -DHAVE_LIBZ=1 -I. -I../../../../3rdparty/libprocess/3rdparty -Igmock-1.6.0/gtest/include -Igmock-1.6.0/gtest -Igmock-1.6.0/include -Igmock-1.6.0 -Iparser/include -g -g2 -O2 -Wno-unused-local-typedefs -std=c++11 -MT libgmock_la-gmock-all.lo -MD -MP -MF .deps/libgmock_la-gmock-all.Tpo -c gmock-1.6.0/src/gmock-all.cc  -fPIC -DPIC -o libgmock_la-gmock-all.o
mv -f .deps/libgmock_la-gmock-all.Tpo .deps/libgmock_la-gmock-all.Plo
/bin/bash ../libtool  --tag=CXX   --mode=link g++  -g -g2 -O2 -Wno-unused-local-typedefs -std=c++11   -o libgmock.la  libgmock_la-gtest-all.lo libgmock_la-gmock-all.lo  -lz  -lrt
libtool: link: ar cru .libs/libgmock.a  libgmock_la-gtest-all.o libgmock_la-gmock-all.o
libtool: link: ranlib .libs/libgmock.a
libtool: link: ( cd ".libs" && rm -f "libgmock.la" && ln -s "../libgmock.la" "libgmock.la" )
g++ -DPACKAGE_NAME=\"libprocess\" -DPACKAGE_TARNAME=\"libprocess\" -DPACKAGE_VERSION=\"0.0.1\" -DPACKAGE_STRING=\"libprocess\ 0.0.1\" -DPACKAGE_BUGREPORT=\"\" -DPACKAGE_URL=\"\" -DPACKAGE=\"libprocess\" -DVERSION=\"0.0.1\" -DSTDC_HEADERS=1 -DHAVE_SYS_TYPES_H=1 -DHAVE_SYS_STAT_H=1 -DHAVE_STDLIB_H=1 -DHAVE_STRING_H=1 -DHAVE_MEMORY_H=1 -DHAVE_STRINGS_H=1 -DHAVE_INTTYPES_H=1 -DHAVE_STDINT_H=1 -DHAVE_UNISTD_H=1 -DHAVE_DLFCN_H=1 -DLT_OBJDIR=\".libs/\" -DHAVE_PTHREAD=1 -DHAVE_LIBZ=1 -I. -I../../../../3rdparty/libprocess/3rdparty  -I../../../../3rdparty/libprocess/3rdparty/stout/include -Iglog-0.3.3/src -Igmock-1.6.0/gtest/include -Igmock-1.6.0/include -Iprotobuf-2.5.0/src  -Iboost-1.53.0 -Ipicojson-4f93734 -Iparser/include  -g -g2 -O2 -Wno-unused-local-typedefs -std=c++11 -MT stout_tests-base64_tests.o -MD -MP -MF .deps/stout_tests-base64_tests.Tpo -c -o stout_tests-base64_tests.o `test -f 'stout/tests/base64_tests.cpp' || echo '../../../../3rdparty/libprocess/3rdparty/'`stout/tests/base64_tests.cpp
mv -f .deps/stout_tests-base64_tests.Tpo .deps/stout_tests-base64_tests.Po
g++ -DPACKAGE_NAME=\"libprocess\" -DPACKAGE_TARNAME=\"libprocess\" -DPACKAGE_VERSION=\"0.0.1\" -DPACKAGE_STRING=\"libprocess\ 0.0.1\" -DPACKAGE_BUGREPORT=\"\" -DPACKAGE_URL=\"\" -DPACKAGE=\"libprocess\" -DVERSION=\"0.0.1\" -DSTDC_HEADERS=1 -DHAVE_SYS_TYPES_H=1 -DHAVE_SYS_STAT_H=1 -DHAVE_STDLIB_H=1 -DHAVE_STRING_H=1 -DHAVE_MEMORY_H=1 -DHAVE_STRINGS_H=1 -DHAVE_INTTYPES_H=1 -DHAVE_STDINT_H=1 -DHAVE_UNISTD_H=1 -DHAVE_DLFCN_H=1 -DLT_OBJDIR=\".libs/\" -DHAVE_PTHREAD=1 -DHAVE_LIBZ=1 -I. -I../../../../3rdparty/libprocess/3rdparty  -I../../../../3rdparty/libprocess/3rdparty/stout/include -Iglog-0.3.3/src -Igmock-1.6.0/gtest/include -Igmock-1.6.0/include -Iprotobuf-2.5.0/src  -Iboost-1.53.0 -Ipicojson-4f93734 -Iparser/include  -g -g2 -O2 -Wno-unused-local-typedefs -std=c++11 -MT stout_tests-bytes_tests.o -MD -MP -MF .deps/stout_tests-bytes_tests.Tpo -c -o stout_tests-bytes_tests.o `test -f 'stout/tests/bytes_tests.cpp' || echo '../../../../3rdparty/libprocess/3rdparty/'`stout/tests/bytes_tests.cpp
mv -f .deps/stout_tests-bytes_tests.Tpo .deps/stout_tests-bytes_tests.Po
g++ -DPACKAGE_NAME=\"libprocess\" -DPACKAGE_TARNAME=\"libprocess\" -DPACKAGE_VERSION=\"0.0.1\" -DPACKAGE_STRING=\"libprocess\ 0.0.1\" -DPACKAGE_BUGREPORT=\"\" -DPACKAGE_URL=\"\" -DPACKAGE=\"libprocess\" -DVERSION=\"0.0.1\" -DSTDC_HEADERS=1 -DHAVE_SYS_TYPES_H=1 -DHAVE_SYS_STAT_H=1 -DHAVE_STDLIB_H=1 -DHAVE_STRING_H=1 -DHAVE_MEMORY_H=1 -DHAVE_STRINGS_H=1 -DHAVE_INTTYPES_H=1 -DHAVE_STDINT_H=1 -DHAVE_UNISTD_H=1 -DHAVE_DLFCN_H=1 -DLT_OBJDIR=\".libs/\" -DHAVE_PTHREAD=1 -DHAVE_LIBZ=1 -I. -I../../../../3rdparty/libprocess/3rdparty  -I../../../../3rdparty/libprocess/3rdparty/stout/include -Iglog-0.3.3/src -Igmock-1.6.0/gtest/include -Igmock-1.6.0/include -Iprotobuf-2.5.0/src  -Iboost-1.53.0 -Ipicojson-4f93734 -Iparser/include  -g -g2 -O2 -Wno-unused-local-typedefs -std=c++11 -MT stout_tests-cache_tests.o -MD -MP -MF .deps/stout_tests-cache_tests.Tpo -c -o stout_tests-cache_tests.o `test -f 'stout/tests/cache_tests.cpp' || echo '../../../../3rdparty/libprocess/3rdparty/'`stout/tests/cache_tests.cpp
mv -f .deps/stout_tests-cache_tests.Tpo .deps/stout_tests-cache_tests.Po
g++ -DPACKAGE_NAME=\"libprocess\" -DPACKAGE_TARNAME=\"libprocess\" -DPACKAGE_VERSION=\"0.0.1\" -DPACKAGE_STRING=\"libprocess\ 0.0.1\" -DPACKAGE_BUGREPORT=\"\" -DPACKAGE_URL=\"\" -DPACKAGE=\"libprocess\" -DVERSION=\"0.0.1\" -DSTDC_HEADERS=1 -DHAVE_SYS_TYPES_H=1 -DHAVE_SYS_STAT_H=1 -DHAVE_STDLIB_H=1 -DHAVE_STRING_H=1 -DHAVE_MEMORY_H=1 -DHAVE_STRINGS_H=1 -DHAVE_INTTYPES_H=1 -DHAVE_STDINT_H=1 -DHAVE_UNISTD_H=1 -DHAVE_DLFCN_H=1 -DLT_OBJDIR=\".libs/\" -DHAVE_PTHREAD=1 -DHAVE_LIBZ=1 -I. -I../../../../3rdparty/libprocess/3rdparty  -I../../../../3rdparty/libprocess/3rdparty/stout/include -Iglog-0.3.3/src -Igmock-1.6.0/gtest/include -Igmock-1.6.0/include -Iprotobuf-2.5.0/src  -Iboost-1.53.0 -Ipicojson-4f93734 -Iparser/include  -g -g2 -O2 -Wno-unused-local-typedefs -std=c++11 -MT stout_tests-duration_tests.o -MD -MP -MF .deps/stout_tests-duration_tests.Tpo -c -o stout_tests-duration_tests.o `test -f 'stout/tests/duration_tests.cpp' || echo '../../../../3rdparty/libprocess/3rdparty/'`stout/tests/duration_tests.cpp
mv -f .deps/stout_tests-duration_tests.Tpo .deps/stout_tests-duration_tests.Po
g++ -DPACKAGE_NAME=\"libprocess\" -DPACKAGE_TARNAME=\"libprocess\" -DPACKAGE_VERSION=\"0.0.1\" -DPACKAGE_STRING=\"libprocess\ 0.0.1\" -DPACKAGE_BUGREPORT=\"\" -DPACKAGE_URL=\"\" -DPACKAGE=\"libprocess\" -DVERSION=\"0.0.1\" -DSTDC_HEADERS=1 -DHAVE_SYS_TYPES_H=1 -DHAVE_SYS_STAT_H=1 -DHAVE_STDLIB_H=1 -DHAVE_STRING_H=1 -DHAVE_MEMORY_H=1 -DHAVE_STRINGS_H=1 -DHAVE_INTTYPES_H=1 -DHAVE_STDINT_H=1 -DHAVE_UNISTD_H=1 -DHAVE_DLFCN_H=1 -DLT_OBJDIR=\".libs/\" -DHAVE_PTHREAD=1 -DHAVE_LIBZ=1 -I. -I../../../../3rdparty/libprocess/3rdparty  -I../../../../3rdparty/libprocess/3rdparty/stout/include -Iglog-0.3.3/src -Igmock-1.6.0/gtest/include -Igmock-1.6.0/include -Iprotobuf-2.5.0/src  -Iboost-1.53.0 -Ipicojson-4f93734 -Iparser/include  -g -g2 -O2 -Wno-unused-local-typedefs -std=c++11 -MT stout_tests-dynamiclibrary_tests.o -MD -MP -MF .deps/stout_tests-dynamiclibrary_tests.Tpo -c -o stout_tests-dynamiclibrary_tests.o `test -f 'stout/tests/dynamiclibrary_tests.cpp' || echo '../../../../3rdparty/libprocess/3rdparty/'`stout/tests/dynamiclibrary_tests.cpp
mv -f .deps/stout_tests-dynamiclibrary_tests.Tpo .deps/stout_tests-dynamiclibrary_tests.Po
g++ -DPACKAGE_NAME=\"libprocess\" -DPACKAGE_TARNAME=\"libprocess\" -DPACKAGE_VERSION=\"0.0.1\" -DPACKAGE_STRING=\"libprocess\ 0.0.1\" -DPACKAGE_BUGREPORT=\"\" -DPACKAGE_URL=\"\" -DPACKAGE=\"libprocess\" -DVERSION=\"0.0.1\" -DSTDC_HEADERS=1 -DHAVE_SYS_TYPES_H=1 -DHAVE_SYS_STAT_H=1 -DHAVE_STDLIB_H=1 -DHAVE_STRING_H=1 -DHAVE_MEMORY_H=1 -DHAVE_STRINGS_H=1 -DHAVE_INTTYPES_H=1 -DHAVE_STDINT_H=1 -DHAVE_UNISTD_H=1 -DHAVE_DLFCN_H=1 -DLT_OBJDIR=\".libs/\" -DHAVE_PTHREAD=1 -DHAVE_LIBZ=1 -I. -I../../../../3rdparty/libprocess/3rdparty  -I../../../../3rdparty/libprocess/3rdparty/stout/include -Iglog-0.3.3/src -Igmock-1.6.0/gtest/include -Igmock-1.6.0/include -Iprotobuf-2.5.0/src  -Iboost-1.53.0 -Ipicojson-4f93734 -Iparser/include  -g -g2 -O2 -Wno-unused-local-typedefs -std=c++11 -MT stout_tests-error_tests.o -MD -MP -MF .deps/stout_tests-error_tests.Tpo -c -o stout_tests-error_tests.o `test -f 'stout/tests/error_tests.cpp' || echo '../../../../3rdparty/libprocess/3rdparty/'`stout/tests/error_tests.cpp
mv -f .deps/stout_tests-error_tests.Tpo .deps/stout_tests-error_tests.Po
g++ -DPACKAGE_NAME=\"libprocess\" -DPACKAGE_TARNAME=\"libprocess\" -DPACKAGE_VERSION=\"0.0.1\" -DPACKAGE_STRING=\"libprocess\ 0.0.1\" -DPACKAGE_BUGREPORT=\"\" -DPACKAGE_URL=\"\" -DPACKAGE=\"libprocess\" -DVERSION=\"0.0.1\" -DSTDC_HEADERS=1 -DHAVE_SYS_TYPES_H=1 -DHAVE_SYS_STAT_H=1 -DHAVE_STDLIB_H=1 -DHAVE_STRING_H=1 -DHAVE_MEMORY_H=1 -DHAVE_STRINGS_H=1 -DHAVE_INTTYPES_H=1 -DHAVE_STDINT_H=1 -DHAVE_UNISTD_H=1 -DHAVE_DLFCN_H=1 -DLT_OBJDIR=\".libs/\" -DHAVE_PTHREAD=1 -DHAVE_LIBZ=1 -I. -I../../../../3rdparty/libprocess/3rdparty  -I../../../../3rdparty/libprocess/3rdparty/stout/include -Iglog-0.3.3/src -Igmock-1.6.0/gtest/include -Igmock-1.6.0/include -Iprotobuf-2.5.0/src  -Iboost-1.53.0 -Ipicojson-4f93734 -Iparser/include  -g -g2 -O2 -Wno-unused-local-typedefs -std=c++11 -MT stout_tests-flags_tests.o -MD -MP -MF .deps/stout_tests-flags_tests.Tpo -c -o stout_tests-flags_tests.o `test -f 'stout/tests/flags_tests.cpp' || echo '../../../../3rdparty/libprocess/3rdparty/'`stout/tests/flags_tests.cpp
mv -f .deps/stout_tests-flags_tests.Tpo .deps/stout_tests-flags_tests.Po
g++ -DPACKAGE_NAME=\"libprocess\" -DPACKAGE_TARNAME=\"libprocess\" -DPACKAGE_VERSION=\"0.0.1\" -DPACKAGE_STRING=\"libprocess\ 0.0.1\" -DPACKAGE_BUGREPORT=\"\" -DPACKAGE_URL=\"\" -DPACKAGE=\"libprocess\" -DVERSION=\"0.0.1\" -DSTDC_HEADERS=1 -DHAVE_SYS_TYPES_H=1 -DHAVE_SYS_STAT_H=1 -DHAVE_STDLIB_H=1 -DHAVE_STRING_H=1 -DHAVE_MEMORY_H=1 -DHAVE_STRINGS_H=1 -DHAVE_INTTYPES_H=1 -DHAVE_STDINT_H=1 -DHAVE_UNISTD_H=1 -DHAVE_DLFCN_H=1 -DLT_OBJDIR=\".libs/\" -DHAVE_PTHREAD=1 -DHAVE_LIBZ=1 -I. -I../../../../3rdparty/libprocess/3rdparty  -I../../../../3rdparty/libprocess/3rdparty/stout/include -Iglog-0.3.3/src -Igmock-1.6.0/gtest/include -Igmock-1.6.0/include -Iprotobuf-2.5.0/src  -Iboost-1.53.0 -Ipicojson-4f93734 -Iparser/include  -g -g2 -O2 -Wno-unused-local-typedefs -std=c++11 -MT stout_tests-gzip_tests.o -MD -MP -MF .deps/stout_tests-gzip_tests.Tpo -c -o stout_tests-gzip_tests.o `test -f 'stout/tests/gzip_tests.cpp' || echo '../../../../3rdparty/libprocess/3rdparty/'`stout/tests/gzip_tests.cpp
mv -f .deps/stout_tests-gzip_tests.Tpo .deps/stout_tests-gzip_tests.Po
g++ -DPACKAGE_NAME=\"libprocess\" -DPACKAGE_TARNAME=\"libprocess\" -DPACKAGE_VERSION=\"0.0.1\" -DPACKAGE_STRING=\"libprocess\ 0.0.1\" -DPACKAGE_BUGREPORT=\"\" -DPACKAGE_URL=\"\" -DPACKAGE=\"libprocess\" -DVERSION=\"0.0.1\" -DSTDC_HEADERS=1 -DHAVE_SYS_TYPES_H=1 -DHAVE_SYS_STAT_H=1 -DHAVE_STDLIB_H=1 -DHAVE_STRING_H=1 -DHAVE_MEMORY_H=1 -DHAVE_STRINGS_H=1 -DHAVE_INTTYPES_H=1 -DHAVE_STDINT_H=1 -DHAVE_UNISTD_H=1 -DHAVE_DLFCN_H=1 -DLT_OBJDIR=\".libs/\" -DHAVE_PTHREAD=1 -DHAVE_LIBZ=1 -I. -I../../../../3rdparty/libprocess/3rdparty  -I../../../../3rdparty/libprocess/3rdparty/stout/include -Iglog-0.3.3/src -Igmock-1.6.0/gtest/include -Igmock-1.6.0/include -Iprotobuf-2.5.0/src  -Iboost-1.53.0 -Ipicojson-4f93734 -Iparser/include  -g -g2 -O2 -Wno-unused-local-typedefs -std=c++11 -MT stout_tests-hashmap_tests.o -MD -MP -MF .deps/stout_tests-hashmap_tests.Tpo -c -o stout_tests-hashmap_tests.o `test -f 'stout/tests/hashmap_tests.cpp' || echo '../../../../3rdparty/libprocess/3rdparty/'`stout/tests/hashmap_tests.cpp
mv -f .deps/stout_tests-hashmap_tests.Tpo .deps/stout_tests-hashmap_tests.Po
g++ -DPACKAGE_NAME=\"libprocess\" -DPACKAGE_TARNAME=\"libprocess\" -DPACKAGE_VERSION=\"0.0.1\" -DPACKAGE_STRING=\"libprocess\ 0.0.1\" -DPACKAGE_BUGREPORT=\"\" -DPACKAGE_URL=\"\" -DPACKAGE=\"libprocess\" -DVERSION=\"0.0.1\" -DSTDC_HEADERS=1 -DHAVE_SYS_TYPES_H=1 -DHAVE_SYS_STAT_H=1 -DHAVE_STDLIB_H=1 -DHAVE_STRING_H=1 -DHAVE_MEMORY_H=1 -DHAVE_STRINGS_H=1 -DHAVE_INTTYPES_H=1 -DHAVE_STDINT_H=1 -DHAVE_UNISTD_H=1 -DHAVE_DLFCN_H=1 -DLT_OBJDIR=\".libs/\" -DHAVE_PTHREAD=1 -DHAVE_LIBZ=1 -I. -I../../../../3rdparty/libprocess/3rdparty  -I../../../../3rdparty/libprocess/3rdparty/stout/include -Iglog-0.3.3/src -Igmock-1.6.0/gtest/include -Igmock-1.6.0/include -Iprotobuf-2.5.0/src  -Iboost-1.53.0 -Ipicojson-4f93734 -Iparser/include  -g -g2 -O2 -Wno-unused-local-typedefs -std=c++11 -MT stout_tests-hashset_tests.o -MD -MP -MF .deps/stout_tests-hashset_tests.Tpo -c -o stout_tests-hashset_tests.o `test -f 'stout/tests/hashset_tests.cpp' || echo '../../../../3rdparty/libprocess/3rdparty/'`stout/tests/hashset_tests.cpp
mv -f .deps/stout_tests-hashset_tests.Tpo .deps/stout_tests-hashset_tests.Po
g++ -DPACKAGE_NAME=\"libprocess\" -DPACKAGE_TARNAME=\"libprocess\" -DPACKAGE_VERSION=\"0.0.1\" -DPACKAGE_STRING=\"libprocess\ 0.0.1\" -DPACKAGE_BUGREPORT=\"\" -DPACKAGE_URL=\"\" -DPACKAGE=\"libprocess\" -DVERSION=\"0.0.1\" -DSTDC_HEADERS=1 -DHAVE_SYS_TYPES_H=1 -DHAVE_SYS_STAT_H=1 -DHAVE_STDLIB_H=1 -DHAVE_STRING_H=1 -DHAVE_MEMORY_H=1 -DHAVE_STRINGS_H=1 -DHAVE_INTTYPES_H=1 -DHAVE_STDINT_H=1 -DHAVE_UNISTD_H=1 -DHAVE_DLFCN_H=1 -DLT_OBJDIR=\".libs/\" -DHAVE_PTHREAD=1 -DHAVE_LIBZ=1 -I. -I../../../../3rdparty/libprocess/3rdparty  -I../../../../3rdparty/libprocess/3rdparty/stout/include -Iglog-0.3.3/src -Igmock-1.6.0/gtest/include -Igmock-1.6.0/include -Iprotobuf-2.5.0/src  -Iboost-1.53.0 -Ipicojson-4f93734 -Iparser/include  -g -g2 -O2 -Wno-unused-local-typedefs -std=c++11 -MT stout_tests-interval_tests.o -MD -MP -MF .deps/stout_tests-interval_tests.Tpo -c -o stout_tests-interval_tests.o `test -f 'stout/tests/interval_tests.cpp' || echo '../../../../3rdparty/libprocess/3rdparty/'`stout/tests/interval_tests.cpp
mv -f .deps/stout_tests-interval_tests.Tpo .deps/stout_tests-interval_tests.Po
g++ -DPACKAGE_NAME=\"libprocess\" -DPACKAGE_TARNAME=\"libprocess\" -DPACKAGE_VERSION=\"0.0.1\" -DPACKAGE_STRING=\"libprocess\ 0.0.1\" -DPACKAGE_BUGREPORT=\"\" -DPACKAGE_URL=\"\" -DPACKAGE=\"libprocess\" -DVERSION=\"0.0.1\" -DSTDC_HEADERS=1 -DHAVE_SYS_TYPES_H=1 -DHAVE_SYS_STAT_H=1 -DHAVE_STDLIB_H=1 -DHAVE_STRING_H=1 -DHAVE_MEMORY_H=1 -DHAVE_STRINGS_H=1 -DHAVE_INTTYPES_H=1 -DHAVE_STDINT_H=1 -DHAVE_UNISTD_H=1 -DHAVE_DLFCN_H=1 -DLT_OBJDIR=\".libs/\" -DHAVE_PTHREAD=1 -DHAVE_LIBZ=1 -I. -I../../../../3rdparty/libprocess/3rdparty  -I../../../../3rdparty/libprocess/3rdparty/stout/include -Iglog-0.3.3/src -Igmock-1.6.0/gtest/include -Igmock-1.6.0/include -Iprotobuf-2.5.0/src  -Iboost-1.53.0 -Ipicojson-4f93734 -Iparser/include  -g -g2 -O2 -Wno-unused-local-typedefs -std=c++11 -MT stout_tests-json_tests.o -MD -MP -MF .deps/stout_tests-json_tests.Tpo -c -o stout_tests-json_tests.o `test -f 'stout/tests/json_tests.cpp' || echo '../../../../3rdparty/libprocess/3rdparty/'`stout/tests/json_tests.cpp
mv -f .deps/stout_tests-json_tests.Tpo .deps/stout_tests-json_tests.Po
g++ -DPACKAGE_NAME=\"libprocess\" -DPACKAGE_TARNAME=\"libprocess\" -DPACKAGE_VERSION=\"0.0.1\" -DPACKAGE_STRING=\"libprocess\ 0.0.1\" -DPACKAGE_BUGREPORT=\"\" -DPACKAGE_URL=\"\" -DPACKAGE=\"libprocess\" -DVERSION=\"0.0.1\" -DSTDC_HEADERS=1 -DHAVE_SYS_TYPES_H=1 -DHAVE_SYS_STAT_H=1 -DHAVE_STDLIB_H=1 -DHAVE_STRING_H=1 -DHAVE_MEMORY_H=1 -DHAVE_STRINGS_H=1 -DHAVE_INTTYPES_H=1 -DHAVE_STDINT_H=1 -DHAVE_UNISTD_H=1 -DHAVE_DLFCN_H=1 -DLT_OBJDIR=\".libs/\" -DHAVE_PTHREAD=1 -DHAVE_LIBZ=1 -I. -I../../../../3rdparty/libprocess/3rdparty  -I../../../../3rdparty/libprocess/3rdparty/stout/include -Iglog-0.3.3/src -Igmock-1.6.0/gtest/include -Igmock-1.6.0/include -Iprotobuf-2.5.0/src  -Iboost-1.53.0 -Ipicojson-4f93734 -Iparser/include  -g -g2 -O2 -Wno-unused-local-typedefs -std=c++11 -MT stout_tests-linkedhashmap_tests.o -MD -MP -MF .deps/stout_tests-linkedhashmap_tests.Tpo -c -o stout_tests-linkedhashmap_tests.o `test -f 'stout/tests/linkedhashmap_tests.cpp' || echo '../../../../3rdparty/libprocess/3rdparty/'`stout/tests/linkedhashmap_tests.cpp
mv -f .deps/stout_tests-linkedhashmap_tests.Tpo .deps/stout_tests-linkedhashmap_tests.Po
g++ -DPACKAGE_NAME=\"libprocess\" -DPACKAGE_TARNAME=\"libprocess\" -DPACKAGE_VERSION=\"0.0.1\" -DPACKAGE_STRING=\"libprocess\ 0.0.1\" -DPACKAGE_BUGREPORT=\"\" -DPACKAGE_URL=\"\" -DPACKAGE=\"libprocess\" -DVERSION=\"0.0.1\" -DSTDC_HEADERS=1 -DHAVE_SYS_TYPES_H=1 -DHAVE_SYS_STAT_H=1 -DHAVE_STDLIB_H=1 -DHAVE_STRING_H=1 -DHAVE_MEMORY_H=1 -DHAVE_STRINGS_H=1 -DHAVE_INTTYPES_H=1 -DHAVE_STDINT_H=1 -DHAVE_UNISTD_H=1 -DHAVE_DLFCN_H=1 -DLT_OBJDIR=\".libs/\" -DHAVE_PTHREAD=1 -DHAVE_LIBZ=1 -I. -I../../../../3rdparty/libprocess/3rdparty  -I../../../../3rdparty/libprocess/3rdparty/stout/include -Iglog-0.3.3/src -Igmock-1.6.0/gtest/include -Igmock-1.6.0/include -Iprotobuf-2.5.0/src  -Iboost-1.53.0 -Ipicojson-4f93734 -Iparser/include  -g -g2 -O2 -Wno-unused-local-typedefs -std=c++11 -MT stout_tests-main.o -MD -MP -MF .deps/stout_tests-main.Tpo -c -o stout_tests-main.o `test -f 'stout/tests/main.cpp' || echo '../../../../3rdparty/libprocess/3rdparty/'`stout/tests/main.cpp
mv -f .deps/stout_tests-main.Tpo .deps/stout_tests-main.Po
g++ -DPACKAGE_NAME=\"libprocess\" -DPACKAGE_TARNAME=\"libprocess\" -DPACKAGE_VERSION=\"0.0.1\" -DPACKAGE_STRING=\"libprocess\ 0.0.1\" -DPACKAGE_BUGREPORT=\"\" -DPACKAGE_URL=\"\" -DPACKAGE=\"libprocess\" -DVERSION=\"0.0.1\" -DSTDC_HEADERS=1 -DHAVE_SYS_TYPES_H=1 -DHAVE_SYS_STAT_H=1 -DHAVE_STDLIB_H=1 -DHAVE_STRING_H=1 -DHAVE_MEMORY_H=1 -DHAVE_STRINGS_H=1 -DHAVE_INTTYPES_H=1 -DHAVE_STDINT_H=1 -DHAVE_UNISTD_H=1 -DHAVE_DLFCN_H=1 -DLT_OBJDIR=\".libs/\" -DHAVE_PTHREAD=1 -DHAVE_LIBZ=1 -I. -I../../../../3rdparty/libprocess/3rdparty  -I../../../../3rdparty/libprocess/3rdparty/stout/include -Iglog-0.3.3/src -Igmock-1.6.0/gtest/include -Igmock-1.6.0/include -Iprotobuf-2.5.0/src  -Iboost-1.53.0 -Ipicojson-4f93734 -Iparser/include  -g -g2 -O2 -Wno-unused-local-typedefs -std=c++11 -MT stout_tests-multimap_tests.o -MD -MP -MF .deps/stout_tests-multimap_tests.Tpo -c -o stout_tests-multimap_tests.o `test -f 'stout/tests/multimap_tests.cpp' || echo '../../../../3rdparty/libprocess/3rdparty/'`stout/tests/multimap_tests.cpp
mv -f .deps/stout_tests-multimap_tests.Tpo .deps/stout_tests-multimap_tests.Po
g++ -DPACKAGE_NAME=\"libprocess\" -DPACKAGE_TARNAME=\"libprocess\" -DPACKAGE_VERSION=\"0.0.1\" -DPACKAGE_STRING=\"libprocess\ 0.0.1\" -DPACKAGE_BUGREPORT=\"\" -DPACKAGE_URL=\"\" -DPACKAGE=\"libprocess\" -DVERSION=\"0.0.1\" -DSTDC_HEADERS=1 -DHAVE_SYS_TYPES_H=1 -DHAVE_SYS_STAT_H=1 -DHAVE_STDLIB_H=1 -DHAVE_STRING_H=1 -DHAVE_MEMORY_H=1 -DHAVE_STRINGS_H=1 -DHAVE_INTTYPES_H=1 -DHAVE_STDINT_H=1 -DHAVE_UNISTD_H=1 -DHAVE_DLFCN_H=1 -DLT_OBJDIR=\".libs/\" -DHAVE_PTHREAD=1 -DHAVE_LIBZ=1 -I. -I../../../../3rdparty/libprocess/3rdparty  -I../../../../3rdparty/libprocess/3rdparty/stout/include -Iglog-0.3.3/src -Igmock-1.6.0/gtest/include -Igmock-1.6.0/include -Iprotobuf-2.5.0/src  -Iboost-1.53.0 -Ipicojson-4f93734 -Iparser/include  -g -g2 -O2 -Wno-unused-local-typedefs -std=c++11 -MT stout_tests-net_tests.o -MD -MP -MF .deps/stout_tests-net_tests.Tpo -c -o stout_tests-net_tests.o `test -f 'stout/tests/net_tests.cpp' || echo '../../../../3rdparty/libprocess/3rdparty/'`stout/tests/net_tests.cpp
mv -f .deps/stout_tests-net_tests.Tpo .deps/stout_tests-net_tests.Po
g++ -DPACKAGE_NAME=\"libprocess\" -DPACKAGE_TARNAME=\"libprocess\" -DPACKAGE_VERSION=\"0.0.1\" -DPACKAGE_STRING=\"libprocess\ 0.0.1\" -DPACKAGE_BUGREPORT=\"\" -DPACKAGE_URL=\"\" -DPACKAGE=\"libprocess\" -DVERSION=\"0.0.1\" -DSTDC_HEADERS=1 -DHAVE_SYS_TYPES_H=1 -DHAVE_SYS_STAT_H=1 -DHAVE_STDLIB_H=1 -DHAVE_STRING_H=1 -DHAVE_MEMORY_H=1 -DHAVE_STRINGS_H=1 -DHAVE_INTTYPES_H=1 -DHAVE_STDINT_H=1 -DHAVE_UNISTD_H=1 -DHAVE_DLFCN_H=1 -DLT_OBJDIR=\".libs/\" -DHAVE_PTHREAD=1 -DHAVE_LIBZ=1 -I. -I../../../../3rdparty/libprocess/3rdparty  -I../../../../3rdparty/libprocess/3rdparty/stout/include -Iglog-0.3.3/src -Igmock-1.6.0/gtest/include -Igmock-1.6.0/include -Iprotobuf-2.5.0/src  -Iboost-1.53.0 -Ipicojson-4f93734 -Iparser/include  -g -g2 -O2 -Wno-unused-local-typedefs -std=c++11 -MT stout_tests-none_tests.o -MD -MP -MF .deps/stout_tests-none_tests.Tpo -c -o stout_tests-none_tests.o `test -f 'stout/tests/none_tests.cpp' || echo '../../../../3rdparty/libprocess/3rdparty/'`stout/tests/none_tests.cpp
mv -f .deps/stout_tests-none_tests.Tpo .deps/stout_tests-none_tests.Po
g++ -DPACKAGE_NAME=\"libprocess\" -DPACKAGE_TARNAME=\"libprocess\" -DPACKAGE_VERSION=\"0.0.1\" -DPACKAGE_STRING=\"libprocess\ 0.0.1\" -DPACKAGE_BUGREPORT=\"\" -DPACKAGE_URL=\"\" -DPACKAGE=\"libprocess\" -DVERSION=\"0.0.1\" -DSTDC_HEADERS=1 -DHAVE_SYS_TYPES_H=1 -DHAVE_SYS_STAT_H=1 -DHAVE_STDLIB_H=1 -DHAVE_STRING_H=1 -DHAVE_MEMORY_H=1 -DHAVE_STRINGS_H=1 -DHAVE_INTTYPES_H=1 -DHAVE_STDINT_H=1 -DHAVE_UNISTD_H=1 -DHAVE_DLFCN_H=1 -DLT_OBJDIR=\".libs/\" -DHAVE_PTHREAD=1 -DHAVE_LIBZ=1 -I. -I../../../../3rdparty/libprocess/3rdparty  -I../../../../3rdparty/libprocess/3rdparty/stout/include -Iglog-0.3.3/src -Igmock-1.6.0/gtest/include -Igmock-1.6.0/include -Iprotobuf-2.5.0/src  -Iboost-1.53.0 -Ipicojson-4f93734 -Iparser/include  -g -g2 -O2 -Wno-unused-local-typedefs -std=c++11 -MT stout_tests-option_tests.o -MD -MP -MF .deps/stout_tests-option_tests.Tpo -c -o stout_tests-option_tests.o `test -f 'stout/tests/option_tests.cpp' || echo '../../../../3rdparty/libprocess/3rdparty/'`stout/tests/option_tests.cpp
mv -f .deps/stout_tests-option_tests.Tpo .deps/stout_tests-option_tests.Po
g++ -DPACKAGE_NAME=\"libprocess\" -DPACKAGE_TARNAME=\"libprocess\" -DPACKAGE_VERSION=\"0.0.1\" -DPACKAGE_STRING=\"libprocess\ 0.0.1\" -DPACKAGE_BUGREPORT=\"\" -DPACKAGE_URL=\"\" -DPACKAGE=\"libprocess\" -DVERSION=\"0.0.1\" -DSTDC_HEADERS=1 -DHAVE_SYS_TYPES_H=1 -DHAVE_SYS_STAT_H=1 -DHAVE_STDLIB_H=1 -DHAVE_STRING_H=1 -DHAVE_MEMORY_H=1 -DHAVE_STRINGS_H=1 -DHAVE_INTTYPES_H=1 -DHAVE_STDINT_H=1 -DHAVE_UNISTD_H=1 -DHAVE_DLFCN_H=1 -DLT_OBJDIR=\".libs/\" -DHAVE_PTHREAD=1 -DHAVE_LIBZ=1 -I. -I../../../../3rdparty/libprocess/3rdparty  -I../../../../3rdparty/libprocess/3rdparty/stout/include -Iglog-0.3.3/src -Igmock-1.6.0/gtest/include -Igmock-1.6.0/include -Iprotobuf-2.5.0/src  -Iboost-1.53.0 -Ipicojson-4f93734 -Iparser/include  -g -g2 -O2 -Wno-unused-local-typedefs -std=c++11 -MT stout_tests-os_tests.o -MD -MP -MF .deps/stout_tests-os_tests.Tpo -c -o stout_tests-os_tests.o `test -f 'stout/tests/os_tests.cpp' || echo '../../../../3rdparty/libprocess/3rdparty/'`stout/tests/os_tests.cpp
mv -f .deps/stout_tests-os_tests.Tpo .deps/stout_tests-os_tests.Po
g++ -DPACKAGE_NAME=\"libprocess\" -DPACKAGE_TARNAME=\"libprocess\" -DPACKAGE_VERSION=\"0.0.1\" -DPACKAGE_STRING=\"libprocess\ 0.0.1\" -DPACKAGE_BUGREPORT=\"\" -DPACKAGE_URL=\"\" -DPACKAGE=\"libprocess\" -DVERSION=\"0.0.1\" -DSTDC_HEADERS=1 -DHAVE_SYS_TYPES_H=1 -DHAVE_SYS_STAT_H=1 -DHAVE_STDLIB_H=1 -DHAVE_STRING_H=1 -DHAVE_MEMORY_H=1 -DHAVE_STRINGS_H=1 -DHAVE_INTTYPES_H=1 -DHAVE_STDINT_H=1 -DHAVE_UNISTD_H=1 -DHAVE_DLFCN_H=1 -DLT_OBJDIR=\".libs/\" -DHAVE_PTHREAD=1 -DHAVE_LIBZ=1 -I. -I../../../../3rdparty/libprocess/3rdparty  -I../../../../3rdparty/libprocess/3rdparty/stout/include -Iglog-0.3.3/src -Igmock-1.6.0/gtest/include -Igmock-1.6.0/include -Iprotobuf-2.5.0/src  -Iboost-1.53.0 -Ipicojson-4f93734 -Iparser/include  -g -g2 -O2 -Wno-unused-local-typedefs -std=c++11 -MT stout_tests-protobuf_tests.o -MD -MP -MF .deps/stout_tests-protobuf_tests.Tpo -c -o stout_tests-protobuf_tests.o `test -f 'stout/tests/protobuf_tests.cpp' || echo '../../../../3rdparty/libprocess/3rdparty/'`stout/tests/protobuf_tests.cpp
mv -f .deps/stout_tests-protobuf_tests.Tpo .deps/stout_tests-protobuf_tests.Po
g++ -DPACKAGE_NAME=\"libprocess\" -DPACKAGE_TARNAME=\"libprocess\" -DPACKAGE_VERSION=\"0.0.1\" -DPACKAGE_STRING=\"libprocess\ 0.0.1\" -DPACKAGE_BUGREPORT=\"\" -DPACKAGE_URL=\"\" -DPACKAGE=\"libprocess\" -DVERSION=\"0.0.1\" -DSTDC_HEADERS=1 -DHAVE_SYS_TYPES_H=1 -DHAVE_SYS_STAT_H=1 -DHAVE_STDLIB_H=1 -DHAVE_STRING_H=1 -DHAVE_MEMORY_H=1 -DHAVE_STRINGS_H=1 -DHAVE_INTTYPES_H=1 -DHAVE_STDINT_H=1 -DHAVE_UNISTD_H=1 -DHAVE_DLFCN_H=1 -DLT_OBJDIR=\".libs/\" -DHAVE_PTHREAD=1 -DHAVE_LIBZ=1 -I. -I../../../../3rdparty/libprocess/3rdparty  -I../../../../3rdparty/libprocess/3rdparty/stout/include -Iglog-0.3.3/src -Igmock-1.6.0/gtest/include -Igmock-1.6.0/include -Iprotobuf-2.5.0/src  -Iboost-1.53.0 -Ipicojson-4f93734 -Iparser/include  -g -g2 -O2 -Wno-unused-local-typedefs -std=c++11 -MT stout_tests-protobuf_tests.pb.o -MD -MP -MF .deps/stout_tests-protobuf_tests.pb.Tpo -c -o stout_tests-protobuf_tests.pb.o `test -f 'stout/tests/protobuf_tests.pb.cc' || echo '../../../../3rdparty/libprocess/3rdparty/'`stout/tests/protobuf_tests.pb.cc
mv -f .deps/stout_tests-protobuf_tests.pb.Tpo .deps/stout_tests-protobuf_tests.pb.Po
g++ -DPACKAGE_NAME=\"libprocess\" -DPACKAGE_TARNAME=\"libprocess\" -DPACKAGE_VERSION=\"0.0.1\" -DPACKAGE_STRING=\"libprocess\ 0.0.1\" -DPACKAGE_BUGREPORT=\"\" -DPACKAGE_URL=\"\" -DPACKAGE=\"libprocess\" -DVERSION=\"0.0.1\" -DSTDC_HEADERS=1 -DHAVE_SYS_TYPES_H=1 -DHAVE_SYS_STAT_H=1 -DHAVE_STDLIB_H=1 -DHAVE_STRING_H=1 -DHAVE_MEMORY_H=1 -DHAVE_STRINGS_H=1 -DHAVE_INTTYPES_H=1 -DHAVE_STDINT_H=1 -DHAVE_UNISTD_H=1 -DHAVE_DLFCN_H=1 -DLT_OBJDIR=\".libs/\" -DHAVE_PTHREAD=1 -DHAVE_LIBZ=1 -I. -I../../../../3rdparty/libprocess/3rdparty  -I../../../../3rdparty/libprocess/3rdparty/stout/include -Iglog-0.3.3/src -Igmock-1.6.0/gtest/include -Igmock-1.6.0/include -Iprotobuf-2.5.0/src  -Iboost-1.53.0 -Ipicojson-4f93734 -Iparser/include  -g -g2 -O2 -Wno-unused-local-typedefs -std=c++11 -MT stout_tests-sendfile_tests.o -MD -MP -MF .deps/stout_tests-sendfile_tests.Tpo -c -o stout_tests-sendfile_tests.o `test -f 'stout/tests/os/sendfile_tests.cpp' || echo '../../../../3rdparty/libprocess/3rdparty/'`stout/tests/os/sendfile_tests.cpp
mv -f .deps/stout_tests-sendfile_tests.Tpo .deps/stout_tests-sendfile_tests.Po
g++ -DPACKAGE_NAME=\"libprocess\" -DPACKAGE_TARNAME=\"libprocess\" -DPACKAGE_VERSION=\"0.0.1\" -DPACKAGE_STRING=\"libprocess\ 0.0.1\" -DPACKAGE_BUGREPORT=\"\" -DPACKAGE_URL=\"\" -DPACKAGE=\"libprocess\" -DVERSION=\"0.0.1\" -DSTDC_HEADERS=1 -DHAVE_SYS_TYPES_H=1 -DHAVE_SYS_STAT_H=1 -DHAVE_STDLIB_H=1 -DHAVE_STRING_H=1 -DHAVE_MEMORY_H=1 -DHAVE_STRINGS_H=1 -DHAVE_INTTYPES_H=1 -DHAVE_STDINT_H=1 -DHAVE_UNISTD_H=1 -DHAVE_DLFCN_H=1 -DLT_OBJDIR=\".libs/\" -DHAVE_PTHREAD=1 -DHAVE_LIBZ=1 -I. -I../../../../3rdparty/libprocess/3rdparty  -I../../../../3rdparty/libprocess/3rdparty/stout/include -Iglog-0.3.3/src -Igmock-1.6.0/gtest/include -Igmock-1.6.0/include -Iprotobuf-2.5.0/src  -Iboost-1.53.0 -Ipicojson-4f93734 -Iparser/include  -g -g2 -O2 -Wno-unused-local-typedefs -std=c++11 -MT stout_tests-signals_tests.o -MD -MP -MF .deps/stout_tests-signals_tests.Tpo -c -o stout_tests-signals_tests.o `test -f 'stout/tests/os/signals_tests.cpp' || echo '../../../../3rdparty/libprocess/3rdparty/'`stout/tests/os/signals_tests.cpp
mv -f .deps/stout_tests-signals_tests.Tpo .deps/stout_tests-signals_tests.Po
g++ -DPACKAGE_NAME=\"libprocess\" -DPACKAGE_TARNAME=\"libprocess\" -DPACKAGE_VERSION=\"0.0.1\" -DPACKAGE_STRING=\"libprocess\ 0.0.1\" -DPACKAGE_BUGREPORT=\"\" -DPACKAGE_URL=\"\" -DPACKAGE=\"libprocess\" -DVERSION=\"0.0.1\" -DSTDC_HEADERS=1 -DHAVE_SYS_TYPES_H=1 -DHAVE_SYS_STAT_H=1 -DHAVE_STDLIB_H=1 -DHAVE_STRING_H=1 -DHAVE_MEMORY_H=1 -DHAVE_STRINGS_H=1 -DHAVE_INTTYPES_H=1 -DHAVE_STDINT_H=1 -DHAVE_UNISTD_H=1 -DHAVE_DLFCN_H=1 -DLT_OBJDIR=\".libs/\" -DHAVE_PTHREAD=1 -DHAVE_LIBZ=1 -I. -I../../../../3rdparty/libprocess/3rdparty  -I../../../../3rdparty/libprocess/3rdparty/stout/include -Iglog-0.3.3/src -Igmock-1.6.0/gtest/include -Igmock-1.6.0/include -Iprotobuf-2.5.0/src  -Iboost-1.53.0 -Ipicojson-4f93734 -Iparser/include  -g -g2 -O2 -Wno-unused-local-typedefs -std=c++11 -MT stout_tests-set_tests.o -MD -MP -MF .deps/stout_tests-set_tests.Tpo -c -o stout_tests-set_tests.o `test -f 'stout/tests/set_tests.cpp' || echo '../../../../3rdparty/libprocess/3rdparty/'`stout/tests/set_tests.cpp
mv -f .deps/stout_tests-set_tests.Tpo .deps/stout_tests-set_tests.Po
g++ -DPACKAGE_NAME=\"libprocess\" -DPACKAGE_TARNAME=\"libprocess\" -DPACKAGE_VERSION=\"0.0.1\" -DPACKAGE_STRING=\"libprocess\ 0.0.1\" -DPACKAGE_BUGREPORT=\"\" -DPACKAGE_URL=\"\" -DPACKAGE=\"libprocess\" -DVERSION=\"0.0.1\" -DSTDC_HEADERS=1 -DHAVE_SYS_TYPES_H=1 -DHAVE_SYS_STAT_H=1 -DHAVE_STDLIB_H=1 -DHAVE_STRING_H=1 -DHAVE_MEMORY_H=1 -DHAVE_STRINGS_H=1 -DHAVE_INTTYPES_H=1 -DHAVE_STDINT_H=1 -DHAVE_UNISTD_H=1 -DHAVE_DLFCN_H=1 -DLT_OBJDIR=\".libs/\" -DHAVE_PTHREAD=1 -DHAVE_LIBZ=1 -I. -I../../../../3rdparty/libprocess/3rdparty  -I../../../../3rdparty/libprocess/3rdparty/stout/include -Iglog-0.3.3/src -Igmock-1.6.0/gtest/include -Igmock-1.6.0/include -Iprotobuf-2.5.0/src  -Iboost-1.53.0 -Ipicojson-4f93734 -Iparser/include  -g -g2 -O2 -Wno-unused-local-typedefs -std=c++11 -MT stout_tests-some_tests.o -MD -MP -MF .deps/stout_tests-some_tests.Tpo -c -o stout_tests-some_tests.o `test -f 'stout/tests/some_tests.cpp' || echo '../../../../3rdparty/libprocess/3rdparty/'`stout/tests/some_tests.cpp
mv -f .deps/stout_tests-some_tests.Tpo .deps/stout_tests-some_tests.Po
g++ -DPACKAGE_NAME=\"libprocess\" -DPACKAGE_TARNAME=\"libprocess\" -DPACKAGE_VERSION=\"0.0.1\" -DPACKAGE_STRING=\"libprocess\ 0.0.1\" -DPACKAGE_BUGREPORT=\"\" -DPACKAGE_URL=\"\" -DPACKAGE=\"libprocess\" -DVERSION=\"0.0.1\" -DSTDC_HEADERS=1 -DHAVE_SYS_TYPES_H=1 -DHAVE_SYS_STAT_H=1 -DHAVE_STDLIB_H=1 -DHAVE_STRING_H=1 -DHAVE_MEMORY_H=1 -DHAVE_STRINGS_H=1 -DHAVE_INTTYPES_H=1 -DHAVE_STDINT_H=1 -DHAVE_UNISTD_H=1 -DHAVE_DLFCN_H=1 -DLT_OBJDIR=\".libs/\" -DHAVE_PTHREAD=1 -DHAVE_LIBZ=1 -I. -I../../../../3rdparty/libprocess/3rdparty  -I../../../../3rdparty/libprocess/3rdparty/stout/include -Iglog-0.3.3/src -Igmock-1.6.0/gtest/include -Igmock-1.6.0/include -Iprotobuf-2.5.0/src  -Iboost-1.53.0 -Ipicojson-4f93734 -Iparser/include  -g -g2 -O2 -Wno-unused-local-typedefs -std=c++11 -MT stout_tests-strings_tests.o -MD -MP -MF .deps/stout_tests-strings_tests.Tpo -c -o stout_tests-strings_tests.o `test -f 'stout/tests/strings_tests.cpp' || echo '../../../../3rdparty/libprocess/3rdparty/'`stout/tests/strings_tests.cpp
mv -f .deps/stout_tests-strings_tests.Tpo .deps/stout_tests-strings_tests.Po
g++ -DPACKAGE_NAME=\"libprocess\" -DPACKAGE_TARNAME=\"libprocess\" -DPACKAGE_VERSION=\"0.0.1\" -DPACKAGE_STRING=\"libprocess\ 0.0.1\" -DPACKAGE_BUGREPORT=\"\" -DPACKAGE_URL=\"\" -DPACKAGE=\"libprocess\" -DVERSION=\"0.0.1\" -DSTDC_HEADERS=1 -DHAVE_SYS_TYPES_H=1 -DHAVE_SYS_STAT_H=1 -DHAVE_STDLIB_H=1 -DHAVE_STRING_H=1 -DHAVE_MEMORY_H=1 -DHAVE_STRINGS_H=1 -DHAVE_INTTYPES_H=1 -DHAVE_STDINT_H=1 -DHAVE_UNISTD_H=1 -DHAVE_DLFCN_H=1 -DLT_OBJDIR=\".libs/\" -DHAVE_PTHREAD=1 -DHAVE_LIBZ=1 -I. -I../../../../3rdparty/libprocess/3rdparty  -I../../../../3rdparty/libprocess/3rdparty/stout/include -Iglog-0.3.3/src -Igmock-1.6.0/gtest/include -Igmock-1.6.0/include -Iprotobuf-2.5.0/src  -Iboost-1.53.0 -Ipicojson-4f93734 -Iparser/include  -g -g2 -O2 -Wno-unused-local-typedefs -std=c++11 -MT stout_tests-subcommand_tests.o -MD -MP -MF .deps/stout_tests-subcommand_tests.Tpo -c -o stout_tests-subcommand_tests.o `test -f 'stout/tests/subcommand_tests.cpp' || echo '../../../../3rdparty/libprocess/3rdparty/'`stout/tests/subcommand_tests.cpp
mv -f .deps/stout_tests-subcommand_tests.Tpo .deps/stout_tests-subcommand_tests.Po
g++ -DPACKAGE_NAME=\"libprocess\" -DPACKAGE_TARNAME=\"libprocess\" -DPACKAGE_VERSION=\"0.0.1\" -DPACKAGE_STRING=\"libprocess\ 0.0.1\" -DPACKAGE_BUGREPORT=\"\" -DPACKAGE_URL=\"\" -DPACKAGE=\"libprocess\" -DVERSION=\"0.0.1\" -DSTDC_HEADERS=1 -DHAVE_SYS_TYPES_H=1 -DHAVE_SYS_STAT_H=1 -DHAVE_STDLIB_H=1 -DHAVE_STRING_H=1 -DHAVE_MEMORY_H=1 -DHAVE_STRINGS_H=1 -DHAVE_INTTYPES_H=1 -DHAVE_STDINT_H=1 -DHAVE_UNISTD_H=1 -DHAVE_DLFCN_H=1 -DLT_OBJDIR=\".libs/\" -DHAVE_PTHREAD=1 -DHAVE_LIBZ=1 -I. -I../../../../3rdparty/libprocess/3rdparty  -I../../../../3rdparty/libprocess/3rdparty/stout/include -Iglog-0.3.3/src -Igmock-1.6.0/gtest/include -Igmock-1.6.0/include -Iprotobuf-2.5.0/src  -Iboost-1.53.0 -Ipicojson-4f93734 -Iparser/include  -g -g2 -O2 -Wno-unused-local-typedefs -std=c++11 -MT stout_tests-thread_tests.o -MD -MP -MF .deps/stout_tests-thread_tests.Tpo -c -o stout_tests-thread_tests.o `test -f 'stout/tests/thread_tests.cpp' || echo '../../../../3rdparty/libprocess/3rdparty/'`stout/tests/thread_tests.cpp
mv -f .deps/stout_tests-thread_tests.Tpo .deps/stout_tests-thread_tests.Po
g++ -DPACKAGE_NAME=\"libprocess\" -DPACKAGE_TARNAME=\"libprocess\" -DPACKAGE_VERSION=\"0.0.1\" -DPACKAGE_STRING=\"libprocess\ 0.0.1\" -DPACKAGE_BUGREPORT=\"\" -DPACKAGE_URL=\"\" -DPACKAGE=\"libprocess\" -DVERSION=\"0.0.1\" -DSTDC_HEADERS=1 -DHAVE_SYS_TYPES_H=1 -DHAVE_SYS_STAT_H=1 -DHAVE_STDLIB_H=1 -DHAVE_STRING_H=1 -DHAVE_MEMORY_H=1 -DHAVE_STRINGS_H=1 -DHAVE_INTTYPES_H=1 -DHAVE_STDINT_H=1 -DHAVE_UNISTD_H=1 -DHAVE_DLFCN_H=1 -DLT_OBJDIR=\".libs/\" -DHAVE_PTHREAD=1 -DHAVE_LIBZ=1 -I. -I../../../../3rdparty/libprocess/3rdparty  -I../../../../3rdparty/libprocess/3rdparty/stout/include -Iglog-0.3.3/src -Igmock-1.6.0/gtest/include -Igmock-1.6.0/include -Iprotobuf-2.5.0/src  -Iboost-1.53.0 -Ipicojson-4f93734 -Iparser/include  -g -g2 -O2 -Wno-unused-local-typedefs -std=c++11 -MT stout_tests-uuid_tests.o -MD -MP -MF .deps/stout_tests-uuid_tests.Tpo -c -o stout_tests-uuid_tests.o `test -f 'stout/tests/uuid_tests.cpp' || echo '../../../../3rdparty/libprocess/3rdparty/'`stout/tests/uuid_tests.cpp
mv -f .deps/stout_tests-uuid_tests.Tpo .deps/stout_tests-uuid_tests.Po
g++ -DPACKAGE_NAME=\"libprocess\" -DPACKAGE_TARNAME=\"libprocess\" -DPACKAGE_VERSION=\"0.0.1\" -DPACKAGE_STRING=\"libprocess\ 0.0.1\" -DPACKAGE_BUGREPORT=\"\" -DPACKAGE_URL=\"\" -DPACKAGE=\"libprocess\" -DVERSION=\"0.0.1\" -DSTDC_HEADERS=1 -DHAVE_SYS_TYPES_H=1 -DHAVE_SYS_STAT_H=1 -DHAVE_STDLIB_H=1 -DHAVE_STRING_H=1 -DHAVE_MEMORY_H=1 -DHAVE_STRINGS_H=1 -DHAVE_INTTYPES_H=1 -DHAVE_STDINT_H=1 -DHAVE_UNISTD_H=1 -DHAVE_DLFCN_H=1 -DLT_OBJDIR=\".libs/\" -DHAVE_PTHREAD=1 -DHAVE_LIBZ=1 -I. -I../../../../3rdparty/libprocess/3rdparty  -I../../../../3rdparty/libprocess/3rdparty/stout/include -Iglog-0.3.3/src -Igmock-1.6.0/gtest/include -Igmock-1.6.0/include -Iprotobuf-2.5.0/src  -Iboost-1.53.0 -Ipicojson-4f93734 -Iparser/include  -g -g2 -O2 -Wno-unused-local-typedefs -std=c++11 -MT stout_tests-proc_tests.o -MD -MP -MF .deps/stout_tests-proc_tests.Tpo -c -o stout_tests-proc_tests.o `test -f 'stout/tests/proc_tests.cpp' || echo '../../../../3rdparty/libprocess/3rdparty/'`stout/tests/proc_tests.cpp
mv -f .deps/stout_tests-proc_tests.Tpo .deps/stout_tests-proc_tests.Po
g++ -DPACKAGE_NAME=\"libprocess\" -DPACKAGE_TARNAME=\"libprocess\" -DPACKAGE_VERSION=\"0.0.1\" -DPACKAGE_STRING=\"libprocess\ 0.0.1\" -DPACKAGE_BUGREPORT=\"\" -DPACKAGE_URL=\"\" -DPACKAGE=\"libprocess\" -DVERSION=\"0.0.1\" -DSTDC_HEADERS=1 -DHAVE_SYS_TYPES_H=1 -DHAVE_SYS_STAT_H=1 -DHAVE_STDLIB_H=1 -DHAVE_STRING_H=1 -DHAVE_MEMORY_H=1 -DHAVE_STRINGS_H=1 -DHAVE_INTTYPES_H=1 -DHAVE_STDINT_H=1 -DHAVE_UNISTD_H=1 -DHAVE_DLFCN_H=1 -DLT_OBJDIR=\".libs/\" -DHAVE_PTHREAD=1 -DHAVE_LIBZ=1 -I. -I../../../../3rdparty/libprocess/3rdparty  -I../../../../3rdparty/libprocess/3rdparty/stout/include -Iglog-0.3.3/src -Igmock-1.6.0/gtest/include -Igmock-1.6.0/include -Iprotobuf-2.5.0/src  -Iboost-1.53.0 -Ipicojson-4f93734 -Iparser/include  -g -g2 -O2 -Wno-unused-local-typedefs -std=c++11 -MT stout_tests-setns_tests.o -MD -MP -MF .deps/stout_tests-setns_tests.Tpo -c -o stout_tests-setns_tests.o `test -f 'stout/tests/os/setns_tests.cpp' || echo '../../../../3rdparty/libprocess/3rdparty/'`stout/tests/os/setns_tests.cpp
mv -f .deps/stout_tests-setns_tests.Tpo .deps/stout_tests-setns_tests.Po
/bin/bash ../libtool  --tag=CXX   --mode=link g++  -g -g2 -O2 -Wno-unused-local-typedefs -std=c++11   -o stout-tests stout_tests-base64_tests.o stout_tests-bytes_tests.o stout_tests-cache_tests.o stout_tests-duration_tests.o stout_tests-dynamiclibrary_tests.o stout_tests-error_tests.o stout_tests-flags_tests.o stout_tests-gzip_tests.o stout_tests-hashmap_tests.o stout_tests-hashset_tests.o stout_tests-interval_tests.o stout_tests-json_tests.o stout_tests-linkedhashmap_tests.o stout_tests-main.o stout_tests-multimap_tests.o stout_tests-net_tests.o stout_tests-none_tests.o stout_tests-option_tests.o stout_tests-os_tests.o stout_tests-protobuf_tests.o stout_tests-protobuf_tests.pb.o stout_tests-sendfile_tests.o stout_tests-signals_tests.o stout_tests-set_tests.o stout_tests-some_tests.o stout_tests-strings_tests.o stout_tests-subcommand_tests.o stout_tests-thread_tests.o stout_tests-uuid_tests.o stout_tests-proc_tests.o stout_tests-setns_tests.o libgmock.la glog-0.3.3/libglog.la protobuf-2.5.0/src/libprotobuf.la -ldl -lz  -lrt
libtool: link: g++ -g -g2 -O2 -Wno-unused-local-typedefs -std=c++11 -o stout-tests stout_tests-base64_tests.o stout_tests-bytes_tests.o stout_tests-cache_tests.o stout_tests-duration_tests.o stout_tests-dynamiclibrary_tests.o stout_tests-error_tests.o stout_tests-flags_tests.o stout_tests-gzip_tests.o stout_tests-hashmap_tests.o stout_tests-hashset_tests.o stout_tests-interval_tests.o stout_tests-json_tests.o stout_tests-linkedhashmap_tests.o stout_tests-main.o stout_tests-multimap_tests.o stout_tests-net_tests.o stout_tests-none_tests.o stout_tests-option_tests.o stout_tests-os_tests.o stout_tests-protobuf_tests.o stout_tests-protobuf_tests.pb.o stout_tests-sendfile_tests.o stout_tests-signals_tests.o stout_tests-set_tests.o stout_tests-some_tests.o stout_tests-strings_tests.o stout_tests-subcommand_tests.o stout_tests-thread_tests.o stout_tests-uuid_tests.o stout_tests-proc_tests.o stout_tests-setns_tests.o  ./.libs/libgmock.a glog-0.3.3/.libs/libglog.a protobuf-2.5.0/src/.libs/libprotobuf.a -lpthread -ldl -lz -lrt -pthread
make[8]: Leaving directory `<https://builds.apache.org/job/Mesos-Trunk-Ubuntu-Build-Out-Of-Src-Set-JAVA_HOME/ws/build/mesos-0.20.0/_build/3rdparty/libprocess/3rdparty'>
make  check-local
make[8]: Entering directory `<https://builds.apache.org/job/Mesos-Trunk-Ubuntu-Build-Out-Of-Src-Set-JAVA_HOME/ws/build/mesos-0.20.0/_build/3rdparty/libprocess/3rdparty'>
./stout-tests
Note: Randomizing tests' orders with a seed of 476 .
[==========] Running 145 tests from 29 test cases.
[----------] Global test environment set-up.
[----------] 4 tests from DurationTest
[ RUN      ] DurationTest.Arithmetic
[       OK ] DurationTest.Arithmetic (0 ms)
[ RUN      ] DurationTest.ParseAndTry
[       OK ] DurationTest.ParseAndTry (11 ms)
[ RUN      ] DurationTest.Comparison
[       OK ] DurationTest.Comparison (0 ms)
[ RUN      ] DurationTest.OutputFormat
[       OK ] DurationTest.OutputFormat (0 ms)
[----------] 4 tests from DurationTest (11 ms total)

[----------] 1 test from OsSendfileTest
[ RUN      ] OsSendfileTest.sendfile
[       OK ] OsSendfileTest.sendfile (0 ms)
[----------] 1 test from OsSendfileTest (0 ms total)

[----------] 6 tests from MultimapTest/1, where TypeParam = multihashmap<std::string, unsigned short>
[ RUN      ] MultimapTest/1.Remove
[       OK ] MultimapTest/1.Remove (0 ms)
[ RUN      ] MultimapTest/1.Foreach
[       OK ] MultimapTest/1.Foreach (0 ms)
[ RUN      ] MultimapTest/1.Size
[       OK ] MultimapTest/1.Size (0 ms)
[ RUN      ] MultimapTest/1.Put
[       OK ] MultimapTest/1.Put (0 ms)
[ RUN      ] MultimapTest/1.Keys
[       OK ] MultimapTest/1.Keys (0 ms)
[ RUN      ] MultimapTest/1.Iterator
[       OK ] MultimapTest/1.Iterator (0 ms)
[----------] 6 tests from MultimapTest/1 (0 ms total)

[----------] 1 test from ErrorTest
[ RUN      ] ErrorTest.Test
[       OK ] ErrorTest.Test (0 ms)
[----------] 1 test from ErrorTest (0 ms total)

[----------] 1 test from Thread
[ RUN      ] Thread.local
[       OK ] Thread.local (0 ms)
[----------] 1 test from Thread (0 ms total)

[----------] 1 test from NoneTest
[ RUN      ] NoneTest.Test
[       OK ] NoneTest.Test (0 ms)
[----------] 1 test from NoneTest (0 ms total)

[----------] 3 tests from Stout
[ RUN      ] Stout.Some
[       OK ] Stout.Some (0 ms)
[ RUN      ] Stout.Set
[       OK ] Stout.Set (1 ms)
[ RUN      ] Stout.Bytes
[       OK ] Stout.Bytes (0 ms)
[----------] 3 tests from Stout (1 ms total)

[----------] 20 tests from OsTest
[ RUN      ] OsTest.bootId
[       OK ] OsTest.bootId (0 ms)
[ RUN      ] OsTest.processes
Build timed out (after 180 minutes). Marking the build as failed.
Build was aborted
make[4]: *** [check-recursive] Terminated
make[3]: *** [check-recursive] Terminated
make[1]: make[6]: *** [check-recursive] Terminated
*** [check-recursive] Terminated
make[2]: *** [check] Terminated
make[5]: *** [check] Terminated
make: *** [distcheck] Terminated

Mime
View raw message