mesos-dev mailing list archives

Site index · List index
Message view « Date » · « Thread »
Top « Date » · « Thread »
From Apache Jenkins Server <jenk...@builds.apache.org>
Subject Build failed in Jenkins: mesos-reviewbot #847
Date Mon, 09 Jun 2014 06:50:16 GMT
See <https://builds.apache.org/job/mesos-reviewbot/847/>

------------------------------------------
[...truncated 4586 lines...]
Removing 3rdparty/libprocess/config.sub
Removing 3rdparty/libprocess/configure
Removing 3rdparty/libprocess/depcomp
Removing 3rdparty/libprocess/libtool
Removing 3rdparty/libprocess/ltmain.sh
Removing 3rdparty/libprocess/m4/libtool.m4
Removing 3rdparty/libprocess/m4/ltoptions.m4
Removing 3rdparty/libprocess/m4/ltsugar.m4
Removing 3rdparty/libprocess/m4/ltversion.m4
Removing 3rdparty/libprocess/m4/lt~obsolete.m4
Removing 3rdparty/libprocess/missing
Removing Makefile
Removing Makefile.in
Removing aclocal.m4
Removing ar-lib
Removing autom4te.cache/
Removing bin/gdb-mesos-local.sh
Removing bin/gdb-mesos-master.sh
Removing bin/gdb-mesos-slave.sh
Removing bin/gdb-mesos-tests.sh
Removing bin/lldb-mesos-local.sh
Removing bin/lldb-mesos-master.sh
Removing bin/lldb-mesos-slave.sh
Removing bin/lldb-mesos-tests.sh
Removing bin/mesos-local-flags.sh
Removing bin/mesos-local.sh
Removing bin/mesos-master-flags.sh
Removing bin/mesos-master.sh
Removing bin/mesos-slave-flags.sh
Removing bin/mesos-slave.sh
Removing bin/mesos-tests-flags.sh
Removing bin/mesos-tests.sh
Removing bin/mesos.sh
Removing bin/valgrind-mesos-local.sh
Removing bin/valgrind-mesos-master.sh
Removing bin/valgrind-mesos-slave.sh
Removing bin/valgrind-mesos-tests.sh
Removing config.guess
Removing config.log
Removing config.lt
Removing config.status
Removing config.sub
Removing configure
Removing depcomp
Removing ec2/Makefile
Removing ec2/Makefile.in
Removing include/mesos/mesos.hpp
Removing install-sh
Removing libtool
Removing ltmain.sh
Removing m4/libtool.m4
Removing m4/ltoptions.m4
Removing m4/ltsugar.m4
Removing m4/ltversion.m4
Removing m4/lt~obsolete.m4
Removing mesos-0.20.0.tar.gz
Removing mesos.pc
Removing missing
Removing mpi/mpiexec-mesos
Removing src/.deps/
Removing src/Makefile
Removing src/Makefile.in
Removing src/cli/.deps/
Removing src/common/.deps/
Removing src/containerizer/
Removing src/deploy/mesos-daemon.sh
Removing src/deploy/mesos-start-cluster.sh
Removing src/deploy/mesos-start-masters.sh
Removing src/deploy/mesos-start-slaves.sh
Removing src/deploy/mesos-stop-cluster.sh
Removing src/deploy/mesos-stop-masters.sh
Removing src/deploy/mesos-stop-slaves.sh
Removing src/examples/.deps/
Removing src/examples/java/test-exception-framework
Removing src/examples/java/test-executor
Removing src/examples/java/test-framework
Removing src/examples/java/test-log
Removing src/examples/java/test-multiple-executors-framework
Removing src/examples/python/test-containerizer
Removing src/examples/python/test-executor
Removing src/examples/python/test-framework
Removing src/exec/.deps/
Removing src/files/.deps/
Removing src/java/generated/org/apache/mesos/MesosNativeLibrary.java
Removing src/java/jni/.deps/
Removing src/java/mesos.pom
Removing src/jvm/.deps/
Removing src/jvm/org/apache/.deps/
Removing src/launcher/.deps/
Removing src/linux/.deps/
Removing src/linux/routing/.deps/
Removing src/linux/routing/filter/.deps/
Removing src/linux/routing/link/.deps/
Removing src/linux/routing/queueing/.deps/
Removing src/local/.deps/
Removing src/log/.deps/
Removing src/log/tool/.deps/
Removing src/logging/.deps/
Removing src/master/.deps/
Removing src/messages/.deps/
Removing src/python/setup.py
Removing src/sasl/.deps/
Removing src/sched/.deps/
Removing src/scheduler/.deps/
Removing src/slave/.deps/
Removing src/slave/containerizer/.deps/
Removing src/slave/containerizer/isolators/cgroups/.deps/
Removing src/state/.deps/
Removing src/tests/.deps/
Removing src/usage/.deps/
Removing src/zookeeper/.deps/
+ git reset --hard HEAD
HEAD is now at 5172630 Added "implicit" reconciliation.
+ date
Mon Jun  9 06:37:50 UTC 2014
+ ./support/verify-reviews.py mesos-review mesos-review42 1
Checking if review: 22253 needs verification
Latest diff timestamp: 2014-06-04 23:24:17
Latest review timestamp: 2014-06-06 03:43:46
Checking if review: 21499 needs verification
Latest diff timestamp: 2014-05-15 20:37:27
Latest review timestamp: 2014-06-06 21:18:02
Checking if review: 22222 needs verification
Latest diff timestamp: 2014-06-03 23:02:00
Latest review timestamp: 2014-06-05 16:28:11
Checking if review: 22223 needs verification
Latest diff timestamp: 2014-06-05 23:11:40
Latest review timestamp: 2014-06-06 23:11:17
Checking if review: 22338 needs verification
Skipping blocking review 22338
Checking if review: 22151 needs verification
Skipping blocking review 22151
Checking if review: 22149 needs verification
Skipping blocking review 22149
Checking if review: 22284 needs verification
Latest diff timestamp: 2014-06-06 00:11:36
Latest review timestamp: 2014-06-07 19:09:49
Latest dependency change timestamp: 2014-06-06 00:12:54
Checking if review: 22313 needs verification
Latest diff timestamp: 2014-06-06 21:31:12
Latest review timestamp: 2014-06-08 08:28:47
Checking if review: 22333 needs verification
Latest diff timestamp: 2014-06-06 22:55:08
Latest review timestamp: 2014-06-08 08:48:17
Checking if review: 22315 needs verification
Latest diff timestamp: 2014-06-06 19:33:50
Latest review timestamp: 2014-06-08 09:08:03
Checking if review: 22316 needs verification
Latest diff timestamp: 2014-06-06 20:10:40
Latest review timestamp: 2014-06-08 11:06:20
Checking if review: 22353 needs verification
Latest diff timestamp: 2014-06-08 04:29:20
Latest review timestamp: 2014-06-08 11:52:23
Checking if review: 21379 needs verification
Latest diff timestamp: 2014-06-08 10:40:51
Latest review timestamp: 2014-06-08 19:24:36
Checking if review: 21734 needs verification
Latest diff timestamp: 2014-06-08 17:19:43
Latest review timestamp: 2014-06-08 19:49:54
Checking if review: 20137 needs verification
Skipping blocking review 20137
Checking if review: 20817 needs verification
Latest diff timestamp: 2014-06-09 04:15:36
Latest review timestamp: 2014-05-31 15:22:47
Verifying review 20817
Applying review 20817
wget --no-check-certificate -O 20817.patch https://reviews.apache.org/r/20817/diff/raw/
git apply --index 20817.patch
./support/mesos-style.py
./bootstrap
./configure
make -j3 distcheck GTEST_FILTER='' >/dev/null
Posting review: Bad patch!

Reviews applied: [20817]

Failed command: make -j3 distcheck GTEST_FILTER='' >/dev/null

Error:
 configure: WARNING: can not find python-boto
-------------------------------------------------------------------
mesos-ec2 services will not function.
-------------------------------------------------------------------
ev.c:1531:31: warning: 'ev_default_loop_ptr' initialized and declared 'extern' [enabled by
default]
ev.c: In function 'evpipe_write':
ev.c:2160:17: warning: ignoring return value of 'write', declared with attribute warn_unused_result
[-Wunused-result]
ev.c:2172:17: warning: ignoring return value of 'write', declared with attribute warn_unused_result
[-Wunused-result]
ev.c: In function 'pipecb':
ev.c:2193:16: warning: ignoring return value of 'read', declared with attribute warn_unused_result
[-Wunused-result]
ev.c:2207:16: warning: ignoring return value of 'read', declared with attribute warn_unused_result
[-Wunused-result]
In file included from /usr/include/c++/4.6/ext/hash_set:61:0,
                 from src/glog/stl_logging.h:54,
                 from src/stl_logging_unittest.cc:34:
/usr/include/c++/4.6/backward/backward_warning.h:33:2: warning: #warning This file includes
at least one deprecated or antiquated header which may be removed without further notice at
a future date. Please use a non-deprecated interface with equivalent functionality instead.
For a listing of replacement headers and interfaces, consult the file backward_warning.h.
To disable this warning use -Wno-deprecated. [-Wcpp]
In file included from src/utilities.h:73:0,
                 from src/googletest.h:38,
                 from src/stl_logging_unittest.cc:48:
src/base/mutex.h:137:0: warning: "_XOPEN_SOURCE" redefined [enabled by default]
/usr/include/features.h:166:0: note: this is the location of the previous definition
warning: no files found matching 'Makefile' under directory 'docs'
warning: no files found matching 'indexsidebar.html' under directory 'docs'
ar: creating libleveldb.a
zip_safe flag not set; analyzing archive contents...
../../src/linux/cgroups.cpp:1449:40: error: 'EMPTY_WATCHER_RETRIES' was not declared in this
scope
../../src/linux/cgroups.cpp: In member function 'process::Future<bool> cgroups::internal::TasksKiller::empty()':
../../src/linux/cgroups.cpp:1603:73: error: the default argument for parameter 3 of 'cgroups::internal::EmptyWatcher::EmptyWatcher(const
string&, const string&, const Duration&, unsigned int)' has not yet been parsed
make[3]: *** [linux/libmesos_no_3rdparty_la-cgroups.lo] Error 1
make[3]: *** Waiting for unfinished jobs....
make[2]: *** [all] Error 2
make[1]: *** [all-recursive] Error 1
make: *** [distcheck] Error 1

git clean -fd
Traceback (most recent call last):
  File "./support/verify-reviews.py", line 197, in <module>
    verify_review(review_request)
  File "./support/verify-reviews.py", line 135, in verify_review
    cleanup()
  File "./support/verify-reviews.py", line 97, in cleanup
    shell("git clean -fd")
  File "./support/verify-reviews.py", line 44, in shell
    command, stderr=subprocess.STDOUT, shell=True)
  File "/usr/lib/python2.7/subprocess.py", line 544, in check_output
    raise CalledProcessError(retcode, cmd, output=output)
subprocess.CalledProcessError: Command 'git clean -fd' returned non-zero exit status 1
Error in atexit._run_exitfuncs:
Traceback (most recent call last):
  File "/usr/lib/python2.7/atexit.py", line 24, in _run_exitfuncs
    func(*targs, **kargs)
  File "./support/verify-reviews.py", line 97, in cleanup
    shell("git clean -fd")
  File "./support/verify-reviews.py", line 44, in shell
    command, stderr=subprocess.STDOUT, shell=True)
  File "/usr/lib/python2.7/subprocess.py", line 544, in check_output
    raise CalledProcessError(retcode, cmd, output=output)
CalledProcessError: Command 'git clean -fd' returned non-zero exit status 1
Error in sys.exitfunc:
git clean -fd
Traceback (most recent call last):
  File "/usr/lib/python2.7/atexit.py", line 24, in _run_exitfuncs
    func(*targs, **kargs)
  File "./support/verify-reviews.py", line 97, in cleanup
    shell("git clean -fd")
  File "./support/verify-reviews.py", line 44, in shell
    command, stderr=subprocess.STDOUT, shell=True)
  File "/usr/lib/python2.7/subprocess.py", line 544, in check_output
    raise CalledProcessError(retcode, cmd, output=output)
subprocess.CalledProcessError: Command 'git clean -fd' returned non-zero exit status 1
Build step 'Execute shell' marked build as failure

Mime
View raw message