mesos-dev mailing list archives

Site index · List index
Message view « Date » · « Thread »
Top « Date » · « Thread »
From Apache Jenkins Server <jenk...@builds.apache.org>
Subject Build failed in Jenkins: Mesos-Trunk-Ubuntu-Build-Out-Of-Src-Set-JAVA_HOME #2093
Date Mon, 28 Apr 2014 10:57:12 GMT
See <https://builds.apache.org/job/Mesos-Trunk-Ubuntu-Build-Out-Of-Src-Set-JAVA_HOME/2093/changes>

Changes:

[benjamin.hindman] Added External Containerizer.

------------------------------------------
[...truncated 1967 lines...]
make[5]: Leaving directory `<https://builds.apache.org/job/Mesos-Trunk-Ubuntu-Build-Out-Of-Src-Set-JAVA_HOME/ws/build/mesos-0.19.0/_build/3rdparty/libprocess'>
make[4]: Leaving directory `<https://builds.apache.org/job/Mesos-Trunk-Ubuntu-Build-Out-Of-Src-Set-JAVA_HOME/ws/build/mesos-0.19.0/_build/3rdparty/libprocess'>
make[4]: Entering directory `<https://builds.apache.org/job/Mesos-Trunk-Ubuntu-Build-Out-Of-Src-Set-JAVA_HOME/ws/build/mesos-0.19.0/_build/3rdparty'>
gzip -d -c ../../3rdparty/distribute-0.6.26.tar.gz | tar xf -
test ! -e ../../3rdparty/distribute-0.6.26.patch || patch -d distribute-0.6.26 -p1 <../../3rdparty/distribute-0.6.26.patch
touch distribute-0.6.26-stamp
cd distribute-0.6.26 && /usr/bin/python setup.py bdist_egg
running bdist_egg
running egg_info
writing distribute.egg-info/PKG-INFO
writing top-level names to distribute.egg-info/top_level.txt
writing dependency_links to distribute.egg-info/dependency_links.txt
writing entry points to distribute.egg-info/entry_points.txt
reading manifest file 'distribute.egg-info/SOURCES.txt'
reading manifest template 'MANIFEST.in'
warning: no files found matching 'Makefile' under directory 'docs'
warning: no files found matching 'indexsidebar.html' under directory 'docs'
writing manifest file 'distribute.egg-info/SOURCES.txt'
installing library code to build/bdist.linux-x86_64/egg
running install_lib
running build_py
creating build
creating build/lib.linux-x86_64-2.7
copying pkg_resources.py -> build/lib.linux-x86_64-2.7
copying easy_install.py -> build/lib.linux-x86_64-2.7
copying site.py -> build/lib.linux-x86_64-2.7
creating build/lib.linux-x86_64-2.7/setuptools
copying setuptools/extension.py -> build/lib.linux-x86_64-2.7/setuptools
copying setuptools/depends.py -> build/lib.linux-x86_64-2.7/setuptools
copying setuptools/archive_util.py -> build/lib.linux-x86_64-2.7/setuptools
copying setuptools/package_index.py -> build/lib.linux-x86_64-2.7/setuptools
copying setuptools/dist.py -> build/lib.linux-x86_64-2.7/setuptools
copying setuptools/sandbox.py -> build/lib.linux-x86_64-2.7/setuptools
copying setuptools/__init__.py -> build/lib.linux-x86_64-2.7/setuptools
copying setuptools/script template.py -> build/lib.linux-x86_64-2.7/setuptools
copying setuptools/script template (dev).py -> build/lib.linux-x86_64-2.7/setuptools
creating build/lib.linux-x86_64-2.7/setuptools/tests
copying setuptools/tests/test_develop.py -> build/lib.linux-x86_64-2.7/setuptools/tests
copying setuptools/tests/test_packageindex.py -> build/lib.linux-x86_64-2.7/setuptools/tests
copying setuptools/tests/doctest.py -> build/lib.linux-x86_64-2.7/setuptools/tests
copying setuptools/tests/test_upload_docs.py -> build/lib.linux-x86_64-2.7/setuptools/tests
copying setuptools/tests/test_sandbox.py -> build/lib.linux-x86_64-2.7/setuptools/tests
copying setuptools/tests/test_resources.py -> build/lib.linux-x86_64-2.7/setuptools/tests
copying setuptools/tests/server.py -> build/lib.linux-x86_64-2.7/setuptools/tests
copying setuptools/tests/__init__.py -> build/lib.linux-x86_64-2.7/setuptools/tests
copying setuptools/tests/test_build_ext.py -> build/lib.linux-x86_64-2.7/setuptools/tests
copying setuptools/tests/test_easy_install.py -> build/lib.linux-x86_64-2.7/setuptools/tests
creating build/lib.linux-x86_64-2.7/setuptools/command
copying setuptools/command/setopt.py -> build/lib.linux-x86_64-2.7/setuptools/command
copying setuptools/command/bdist_egg.py -> build/lib.linux-x86_64-2.7/setuptools/command
copying setuptools/command/bdist_rpm.py -> build/lib.linux-x86_64-2.7/setuptools/command
copying setuptools/command/develop.py -> build/lib.linux-x86_64-2.7/setuptools/command
copying setuptools/command/alias.py -> build/lib.linux-x86_64-2.7/setuptools/command
copying setuptools/command/rotate.py -> build/lib.linux-x86_64-2.7/setuptools/command
copying setuptools/command/upload_docs.py -> build/lib.linux-x86_64-2.7/setuptools/command
copying setuptools/command/install_egg_info.py -> build/lib.linux-x86_64-2.7/setuptools/command
copying setuptools/command/saveopts.py -> build/lib.linux-x86_64-2.7/setuptools/command
copying setuptools/command/build_py.py -> build/lib.linux-x86_64-2.7/setuptools/command
copying setuptools/command/sdist.py -> build/lib.linux-x86_64-2.7/setuptools/command
copying setuptools/command/upload.py -> build/lib.linux-x86_64-2.7/setuptools/command
copying setuptools/command/register.py -> build/lib.linux-x86_64-2.7/setuptools/command
copying setuptools/command/test.py -> build/lib.linux-x86_64-2.7/setuptools/command
copying setuptools/command/install.py -> build/lib.linux-x86_64-2.7/setuptools/command
copying setuptools/command/__init__.py -> build/lib.linux-x86_64-2.7/setuptools/command
copying setuptools/command/easy_install.py -> build/lib.linux-x86_64-2.7/setuptools/command
copying setuptools/command/egg_info.py -> build/lib.linux-x86_64-2.7/setuptools/command
copying setuptools/command/install_lib.py -> build/lib.linux-x86_64-2.7/setuptools/command
copying setuptools/command/bdist_wininst.py -> build/lib.linux-x86_64-2.7/setuptools/command
copying setuptools/command/install_scripts.py -> build/lib.linux-x86_64-2.7/setuptools/command
copying setuptools/command/build_ext.py -> build/lib.linux-x86_64-2.7/setuptools/command
copying setuptools/gui.exe -> build/lib.linux-x86_64-2.7/setuptools
copying setuptools/gui-64.exe -> build/lib.linux-x86_64-2.7/setuptools
copying setuptools/cli.exe -> build/lib.linux-x86_64-2.7/setuptools
copying setuptools/cli-64.exe -> build/lib.linux-x86_64-2.7/setuptools
copying setuptools/cli-32.exe -> build/lib.linux-x86_64-2.7/setuptools
copying setuptools/gui-32.exe -> build/lib.linux-x86_64-2.7/setuptools
creating build/bdist.linux-x86_64
creating build/bdist.linux-x86_64/egg
copying build/lib.linux-x86_64-2.7/pkg_resources.py -> build/bdist.linux-x86_64/egg
copying build/lib.linux-x86_64-2.7/site.py -> build/bdist.linux-x86_64/egg
creating build/bdist.linux-x86_64/egg/setuptools
copying build/lib.linux-x86_64-2.7/setuptools/extension.py -> build/bdist.linux-x86_64/egg/setuptools
copying build/lib.linux-x86_64-2.7/setuptools/depends.py -> build/bdist.linux-x86_64/egg/setuptools
copying build/lib.linux-x86_64-2.7/setuptools/gui.exe -> build/bdist.linux-x86_64/egg/setuptools
copying build/lib.linux-x86_64-2.7/setuptools/archive_util.py -> build/bdist.linux-x86_64/egg/setuptools
copying build/lib.linux-x86_64-2.7/setuptools/package_index.py -> build/bdist.linux-x86_64/egg/setuptools
copying build/lib.linux-x86_64-2.7/setuptools/gui-64.exe -> build/bdist.linux-x86_64/egg/setuptools
copying build/lib.linux-x86_64-2.7/setuptools/cli.exe -> build/bdist.linux-x86_64/egg/setuptools
copying build/lib.linux-x86_64-2.7/setuptools/dist.py -> build/bdist.linux-x86_64/egg/setuptools
copying build/lib.linux-x86_64-2.7/setuptools/cli-64.exe -> build/bdist.linux-x86_64/egg/setuptools
creating build/bdist.linux-x86_64/egg/setuptools/tests
copying build/lib.linux-x86_64-2.7/setuptools/tests/test_develop.py -> build/bdist.linux-x86_64/egg/setuptools/tests
copying build/lib.linux-x86_64-2.7/setuptools/tests/test_packageindex.py -> build/bdist.linux-x86_64/egg/setuptools/tests
copying build/lib.linux-x86_64-2.7/setuptools/tests/doctest.py -> build/bdist.linux-x86_64/egg/setuptools/tests
copying build/lib.linux-x86_64-2.7/setuptools/tests/test_upload_docs.py -> build/bdist.linux-x86_64/egg/setuptools/tests
copying build/lib.linux-x86_64-2.7/setuptools/tests/test_sandbox.py -> build/bdist.linux-x86_64/egg/setuptools/tests
copying build/lib.linux-x86_64-2.7/setuptools/tests/test_resources.py -> build/bdist.linux-x86_64/egg/setuptools/tests
copying build/lib.linux-x86_64-2.7/setuptools/tests/server.py -> build/bdist.linux-x86_64/egg/setuptools/tests
copying build/lib.linux-x86_64-2.7/setuptools/tests/__init__.py -> build/bdist.linux-x86_64/egg/setuptools/tests
copying build/lib.linux-x86_64-2.7/setuptools/tests/test_build_ext.py -> build/bdist.linux-x86_64/egg/setuptools/tests
copying build/lib.linux-x86_64-2.7/setuptools/tests/test_easy_install.py -> build/bdist.linux-x86_64/egg/setuptools/tests
copying build/lib.linux-x86_64-2.7/setuptools/cli-32.exe -> build/bdist.linux-x86_64/egg/setuptools
copying build/lib.linux-x86_64-2.7/setuptools/sandbox.py -> build/bdist.linux-x86_64/egg/setuptools
copying build/lib.linux-x86_64-2.7/setuptools/__init__.py -> build/bdist.linux-x86_64/egg/setuptools
creating build/bdist.linux-x86_64/egg/setuptools/command
copying build/lib.linux-x86_64-2.7/setuptools/command/setopt.py -> build/bdist.linux-x86_64/egg/setuptools/command
copying build/lib.linux-x86_64-2.7/setuptools/command/bdist_egg.py -> build/bdist.linux-x86_64/egg/setuptools/command
copying build/lib.linux-x86_64-2.7/setuptools/command/bdist_rpm.py -> build/bdist.linux-x86_64/egg/setuptools/command
copying build/lib.linux-x86_64-2.7/setuptools/command/develop.py -> build/bdist.linux-x86_64/egg/setuptools/command
copying build/lib.linux-x86_64-2.7/setuptools/command/alias.py -> build/bdist.linux-x86_64/egg/setuptools/command
copying build/lib.linux-x86_64-2.7/setuptools/command/rotate.py -> build/bdist.linux-x86_64/egg/setuptools/command
copying build/lib.linux-x86_64-2.7/setuptools/command/upload_docs.py -> build/bdist.linux-x86_64/egg/setuptools/command
copying build/lib.linux-x86_64-2.7/setuptools/command/install_egg_info.py -> build/bdist.linux-x86_64/egg/setuptools/command
copying build/lib.linux-x86_64-2.7/setuptools/command/saveopts.py -> build/bdist.linux-x86_64/egg/setuptools/command
copying build/lib.linux-x86_64-2.7/setuptools/command/build_py.py -> build/bdist.linux-x86_64/egg/setuptools/command
copying build/lib.linux-x86_64-2.7/setuptools/command/sdist.py -> build/bdist.linux-x86_64/egg/setuptools/command
copying build/lib.linux-x86_64-2.7/setuptools/command/upload.py -> build/bdist.linux-x86_64/egg/setuptools/command
copying build/lib.linux-x86_64-2.7/setuptools/command/register.py -> build/bdist.linux-x86_64/egg/setuptools/command
copying build/lib.linux-x86_64-2.7/setuptools/command/test.py -> build/bdist.linux-x86_64/egg/setuptools/command
copying build/lib.linux-x86_64-2.7/setuptools/command/install.py -> build/bdist.linux-x86_64/egg/setuptools/command
copying build/lib.linux-x86_64-2.7/setuptools/command/__init__.py -> build/bdist.linux-x86_64/egg/setuptools/command
copying build/lib.linux-x86_64-2.7/setuptools/command/easy_install.py -> build/bdist.linux-x86_64/egg/setuptools/command
copying build/lib.linux-x86_64-2.7/setuptools/command/egg_info.py -> build/bdist.linux-x86_64/egg/setuptools/command
copying build/lib.linux-x86_64-2.7/setuptools/command/install_lib.py -> build/bdist.linux-x86_64/egg/setuptools/command
copying build/lib.linux-x86_64-2.7/setuptools/command/bdist_wininst.py -> build/bdist.linux-x86_64/egg/setuptools/command
copying build/lib.linux-x86_64-2.7/setuptools/command/install_scripts.py -> build/bdist.linux-x86_64/egg/setuptools/command
copying build/lib.linux-x86_64-2.7/setuptools/command/build_ext.py -> build/bdist.linux-x86_64/egg/setuptools/command
copying build/lib.linux-x86_64-2.7/setuptools/gui-32.exe -> build/bdist.linux-x86_64/egg/setuptools
copying build/lib.linux-x86_64-2.7/setuptools/script template.py -> build/bdist.linux-x86_64/egg/setuptools
copying build/lib.linux-x86_64-2.7/setuptools/script template (dev).py -> build/bdist.linux-x86_64/egg/setuptools
copying build/lib.linux-x86_64-2.7/easy_install.py -> build/bdist.linux-x86_64/egg
byte-compiling build/bdist.linux-x86_64/egg/pkg_resources.py to pkg_resources.pyc
byte-compiling build/bdist.linux-x86_64/egg/site.py to site.pyc
byte-compiling build/bdist.linux-x86_64/egg/setuptools/extension.py to extension.pyc
byte-compiling build/bdist.linux-x86_64/egg/setuptools/depends.py to depends.pyc
byte-compiling build/bdist.linux-x86_64/egg/setuptools/archive_util.py to archive_util.pyc
byte-compiling build/bdist.linux-x86_64/egg/setuptools/package_index.py to package_index.pyc
byte-compiling build/bdist.linux-x86_64/egg/setuptools/dist.py to dist.pyc
byte-compiling build/bdist.linux-x86_64/egg/setuptools/tests/test_develop.py to test_develop.pyc
byte-compiling build/bdist.linux-x86_64/egg/setuptools/tests/test_packageindex.py to test_packageindex.pyc
byte-compiling build/bdist.linux-x86_64/egg/setuptools/tests/doctest.py to doctest.pyc
byte-compiling build/bdist.linux-x86_64/egg/setuptools/tests/test_upload_docs.py to test_upload_docs.pyc
byte-compiling build/bdist.linux-x86_64/egg/setuptools/tests/test_sandbox.py to test_sandbox.pyc
byte-compiling build/bdist.linux-x86_64/egg/setuptools/tests/test_resources.py to test_resources.pyc
byte-compiling build/bdist.linux-x86_64/egg/setuptools/tests/server.py to server.pyc
byte-compiling build/bdist.linux-x86_64/egg/setuptools/tests/__init__.py to __init__.pyc
byte-compiling build/bdist.linux-x86_64/egg/setuptools/tests/test_build_ext.py to test_build_ext.pyc
byte-compiling build/bdist.linux-x86_64/egg/setuptools/tests/test_easy_install.py to test_easy_install.pyc
byte-compiling build/bdist.linux-x86_64/egg/setuptools/sandbox.py to sandbox.pyc
byte-compiling build/bdist.linux-x86_64/egg/setuptools/__init__.py to __init__.pyc
byte-compiling build/bdist.linux-x86_64/egg/setuptools/command/setopt.py to setopt.pyc
byte-compiling build/bdist.linux-x86_64/egg/setuptools/command/bdist_egg.py to bdist_egg.pyc
byte-compiling build/bdist.linux-x86_64/egg/setuptools/command/bdist_rpm.py to bdist_rpm.pyc
byte-compiling build/bdist.linux-x86_64/egg/setuptools/command/develop.py to develop.pyc
byte-compiling build/bdist.linux-x86_64/egg/setuptools/command/alias.py to alias.pyc
byte-compiling build/bdist.linux-x86_64/egg/setuptools/command/rotate.py to rotate.pyc
byte-compiling build/bdist.linux-x86_64/egg/setuptools/command/upload_docs.py to upload_docs.pyc
byte-compiling build/bdist.linux-x86_64/egg/setuptools/command/install_egg_info.py to install_egg_info.pyc
byte-compiling build/bdist.linux-x86_64/egg/setuptools/command/saveopts.py to saveopts.pyc
byte-compiling build/bdist.linux-x86_64/egg/setuptools/command/build_py.py to build_py.pyc
byte-compiling build/bdist.linux-x86_64/egg/setuptools/command/sdist.py to sdist.pyc
byte-compiling build/bdist.linux-x86_64/egg/setuptools/command/upload.py to upload.pyc
byte-compiling build/bdist.linux-x86_64/egg/setuptools/command/register.py to register.pyc
byte-compiling build/bdist.linux-x86_64/egg/setuptools/command/test.py to test.pyc
byte-compiling build/bdist.linux-x86_64/egg/setuptools/command/install.py to install.pyc
byte-compiling build/bdist.linux-x86_64/egg/setuptools/command/__init__.py to __init__.pyc
byte-compiling build/bdist.linux-x86_64/egg/setuptools/command/easy_install.py to easy_install.pyc
byte-compiling build/bdist.linux-x86_64/egg/setuptools/command/egg_info.py to egg_info.pyc
byte-compiling build/bdist.linux-x86_64/egg/setuptools/command/install_lib.py to install_lib.pyc
byte-compiling build/bdist.linux-x86_64/egg/setuptools/command/bdist_wininst.py to bdist_wininst.pyc
byte-compiling build/bdist.linux-x86_64/egg/setuptools/command/install_scripts.py to install_scripts.pyc
byte-compiling build/bdist.linux-x86_64/egg/setuptools/command/build_ext.py to build_ext.pyc
byte-compiling build/bdist.linux-x86_64/egg/setuptools/script template.py to script template.pyc
byte-compiling build/bdist.linux-x86_64/egg/setuptools/script template (dev).py to script
template (dev).pyc
byte-compiling build/bdist.linux-x86_64/egg/easy_install.py to easy_install.pyc
creating build/bdist.linux-x86_64/egg/EGG-INFO
copying distribute.egg-info/PKG-INFO -> build/bdist.linux-x86_64/egg/EGG-INFO
copying distribute.egg-info/SOURCES.txt -> build/bdist.linux-x86_64/egg/EGG-INFO
copying distribute.egg-info/dependency_links.txt -> build/bdist.linux-x86_64/egg/EGG-INFO
copying distribute.egg-info/entry_points.txt -> build/bdist.linux-x86_64/egg/EGG-INFO
copying distribute.egg-info/top_level.txt -> build/bdist.linux-x86_64/egg/EGG-INFO
copying distribute.egg-info/zip-safe -> build/bdist.linux-x86_64/egg/EGG-INFO
creating dist
creating 'dist/distribute-0.6.26-py2.7.egg' and adding 'build/bdist.linux-x86_64/egg' to it
removing 'build/bdist.linux-x86_64/egg' (and everything under it)
gzip -d -c ../../3rdparty/leveldb.tar.gz | tar xf -
test ! -e ../../3rdparty/leveldb.patch || patch -d leveldb -p1 <../../3rdparty/leveldb.patch
touch leveldb-stamp
cd leveldb && \
          make  CC="gcc" CXX="g++" OPT="-g -g2 -O2 -std=c++0x -fPIC"
make[5]: Entering directory `<https://builds.apache.org/job/Mesos-Trunk-Ubuntu-Build-Out-Of-Src-Set-JAVA_HOME/ws/build/mesos-0.19.0/_build/3rdparty/leveldb'>
g++ -pthread -shared -Wl,-soname -Wl,<https://builds.apache.org/job/Mesos-Trunk-Ubuntu-Build-Out-Of-Src-Set-JAVA_HOME/ws/build/mesos-0.19.0/_build/3rdparty/leveldb/libleveldb.so.1>
-I. -I./include -fno-builtin-memcmp -pthread -DOS_LINUX -DLEVELDB_PLATFORM_POSIX -g -g2 -O2
-std=c++0x -fPIC -fPIC db/builder.cc db/c.cc db/db_impl.cc db/db_iter.cc db/dbformat.cc db/filename.cc
db/log_reader.cc db/log_writer.cc db/memtable.cc db/repair.cc db/table_cache.cc db/version_edit.cc
db/version_set.cc db/write_batch.cc table/block.cc table/block_builder.cc table/filter_block.cc
table/format.cc table/iterator.cc table/merger.cc table/table.cc table/table_builder.cc table/two_level_iterator.cc
util/arena.cc util/bloom.cc util/cache.cc util/coding.cc util/comparator.cc util/crc32c.cc
util/env.cc util/env_posix.cc util/filter_policy.cc util/hash.cc util/histogram.cc util/logging.cc
util/options.cc util/status.cc  port/port_posix.cc -o libleveldb.so.1.4
ln -fs libleveldb.so.1.4 libleveldb.so
ln -fs libleveldb.so.1.4 libleveldb.so.1
g++ -I. -I./include -fno-builtin-memcmp -pthread -DOS_LINUX -DLEVELDB_PLATFORM_POSIX -g -g2
-O2 -std=c++0x -fPIC -c db/builder.cc -o db/builder.o
g++ -I. -I./include -fno-builtin-memcmp -pthread -DOS_LINUX -DLEVELDB_PLATFORM_POSIX -g -g2
-O2 -std=c++0x -fPIC -c db/c.cc -o db/c.o
g++ -I. -I./include -fno-builtin-memcmp -pthread -DOS_LINUX -DLEVELDB_PLATFORM_POSIX -g -g2
-O2 -std=c++0x -fPIC -c db/db_impl.cc -o db/db_impl.o
g++ -I. -I./include -fno-builtin-memcmp -pthread -DOS_LINUX -DLEVELDB_PLATFORM_POSIX -g -g2
-O2 -std=c++0x -fPIC -c db/db_iter.cc -o db/db_iter.o
g++ -I. -I./include -fno-builtin-memcmp -pthread -DOS_LINUX -DLEVELDB_PLATFORM_POSIX -g -g2
-O2 -std=c++0x -fPIC -c db/dbformat.cc -o db/dbformat.o
g++ -I. -I./include -fno-builtin-memcmp -pthread -DOS_LINUX -DLEVELDB_PLATFORM_POSIX -g -g2
-O2 -std=c++0x -fPIC -c db/filename.cc -o db/filename.o
g++ -I. -I./include -fno-builtin-memcmp -pthread -DOS_LINUX -DLEVELDB_PLATFORM_POSIX -g -g2
-O2 -std=c++0x -fPIC -c db/log_reader.cc -o db/log_reader.o
g++ -I. -I./include -fno-builtin-memcmp -pthread -DOS_LINUX -DLEVELDB_PLATFORM_POSIX -g -g2
-O2 -std=c++0x -fPIC -c db/log_writer.cc -o db/log_writer.o
g++ -I. -I./include -fno-builtin-memcmp -pthread -DOS_LINUX -DLEVELDB_PLATFORM_POSIX -g -g2
-O2 -std=c++0x -fPIC -c db/memtable.cc -o db/memtable.o
g++ -I. -I./include -fno-builtin-memcmp -pthread -DOS_LINUX -DLEVELDB_PLATFORM_POSIX -g -g2
-O2 -std=c++0x -fPIC -c db/repair.cc -o db/repair.o
g++ -I. -I./include -fno-builtin-memcmp -pthread -DOS_LINUX -DLEVELDB_PLATFORM_POSIX -g -g2
-O2 -std=c++0x -fPIC -c db/table_cache.cc -o db/table_cache.o
g++ -I. -I./include -fno-builtin-memcmp -pthread -DOS_LINUX -DLEVELDB_PLATFORM_POSIX -g -g2
-O2 -std=c++0x -fPIC -c db/version_edit.cc -o db/version_edit.o
g++ -I. -I./include -fno-builtin-memcmp -pthread -DOS_LINUX -DLEVELDB_PLATFORM_POSIX -g -g2
-O2 -std=c++0x -fPIC -c db/version_set.cc -o db/version_set.o
g++ -I. -I./include -fno-builtin-memcmp -pthread -DOS_LINUX -DLEVELDB_PLATFORM_POSIX -g -g2
-O2 -std=c++0x -fPIC -c db/write_batch.cc -o db/write_batch.o
g++ -I. -I./include -fno-builtin-memcmp -pthread -DOS_LINUX -DLEVELDB_PLATFORM_POSIX -g -g2
-O2 -std=c++0x -fPIC -c table/block.cc -o table/block.o
g++ -I. -I./include -fno-builtin-memcmp -pthread -DOS_LINUX -DLEVELDB_PLATFORM_POSIX -g -g2
-O2 -std=c++0x -fPIC -c table/block_builder.cc -o table/block_builder.o
g++ -I. -I./include -fno-builtin-memcmp -pthread -DOS_LINUX -DLEVELDB_PLATFORM_POSIX -g -g2
-O2 -std=c++0x -fPIC -c table/filter_block.cc -o table/filter_block.o
g++ -I. -I./include -fno-builtin-memcmp -pthread -DOS_LINUX -DLEVELDB_PLATFORM_POSIX -g -g2
-O2 -std=c++0x -fPIC -c table/format.cc -o table/format.o
g++ -I. -I./include -fno-builtin-memcmp -pthread -DOS_LINUX -DLEVELDB_PLATFORM_POSIX -g -g2
-O2 -std=c++0x -fPIC -c table/iterator.cc -o table/iterator.o
g++ -I. -I./include -fno-builtin-memcmp -pthread -DOS_LINUX -DLEVELDB_PLATFORM_POSIX -g -g2
-O2 -std=c++0x -fPIC -c table/merger.cc -o table/merger.o
g++ -I. -I./include -fno-builtin-memcmp -pthread -DOS_LINUX -DLEVELDB_PLATFORM_POSIX -g -g2
-O2 -std=c++0x -fPIC -c table/table.cc -o table/table.o
g++ -I. -I./include -fno-builtin-memcmp -pthread -DOS_LINUX -DLEVELDB_PLATFORM_POSIX -g -g2
-O2 -std=c++0x -fPIC -c table/table_builder.cc -o table/table_builder.o
g++ -I. -I./include -fno-builtin-memcmp -pthread -DOS_LINUX -DLEVELDB_PLATFORM_POSIX -g -g2
-O2 -std=c++0x -fPIC -c table/two_level_iterator.cc -o table/two_level_iterator.o
g++ -I. -I./include -fno-builtin-memcmp -pthread -DOS_LINUX -DLEVELDB_PLATFORM_POSIX -g -g2
-O2 -std=c++0x -fPIC -c util/arena.cc -o util/arena.o
g++ -I. -I./include -fno-builtin-memcmp -pthread -DOS_LINUX -DLEVELDB_PLATFORM_POSIX -g -g2
-O2 -std=c++0x -fPIC -c util/bloom.cc -o util/bloom.o
g++ -I. -I./include -fno-builtin-memcmp -pthread -DOS_LINUX -DLEVELDB_PLATFORM_POSIX -g -g2
-O2 -std=c++0x -fPIC -c util/cache.cc -o util/cache.o
g++ -I. -I./include -fno-builtin-memcmp -pthread -DOS_LINUX -DLEVELDB_PLATFORM_POSIX -g -g2
-O2 -std=c++0x -fPIC -c util/coding.cc -o util/coding.o
g++ -I. -I./include -fno-builtin-memcmp -pthread -DOS_LINUX -DLEVELDB_PLATFORM_POSIX -g -g2
-O2 -std=c++0x -fPIC -c util/comparator.cc -o util/comparator.o
g++ -I. -I./include -fno-builtin-memcmp -pthread -DOS_LINUX -DLEVELDB_PLATFORM_POSIX -g -g2
-O2 -std=c++0x -fPIC -c util/crc32c.cc -o util/crc32c.o
g++ -I. -I./include -fno-builtin-memcmp -pthread -DOS_LINUX -DLEVELDB_PLATFORM_POSIX -g -g2
-O2 -std=c++0x -fPIC -c util/env.cc -o util/env.o
g++ -I. -I./include -fno-builtin-memcmp -pthread -DOS_LINUX -DLEVELDB_PLATFORM_POSIX -g -g2
-O2 -std=c++0x -fPIC -c util/env_posix.cc -o util/env_posix.o
g++ -I. -I./include -fno-builtin-memcmp -pthread -DOS_LINUX -DLEVELDB_PLATFORM_POSIX -g -g2
-O2 -std=c++0x -fPIC -c util/filter_policy.cc -o util/filter_policy.o
g++ -I. -I./include -fno-builtin-memcmp -pthread -DOS_LINUX -DLEVELDB_PLATFORM_POSIX -g -g2
-O2 -std=c++0x -fPIC -c util/hash.cc -o util/hash.o
g++ -I. -I./include -fno-builtin-memcmp -pthread -DOS_LINUX -DLEVELDB_PLATFORM_POSIX -g -g2
-O2 -std=c++0x -fPIC -c util/histogram.cc -o util/histogram.o
g++ -I. -I./include -fno-builtin-memcmp -pthread -DOS_LINUX -DLEVELDB_PLATFORM_POSIX -g -g2
-O2 -std=c++0x -fPIC -c util/logging.cc -o util/logging.o
g++ -I. -I./include -fno-builtin-memcmp -pthread -DOS_LINUX -DLEVELDB_PLATFORM_POSIX -g -g2
-O2 -std=c++0x -fPIC -c util/options.cc -o util/options.o
g++ -I. -I./include -fno-builtin-memcmp -pthread -DOS_LINUX -DLEVELDB_PLATFORM_POSIX -g -g2
-O2 -std=c++0x -fPIC -c util/status.cc -o util/status.o
g++ -I. -I./include -fno-builtin-memcmp -pthread -DOS_LINUX -DLEVELDB_PLATFORM_POSIX -g -g2
-O2 -std=c++0x -fPIC -c port/port_posix.cc -o port/port_posix.o
rm -f libleveldb.a
ar -rs libleveldb.a db/builder.o db/c.o db/db_impl.o db/db_iter.o db/dbformat.o db/filename.o
db/log_reader.o db/log_writer.o db/memtable.o db/repair.o db/table_cache.o db/version_edit.o
db/version_set.o db/write_batch.o table/block.o table/block_builder.o table/filter_block.o
table/format.o table/iterator.o table/merger.o table/table.o table/table_builder.o table/two_level_iterator.o
util/arena.o util/bloom.o util/cache.o util/coding.o util/comparator.o util/crc32c.o util/env.o
util/env_posix.o util/filter_policy.o util/hash.o util/histogram.o util/logging.o util/options.o
util/status.o port/port_posix.o
ar: creating libleveldb.a
make[5]: Leaving directory `<https://builds.apache.org/job/Mesos-Trunk-Ubuntu-Build-Out-Of-Src-Set-JAVA_HOME/ws/build/mesos-0.19.0/_build/3rdparty/leveldb'>
gzip -d -c ../../3rdparty/zookeeper-3.4.5.tar.gz | tar xf -
Build timed out (after 120 minutes). Marking the build as failed.
/bin/bash: line 1: 26826 Broken pipe             gzip -d -c ../../3rdparty/zookeeper-3.4.5.tar.gz
     26827 Terminated              | tar xf -
make[4]: *** [zookeeper-3.4.5-stamp] Error 143
make[4]: Leaving directory `<https://builds.apache.org/job/Mesos-Trunk-Ubuntu-Build-Out-Of-Src-Set-JAVA_HOME/ws/build/mesos-0.19.0/_build/3rdparty'>
make[3]: *** [all-recursive] Error 1
make[3]: Leaving directory `<https://builds.apache.org/job/Mesos-Trunk-Ubuntu-Build-Out-Of-Src-Set-JAVA_HOME/ws/build/mesos-0.19.0/_build/3rdparty'>
make[2]: *** [all] Error 2
make[2]: Leaving directory `<https://builds.apache.org/job/Mesos-Trunk-Ubuntu-Build-Out-Of-Src-Set-JAVA_HOME/ws/build/mesos-0.19.0/_build/3rdparty'>
make[1]: *** [all-recursive] Error 1
make[1]: Leaving directory `<https://builds.apache.org/job/Mesos-Trunk-Ubuntu-Build-Out-Of-Src-Set-JAVA_HOME/ws/build/mesos-0.19.0/_build'>
make: *** [distcheck] Error 1

Mime
View raw message