mesos-dev mailing list archives

Site index · List index
Message view « Date » · « Thread »
Top « Date » · « Thread »
From "Mesos ReviewBot" <...@mesos.apache.org>
Subject Re: Review Request 19135: Added a --registry_strict_operations flag that must be false for now.
Date Wed, 12 Mar 2014 20:42:20 GMT

-----------------------------------------------------------
This is an automatically generated e-mail. To reply, visit:
https://reviews.apache.org/r/19135/#review36983
-----------------------------------------------------------


Bad patch!

Reviews applied: [19134, 19135]

Failed command: make check

Error:
 Making check in .
make[1]: Entering directory `/x1/jenkins/jenkins-slave/workspace/mesos-reviewbot'
make[1]: Nothing to be done for `check-am'.
make[1]: Leaving directory `/x1/jenkins/jenkins-slave/workspace/mesos-reviewbot'
Making check in 3rdparty
make[1]: Entering directory `/x1/jenkins/jenkins-slave/workspace/mesos-reviewbot/3rdparty'
make  check-recursive
make[2]: Entering directory `/x1/jenkins/jenkins-slave/workspace/mesos-reviewbot/3rdparty'
Making check in libprocess
make[3]: Entering directory `/x1/jenkins/jenkins-slave/workspace/mesos-reviewbot/3rdparty/libprocess'
Making check in 3rdparty
make[4]: Entering directory `/x1/jenkins/jenkins-slave/workspace/mesos-reviewbot/3rdparty/libprocess/3rdparty'
make  check-recursive
make[5]: Entering directory `/x1/jenkins/jenkins-slave/workspace/mesos-reviewbot/3rdparty/libprocess/3rdparty'
Making check in stout
make[6]: Entering directory `/x1/jenkins/jenkins-slave/workspace/mesos-reviewbot/3rdparty/libprocess/3rdparty/stout'
make[6]: Nothing to be done for `check'.
make[6]: Leaving directory `/x1/jenkins/jenkins-slave/workspace/mesos-reviewbot/3rdparty/libprocess/3rdparty/stout'
make[6]: Entering directory `/x1/jenkins/jenkins-slave/workspace/mesos-reviewbot/3rdparty/libprocess/3rdparty'
make  libgmock.la stout-tests
make[7]: Entering directory `/x1/jenkins/jenkins-slave/workspace/mesos-reviewbot/3rdparty/libprocess/3rdparty'
make[7]: `libgmock.la' is up to date.
make[7]: `stout-tests' is up to date.
make[7]: Leaving directory `/x1/jenkins/jenkins-slave/workspace/mesos-reviewbot/3rdparty/libprocess/3rdparty'
make  check-local
make[7]: Entering directory `/x1/jenkins/jenkins-slave/workspace/mesos-reviewbot/3rdparty/libprocess/3rdparty'
./stout-tests
[==========] Running 109 tests from 22 test cases.
[----------] Global test environment set-up.
[----------] 3 tests from Stout
[ RUN      ] Stout.Bytes
[       OK ] Stout.Bytes (0 ms)
[ RUN      ] Stout.Set
[       OK ] Stout.Set (0 ms)
[ RUN      ] Stout.Some
[       OK ] Stout.Some (0 ms)
[----------] 3 tests from Stout (0 ms total)

[----------] 4 tests from DurationTest
[ RUN      ] DurationTest.Comparison
[       OK ] DurationTest.Comparison (0 ms)
[ RUN      ] DurationTest.ParseAndTry
[       OK ] DurationTest.ParseAndTry (0 ms)
[ RUN      ] DurationTest.Arithmetic
[       OK ] DurationTest.Arithmetic (0 ms)
[ RUN      ] DurationTest.OutputFormat
[       OK ] DurationTest.OutputFormat (0 ms)
[----------] 4 tests from DurationTest (0 ms total)

[----------] 1 test from ErrorTest
[ RUN      ] ErrorTest.Test
[       OK ] ErrorTest.Test (0 ms)
[----------] 1 test from ErrorTest (0 ms total)

[----------] 12 tests from FlagsTest
[ RUN      ] FlagsTest.Load
[       OK ] FlagsTest.Load (1 ms)
[ RUN      ] FlagsTest.Add
[       OK ] FlagsTest.Add (0 ms)
[ RUN      ] FlagsTest.Flags
[       OK ] FlagsTest.Flags (0 ms)
[ RUN      ] FlagsTest.LoadFromEnvironment
[       OK ] FlagsTest.LoadFromEnvironment (0 ms)
[ RUN      ] FlagsTest.LoadFromCommandLine
[       OK ] FlagsTest.LoadFromCommandLine (0 ms)
[ RUN      ] FlagsTest.LoadFromCommandLineWithNonFlags
[       OK ] FlagsTest.LoadFromCommandLineWithNonFlags (0 ms)
[ RUN      ] FlagsTest.Stringification
[       OK ] FlagsTest.Stringification (0 ms)
[ RUN      ] FlagsTest.DuplicatesFromEnvironment
[       OK ] FlagsTest.DuplicatesFromEnvironment (0 ms)
[ RUN      ] FlagsTest.DuplicatesFromCommandLine
[       OK ] FlagsTest.DuplicatesFromCommandLine (0 ms)
[ RUN      ] FlagsTest.Errors
[       OK ] FlagsTest.Errors (0 ms)
[ RUN      ] FlagsTest.Usage
[       OK ] FlagsTest.Usage (0 ms)
[ RUN      ] FlagsTest.Duration
[       OK ] FlagsTest.Duration (0 ms)
[----------] 12 tests from FlagsTest (1 ms total)

[----------] 1 test from GzipTest
[ RUN      ] GzipTest.CompressDecompressString
[       OK ] GzipTest.CompressDecompressString (141 ms)
[----------] 1 test from GzipTest (141 ms total)

[----------] 2 tests from HashMapTest
[ RUN      ] HashMapTest.Insert
[       OK ] HashMapTest.Insert (0 ms)
[ RUN      ] HashMapTest.Contains
[       OK ] HashMapTest.Contains (0 ms)
[----------] 2 tests from HashMapTest (0 ms total)

[----------] 2 tests from HashsetTest
[ RUN      ] HashsetTest.Insert
[       OK ] HashsetTest.Insert (0 ms)
[ RUN      ] HashsetTest.Union
[       OK ] HashsetTest.Union (0 ms)
[----------] 2 tests from HashsetTest (0 ms total)

[----------] 8 tests from IntervalTest
[ RUN      ] IntervalTest.Interval
[       OK ] IntervalTest.Interval (0 ms)
[ RUN      ] IntervalTest.EmptyInterval
[       OK ] IntervalTest.EmptyInterval (0 ms)
[ RUN      ] IntervalTest.Constructor
[       OK ] IntervalTest.Constructor (0 ms)
[ RUN      ] IntervalTest.Addition
[       OK ] IntervalTest.Addition (0 ms)
[ RUN      ] IntervalTest.Subtraction
[       OK ] IntervalTest.Subtraction (0 ms)
[ RUN      ] IntervalTest.Intersection
[       OK ] IntervalTest.Intersection (0 ms)
[ RUN      ] IntervalTest.LargeInterval
[       OK ] IntervalTest.LargeInterval (0 ms)
[ RUN      ] IntervalTest.IntervalIteration
[       OK ] IntervalTest.IntervalIteration (0 ms)
[----------] 8 tests from IntervalTest (0 ms total)

[----------] 8 tests from JsonTest
[ RUN      ] JsonTest.DefaultValueIsNull
[       OK ] JsonTest.DefaultValueIsNull (0 ms)
[ RUN      ] JsonTest.BinaryData
[       OK ] JsonTest.BinaryData (0 ms)
[ RUN      ] JsonTest.NumberFormat
[       OK ] JsonTest.NumberFormat (0 ms)
[ RUN      ] JsonTest.BooleanFormat
[       OK ] JsonTest.BooleanFormat (0 ms)
[ RUN      ] JsonTest.BooleanAssignement
[       OK ] JsonTest.BooleanAssignement (0 ms)
[ RUN      ] JsonTest.CStringAssignment
[       OK ] JsonTest.CStringAssignment (0 ms)
[ RUN      ] JsonTest.NumericAssignment
[       OK ] JsonTest.NumericAssignment (0 ms)
[ RUN      ] JsonTest.parse
[       OK ] JsonTest.parse (0 ms)
[----------] 8 tests from JsonTest (0 ms total)

[----------] 5 tests from LinkedHashmapTest
[ RUN      ] LinkedHashmapTest.Put
[       OK ] LinkedHashmapTest.Put (0 ms)
[ RUN      ] LinkedHashmapTest.Contains
[       OK ] LinkedHashmapTest.Contains (0 ms)
[ RUN      ] LinkedHashmapTest.Erase
[       OK ] LinkedHashmapTest.Erase (0 ms)
[ RUN      ] LinkedHashmapTest.Keys
[       OK ] LinkedHashmapTest.Keys (0 ms)
[ RUN      ] LinkedHashmapTest.Values
[       OK ] LinkedHashmapTest.Values (0 ms)
[----------] 5 tests from LinkedHashmapTest (0 ms total)

[----------] 6 tests from MultimapTest/0, where TypeParam = Multimap<std::string, unsigned short>
[ RUN      ] MultimapTest/0.Put
[       OK ] MultimapTest/0.Put (0 ms)
[ RUN      ] MultimapTest/0.Remove
[       OK ] MultimapTest/0.Remove (0 ms)
[ RUN      ] MultimapTest/0.Size
[       OK ] MultimapTest/0.Size (0 ms)
[ RUN      ] MultimapTest/0.Keys
[       OK ] MultimapTest/0.Keys (0 ms)
[ RUN      ] MultimapTest/0.Iterator
[       OK ] MultimapTest/0.Iterator (0 ms)
[ RUN      ] MultimapTest/0.Foreach
[       OK ] MultimapTest/0.Foreach (0 ms)
[----------] 6 tests from MultimapTest/0 (0 ms total)

[----------] 6 tests from MultimapTest/1, where TypeParam = multihashmap<std::string, unsigned short>
[ RUN      ] MultimapTest/1.Put
[       OK ] MultimapTest/1.Put (0 ms)
[ RUN      ] MultimapTest/1.Remove
[       OK ] MultimapTest/1.Remove (0 ms)
[ RUN      ] MultimapTest/1.Size
[       OK ] MultimapTest/1.Size (0 ms)
[ RUN      ] MultimapTest/1.Keys
[       OK ] MultimapTest/1.Keys (0 ms)
[ RUN      ] MultimapTest/1.Iterator
[       OK ] MultimapTest/1.Iterator (0 ms)
[ RUN      ] MultimapTest/1.Foreach
[       OK ] MultimapTest/1.Foreach (0 ms)
[----------] 6 tests from MultimapTest/1 (0 ms total)

[----------] 1 test from NoneTest
[ RUN      ] NoneTest.Test
[       OK ] NoneTest.Test (0 ms)
[----------] 1 test from NoneTest (0 ms total)

[----------] 3 tests from OptionTest
[ RUN      ] OptionTest.Min
[       OK ] OptionTest.Min (0 ms)
[ RUN      ] OptionTest.Max
[       OK ] OptionTest.Max (0 ms)
[ RUN      ] OptionTest.Comparison
[       OK ] OptionTest.Comparison (0 ms)
[----------] 3 tests from OptionTest (0 ms total)

[----------] 16 tests from OsTest
[ RUN      ] OsTest.rmdir
[       OK ] OsTest.rmdir (1 ms)
[ RUN      ] OsTest.nonblock
[       OK ] OsTest.nonblock (0 ms)
[ RUN      ] OsTest.touch
[       OK ] OsTest.touch (1 ms)
[ RUN      ] OsTest.readWriteString
[       OK ] OsTest.readWriteString (1 ms)
[ RUN      ] OsTest.find
[       OK ] OsTest.find (0 ms)
[ RUN      ] OsTest.bootId
[       OK ] OsTest.bootId (1 ms)
[ RUN      ] OsTest.uname
[       OK ] OsTest.uname (0 ms)
[ RUN      ] OsTest.sysname
[       OK ] OsTest.sysname (0 ms)
[ RUN      ] OsTest.release
[       OK ] OsTest.release (0 ms)
[ RUN      ] OsTest.sleep
[       OK ] OsTest.sleep (10 ms)
[ RUN      ] OsTest.pids
[       OK ] OsTest.pids (30 ms)
[ RUN      ] OsTest.children
[       OK ] OsTest.children (62 ms)
[ RUN      ] OsTest.process
[       OK ] OsTest.process (0 ms)
[ RUN      ] OsTest.processes
[       OK ] OsTest.processes (16 ms)
[ RUN      ] OsTest.killtree
[       OK ] OsTest.killtree (108 ms)
[ RUN      ] OsTest.pstree
[       OK ] OsTest.pstree (24 ms)
[----------] 16 tests from OsTest (254 ms total)

[----------] 1 test from ProtobufTest
[ RUN      ] ProtobufTest.JSON
[       OK ] ProtobufTest.JSON (1 ms)
[----------] 1 test from ProtobufTest (1 ms total)

[----------] 1 test from OsSendfileTest
[ RUN      ] OsSendfileTest.sendfile
[       OK ] OsSendfileTest.sendfile (0 ms)
[----------] 1 test from OsSendfileTest (0 ms total)

[----------] 1 test from OsSignalsTest
[ RUN      ] OsSignalsTest.suppress
[       OK ] OsSignalsTest.suppress (0 ms)
[----------] 1 test from OsSignalsTest (0 ms total)

[----------] 22 tests from StringsTest
[ RUN      ] StringsTest.Format
[       OK ] StringsTest.Format (0 ms)
[ RUN      ] StringsTest.Remove
[       OK ] StringsTest.Remove (0 ms)
[ RUN      ] StringsTest.Replace
[       OK ] StringsTest.Replace (0 ms)
[ RUN      ] StringsTest.Trim
[       OK ] StringsTest.Trim (0 ms)
[ RUN      ] StringsTest.Tokenize
[       OK ] StringsTest.Tokenize (0 ms)
[ RUN      ] StringsTest.TokenizeStringWithDelimsAtStart
[       OK ] StringsTest.TokenizeStringWithDelimsAtStart (0 ms)
[ RUN      ] StringsTest.TokenizeStringWithDelimsAtEnd
[       OK ] StringsTest.TokenizeStringWithDelimsAtEnd (0 ms)
[ RUN      ] StringsTest.TokenizeStringWithDelimsAtStartAndEnd
[       OK ] StringsTest.TokenizeStringWithDelimsAtStartAndEnd (0 ms)
[ RUN      ] StringsTest.TokenizeWithMultipleDelims
[       OK ] StringsTest.TokenizeWithMultipleDelims (0 ms)
[ RUN      ] StringsTest.TokenizeEmptyString
[       OK ] StringsTest.TokenizeEmptyString (0 ms)
[ RUN      ] StringsTest.TokenizeDelimOnlyString
[       OK ] StringsTest.TokenizeDelimOnlyString (0 ms)
[ RUN      ] StringsTest.TokenizeNullByteDelim
[       OK ] StringsTest.TokenizeNullByteDelim (0 ms)
[ RUN      ] StringsTest.SplitEmptyString
[       OK ] StringsTest.SplitEmptyString (0 ms)
[ RUN      ] StringsTest.SplitDelimOnlyString
[       OK ] StringsTest.SplitDelimOnlyString (0 ms)
[ RUN      ] StringsTest.Split
[       OK ] StringsTest.Split (0 ms)
[ RUN      ] StringsTest.SplitStringWithDelimsAtStart
[       OK ] StringsTest.SplitStringWithDelimsAtStart (0 ms)
[ RUN      ] StringsTest.SplitStringWithDelimsAtEnd
[       OK ] StringsTest.SplitStringWithDelimsAtEnd (0 ms)
[ RUN      ] StringsTest.SplitStringWithDelimsAtStartAndEnd
[       OK ] StringsTest.SplitStringWithDelimsAtStartAndEnd (0 ms)
[ RUN      ] StringsTest.SplitWithMultipleDelims
[       OK ] StringsTest.SplitWithMultipleDelims (0 ms)
[ RUN      ] StringsTest.Pairs
[       OK ] StringsTest.Pairs (0 ms)
[ RUN      ] StringsTest.StartsWith
[       OK ] StringsTest.StartsWith (0 ms)
[ RUN      ] StringsTest.Contains
[       OK ] StringsTest.Contains (0 ms)
[----------] 22 tests from StringsTest (0 ms total)

[----------] 1 test from Thread
[ RUN      ] Thread.local
[       OK ] Thread.local (0 ms)
[----------] 1 test from Thread (0 ms total)

[----------] 1 test from UUIDTest
[ RUN      ] UUIDTest.test
[       OK ] UUIDTest.test (1 ms)
[----------] 1 test from UUIDTest (1 ms total)

[----------] 4 tests from ProcTest
[ RUN      ] ProcTest.pids
[       OK ] ProcTest.pids (1 ms)
[ RUN      ] ProcTest.cpus
[       OK ] ProcTest.cpus (0 ms)
[ RUN      ] ProcTest.SystemStatus
[       OK ] ProcTest.SystemStatus (0 ms)
[ RUN      ] ProcTest.ProcessStatus
[       OK ] ProcTest.ProcessStatus (0 ms)
[----------] 4 tests from ProcTest (1 ms total)

[----------] Global test environment tear-down
[==========] 109 tests from 22 test cases ran. (399 ms total)
[  PASSED  ] 109 tests.
make[7]: Leaving directory `/x1/jenkins/jenkins-slave/workspace/mesos-reviewbot/3rdparty/libprocess/3rdparty'
make[6]: Leaving directory `/x1/jenkins/jenkins-slave/workspace/mesos-reviewbot/3rdparty/libprocess/3rdparty'
make[5]: Leaving directory `/x1/jenkins/jenkins-slave/workspace/mesos-reviewbot/3rdparty/libprocess/3rdparty'
make[4]: Leaving directory `/x1/jenkins/jenkins-slave/workspace/mesos-reviewbot/3rdparty/libprocess/3rdparty'
Making check in .
make[4]: Entering directory `/x1/jenkins/jenkins-slave/workspace/mesos-reviewbot/3rdparty/libprocess'
make  tests
make[5]: Entering directory `/x1/jenkins/jenkins-slave/workspace/mesos-reviewbot/3rdparty/libprocess'
make[5]: `tests' is up to date.
make[5]: Leaving directory `/x1/jenkins/jenkins-slave/workspace/mesos-reviewbot/3rdparty/libprocess'
make  check-local
make[5]: Entering directory `/x1/jenkins/jenkins-slave/workspace/mesos-reviewbot/3rdparty/libprocess'
./tests
[==========] Running 80 tests from 13 test cases.
[----------] Global test environment set-up.
[----------] 3 tests from Decoder
[ RUN      ] Decoder.Request
[       OK ] Decoder.Request (0 ms)
[ RUN      ] Decoder.RequestHeaderContinuation
[       OK ] Decoder.RequestHeaderContinuation (0 ms)
[ RUN      ] Decoder.Response
[       OK ] Decoder.Response (0 ms)
[----------] 3 tests from Decoder (0 ms total)

[----------] 2 tests from Encoder
[ RUN      ] Encoder.Response
[       OK ] Encoder.Response (0 ms)
[ RUN      ] Encoder.AcceptableEncodings
[       OK ] Encoder.AcceptableEncodings (0 ms)
[----------] 2 tests from Encoder (0 ms total)

[----------] 5 tests from HTTP
[ RUN      ] HTTP.Endpoints
[       OK ] HTTP.Endpoints (6 ms)
[ RUN      ] HTTP.Encode
[       OK ] HTTP.Encode (0 ms)
[ RUN      ] HTTP.PathParse
[       OK ] HTTP.PathParse (0 ms)
[ RUN      ] HTTP.Get
[       OK ] HTTP.Get (1 ms)
[ RUN      ] HTTP.Post
[       OK ] HTTP.Post (1 ms)
[----------] 5 tests from HTTP (8 ms total)

[----------] 5 tests from IO
[ RUN      ] IO.Poll
[       OK ] IO.Poll (0 ms)
[ RUN      ] IO.Read
[       OK ] IO.Read (0 ms)
[ RUN      ] IO.BufferedRead
[       OK ] IO.BufferedRead (2 ms)
[ RUN      ] IO.Write
[       OK ] IO.Write (0 ms)
[ RUN      ] IO.splice
[       OK ] IO.splice (43 ms)
[----------] 5 tests from IO (45 ms total)

[----------] 3 tests from Owned
[ RUN      ] Owned.Access
[       OK ] Owned.Access (0 ms)
[ RUN      ] Owned.Null
[       OK ] Owned.Null (0 ms)
[ RUN      ] Owned.Share
[       OK ] Owned.Share (0 ms)
[----------] 3 tests from Owned (0 ms total)

[----------] 37 tests from Process
[ RUN      ] Process.event
[       OK ] Process.event (0 ms)
[ RUN      ] Process.future
[       OK ] Process.future (0 ms)
[ RUN      ] Process.associate
[       OK ] Process.associate (0 ms)
[ RUN      ] Process.onAny
[       OK ] Process.onAny (0 ms)
[ RUN      ] Process.then
[       OK ] Process.then (0 ms)
[ RUN      ] Process.chain
[       OK ] Process.chain (0 ms)
[ RUN      ] Process.discard1
[       OK ] Process.discard1 (0 ms)
[ RUN      ] Process.discard2
[       OK ] Process.discard2 (0 ms)
[ RUN      ] Process.discard3
[       OK ] Process.discard3 (0 ms)
[ RUN      ] Process.spawn
[       OK ] Process.spawn (0 ms)
[ RUN      ] Process.dispatch
[       OK ] Process.dispatch (1 ms)
[ RUN      ] Process.defer1
[       OK ] Process.defer1 (1 ms)
[ RUN      ] Process.defer2
[       OK ] Process.defer2 (1 ms)
[ RUN      ] Process.defer3
[       OK ] Process.defer3 (0 ms)
[ RUN      ] Process.handlers
[       OK ] Process.handlers (0 ms)
[ RUN      ] Process.expect
[       OK ] Process.expect (0 ms)
[ RUN      ] Process.action
[       OK ] Process.action (0 ms)
[ RUN      ] Process.inheritance
[       OK ] Process.inheritance (0 ms)
[ RUN      ] Process.thunk
[       OK ] Process.thunk (0 ms)
[ RUN      ] Process.delegate
[       OK ] Process.delegate (0 ms)
[ RUN      ] Process.delay
[       OK ] Process.delay (0 ms)
[ RUN      ] Process.order
[       OK ] Process.order (1 ms)
[ RUN      ] Process.donate
[       OK ] Process.donate (0 ms)
[ RUN      ] Process.exited
[       OK ] Process.exited (0 ms)
[ RUN      ] Process.select
[       OK ] Process.select (0 ms)
[ RUN      ] Process.collect
[       OK ] Process.collect (0 ms)
[ RUN      ] Process.await1
[       OK ] Process.await1 (0 ms)
[ RUN      ] Process.await2
[       OK ] Process.await2 (1 ms)
[ RUN      ] Process.await3
[       OK ] Process.await3 (0 ms)
[ RUN      ] Process.settle
[       OK ] Process.settle (45 ms)
[ RUN      ] Process.pid
[       OK ] Process.pid (0 ms)
[ RUN      ] Process.listener
[       OK ] Process.listener (0 ms)
[ RUN      ] Process.executor
[       OK ] Process.executor (0 ms)
[ RUN      ] Process.remote
[       OK ] Process.remote (1 ms)
[ RUN      ] Process.async
[       OK ] Process.async (6 ms)
[ RUN      ] Process.limiter
[       OK ] Process.limiter (6 ms)
[ RUN      ] Process.provide
[       OK ] Process.provide (1 ms)
[----------] 37 tests from Process (65 ms total)

[----------] 3 tests from Reap
[ RUN      ] Reap.NonChildProcess
[       OK ] Reap.NonChildProcess (54 ms)
[ RUN      ] Reap.ChildProcess
[       OK ] Reap.ChildProcess (21 ms)
[ RUN      ] Reap.TerminatedChildProcess
[       OK ] Reap.TerminatedChildProcess (22 ms)
[----------] 3 tests from Reap (97 ms total)

[----------] 4 tests from Sequence
[ RUN      ] Sequence.Serialize
[       OK ] Sequence.Serialize (11 ms)
[ RUN      ] Sequence.DiscardOne
[       OK ] Sequence.DiscardOne (11 ms)
[ RUN      ] Sequence.DiscardAll
[       OK ] Sequence.DiscardAll (10 ms)
[ RUN      ] Sequence.Random
[       OK ] Sequence.Random (17 ms)
[----------] 4 tests from Sequence (49 ms total)

[----------] 4 tests from Shared
[ RUN      ] Shared.ConstAccess
[       OK ] Shared.ConstAccess (0 ms)
[ RUN      ] Shared.Null
[       OK ] Shared.Null (0 ms)
[ RUN      ] Shared.Reset
[       OK ] Shared.Reset (0 ms)
[ RUN      ] Shared.Own
[       OK ] Shared.Own (0 ms)
[----------] 4 tests from Shared (0 ms total)

[----------] 3 tests from Statistics
[ RUN      ] Statistics.set
[       OK ] Statistics.set (3 ms)
[ RUN      ] Statistics.increment
[       OK ] Statistics.increment (13 ms)
[ RUN      ] Statistics.decrement
[       OK ] Statistics.decrement (14 ms)
[----------] 3 tests from Statistics (30 ms total)

[----------] 5 tests from Subprocess
[ RUN      ] Subprocess.status
[       OK ] Subprocess.status (96 ms)
[ RUN      ] Subprocess.output
[       OK ] Subprocess.output (64 ms)
[ RUN      ] Subprocess.input
[       OK ] Subprocess.input (34 ms)
[ RUN      ] Subprocess.splice
[       OK ] Subprocess.splice (42 ms)
[ RUN      ] Subprocess.env
[       OK ] Subprocess.env (75 ms)
[----------] 5 tests from Subprocess (311 ms total)

[----------] 3 tests from TimeSeries
[ RUN      ] TimeSeries.set
[       OK ] TimeSeries.set (0 ms)
[ RUN      ] TimeSeries.sparsify
[       OK ] TimeSeries.sparsify (0 ms)
[ RUN      ] TimeSeries.truncate
[       OK ] TimeSeries.truncate (0 ms)
[----------] 3 tests from TimeSeries (0 ms total)

[----------] 3 tests from TimeTest
[ RUN      ] TimeTest.Arithmetic
[       OK ] TimeTest.Arithmetic (0 ms)
[ RUN      ] TimeTest.Now
[       OK ] TimeTest.Now (0 ms)
[ RUN      ] TimeTest.Output
[       OK ] TimeTest.Output (0 ms)
[----------] 3 tests from TimeTest (0 ms total)

[----------] Global test environment tear-down
[==========] 80 tests from 13 test cases ran. (605 ms total)
[  PASSED  ] 80 tests.

  YOU HAVE 2 DISABLED TESTS

make[5]: Leaving directory `/x1/jenkins/jenkins-slave/workspace/mesos-reviewbot/3rdparty/libprocess'
make[4]: Leaving directory `/x1/jenkins/jenkins-slave/workspace/mesos-reviewbot/3rdparty/libprocess'
make[3]: Leaving directory `/x1/jenkins/jenkins-slave/workspace/mesos-reviewbot/3rdparty/libprocess'
make[3]: Entering directory `/x1/jenkins/jenkins-slave/workspace/mesos-reviewbot/3rdparty'
cd leveldb && \
          make  CC="gcc" CXX="g++" OPT="-g -g2 -O2 -std=c++0x -fPIC"
make[4]: Entering directory `/x1/jenkins/jenkins-slave/workspace/mesos-reviewbot/3rdparty/leveldb'
make[4]: Nothing to be done for `default'.
make[4]: Leaving directory `/x1/jenkins/jenkins-slave/workspace/mesos-reviewbot/3rdparty/leveldb'
make[3]: Leaving directory `/x1/jenkins/jenkins-slave/workspace/mesos-reviewbot/3rdparty'
make[2]: Leaving directory `/x1/jenkins/jenkins-slave/workspace/mesos-reviewbot/3rdparty'
make[1]: Leaving directory `/x1/jenkins/jenkins-slave/workspace/mesos-reviewbot/3rdparty'
Making check in src
make[1]: Entering directory `/x1/jenkins/jenkins-slave/workspace/mesos-reviewbot/src'
make  check-am
make[2]: Entering directory `/x1/jenkins/jenkins-slave/workspace/mesos-reviewbot/src'
make  test-framework test-executor long-lived-framework long-lived-executor no-executor-framework balloon-framework balloon-executor mesos-tests  examples/python/test_framework.py examples/python/test-framework examples/python/test_executor.py examples/python/test-executor \
	  tests/balloon_framework_test.sh tests/test_framework_test.sh tests/no_executor_framework_test.sh tests/java_exception_test.sh tests/java_framework_test.sh tests/java_log_test.sh tests/python_framework_test.sh
make[3]: Entering directory `/x1/jenkins/jenkins-slave/workspace/mesos-reviewbot/src'
make[3]: `test-framework' is up to date.
make[3]: `test-executor' is up to date.
make[3]: `long-lived-framework' is up to date.
make[3]: `long-lived-executor' is up to date.
make[3]: `no-executor-framework' is up to date.
make[3]: `balloon-framework' is up to date.
make[3]: `balloon-executor' is up to date.
make[3]: `mesos-tests' is up to date.
make[3]: Nothing to be done for `examples/python/test_framework.py'.
make[3]: Nothing to be done for `examples/python/test-framework'.
make[3]: Nothing to be done for `examples/python/test_executor.py'.
make[3]: Nothing to be done for `examples/python/test-executor'.
make[3]: Nothing to be done for `tests/balloon_framework_test.sh'.
make[3]: Nothing to be done for `tests/test_framework_test.sh'.
make[3]: Nothing to be done for `tests/no_executor_framework_test.sh'.
make[3]: Nothing to be done for `tests/java_exception_test.sh'.
make[3]: Nothing to be done for `tests/java_framework_test.sh'.
make[3]: Nothing to be done for `tests/java_log_test.sh'.
make[3]: Nothing to be done for `tests/python_framework_test.sh'.
make[3]: Leaving directory `/x1/jenkins/jenkins-slave/workspace/mesos-reviewbot/src'
make  check-local
make[3]: Entering directory `/x1/jenkins/jenkins-slave/workspace/mesos-reviewbot/src'
./mesos-tests
Source directory: /x1/jenkins/jenkins-slave/workspace/mesos-reviewbot
Build directory: /x1/jenkins/jenkins-slave/workspace/mesos-reviewbot
Note: Google Test filter = *-CpuIsolatorTest/1.UserCpuUsage:CpuIsolatorTest/1.SystemCpuUsage:LimitedCpuIsolatorTest.ROOT_CGROUPS_Cfs:LimitedCpuIsolatorTest.ROOT_CGROUPS_Cfs_Big_Quota:MemIsolatorTest/0.MemUsage:MemIsolatorTest/1.MemUsage:ContainerizerTest.ROOT_CGROUPS_BalloonFramework:CgroupsAnyHierarchyTest.ROOT_CGROUPS_Enabled:CgroupsAnyHierarchyTest.ROOT_CGROUPS_Subsystems:CgroupsAnyHierarchyTest.ROOT_CGROUPS_Mounted:CgroupsAnyHierarchyTest.ROOT_CGROUPS_Get:CgroupsAnyHierarchyTest.ROOT_CGROUPS_NestedCgroups:CgroupsAnyHierarchyTest.ROOT_CGROUPS_Tasks:CgroupsAnyHierarchyTest.ROOT_CGROUPS_Read:CgroupsAnyHierarchyTest.ROOT_CGROUPS_Write:CgroupsAnyHierarchyTest.ROOT_CGROUPS_Cfs_Big_Quota:CgroupsAnyHierarchyWithCpuMemoryTest.ROOT_CGROUPS_Busy:CgroupsAnyHierarchyWithCpuMemoryTest.ROOT_CGROUPS_SubsystemsHierarchy:CgroupsAnyHierarchyWithCpuMemoryTest.ROOT_CGROUPS_MountedSubsystems:CgroupsAnyHierarchyWithCpuMemoryTest.ROOT_CGROUPS_CreateRemove:CgroupsAnyHierarchyWithCpuMemoryTest.ROOT_CGROUP
 S_Listen:CgroupsNoHierarchyTest.ROOT_CGROUPS_NOHIERARCHY_MountUnmountHierarchy:CgroupsAnyHierarchyWithCpuAcctMemoryTest.ROOT_CGROUPS_Stat:CgroupsAnyHierarchyWithCpuMemoryFreezerTest.ROOT_CGROUPS_Freeze:CgroupsAnyHierarchyWithCpuMemoryFreezerTest.ROOT_CGROUPS_Kill:CgroupsAnyHierarchyWithCpuMemoryFreezerTest.ROOT_CGROUPS_Destroy:
[==========] Running 267 tests from 47 test cases.
[----------] Global test environment set-up.
[----------] 1 test from DRFAllocatorTest
[ RUN      ] DRFAllocatorTest.DRFAllocatorProcess
tests/allocator_tests.cpp:87: Failure
master: 'in_memory' is not a supported option for registry persistence
tests/allocator_tests.cpp:82: Failure
Actual function call count doesn't match EXPECT_CALL(allocator, initialize(_, _, _))...
         Expected: to be called once
           Actual: never called - unsatisfied and active
../3rdparty/libprocess/include/process/gmock.hpp:295: Failure
Actual function call count doesn't match EXPECT_CALL(filter->mock, filter(testing::A<const DispatchEvent&>()))...
    Expected args: dispatch matcher (1-byte object <12>, 16-byte object <50-B7 48-00 00-00 00-00 00-00 00-00 00-00 00-00>)
         Expected: to be called once
           Actual: never called - unsatisfied and active
[  FAILED  ] DRFAllocatorTest.DRFAllocatorProcess (2 ms)
[----------] 1 test from DRFAllocatorTest (2 ms total)

[----------] 2 tests from ReservationAllocatorTest
[ RUN      ] ReservationAllocatorTest.ReservedResources
tests/allocator_tests.cpp:337: Failure
master: 'in_memory' is not a supported option for registry persistence
tests/allocator_tests.cpp:331: Failure
Actual function call count doesn't match EXPECT_CALL(allocator, initialize(_, _, _))...
         Expected: to be called once
           Actual: never called - unsatisfied and active
../3rdparty/libprocess/include/process/gmock.hpp:295: Failure
Actual function call count doesn't match EXPECT_CALL(filter->mock, filter(testing::A<const DispatchEvent&>()))...
    Expected args: dispatch matcher (1-byte object <12>, 16-byte object <50-B7 48-00 00-00 00-00 00-00 00-00 00-00 00-00>)
         Expected: to be called once
           Actual: never called - unsatisfied and active
[  FAILED  ] ReservationAllocatorTest.ReservedResources (1 ms)
[ RUN      ] ReservationAllocatorTest.ResourcesReturned
tests/allocator_tests.cpp:490: Failure
master: 'in_memory' is not a supported option for registry persistence
tests/allocator_tests.cpp:483: Failure
Actual function call count doesn't match EXPECT_CALL(allocator, initialize(_, _, _))...
         Expected: to be called once
           Actual: never called - unsatisfied and active
../3rdparty/libprocess/include/process/gmock.hpp:295: Failure
Actual function call count doesn't match EXPECT_CALL(filter->mock, filter(testing::A<const DispatchEvent&>()))...
    Expected args: dispatch matcher (1-byte object <12>, 16-byte object <50-B7 48-00 00-00 00-00 00-00 00-00 00-00 00-00>)
         Expected: to be called once
           Actual: never called - unsatisfied and active
[  FAILED  ] ReservationAllocatorTest.ResourcesReturned (1 ms)
[----------] 2 tests from ReservationAllocatorTest (2 ms total)

[----------] 10 tests from AllocatorTest/0, where TypeParam = mesos::internal::master::allocator::HierarchicalAllocatorProcess<mesos::internal::master::allocator::DRFSorter, mesos::internal::master::allocator::DRFSorter>
[ RUN      ] AllocatorTest/0.MockAllocator
tests/allocator_tests.cpp:659: Failure
master: 'in_memory' is not a supported option for registry persistence
tests/allocator_tests.cpp:656: Failure
Actual function call count doesn't match EXPECT_CALL(this->allocator, initialize(_, _, _))...
         Expected: to be called once
           Actual: never called - unsatisfied and active
../3rdparty/libprocess/include/process/gmock.hpp:295: Failure
Actual function call count doesn't match EXPECT_CALL(filter->mock, filter(testing::A<const DispatchEvent&>()))...
    Expected args: dispatch matcher (1-byte object <12>, 16-byte object <50-B7 48-00 00-00 00-00 00-00 00-00 00-00 00-00>)
         Expected: to be called once
           Actual: never called - unsatisfied and active
[  FAILED  ] AllocatorTest/0.MockAllocator, where TypeParam = mesos::internal::master::allocator::HierarchicalAllocatorProcess<mesos::internal::master::allocator::DRFSorter, mesos::internal::master::allocator::DRFSorter> (1 ms)
[ RUN      ] AllocatorTest/0.ResourcesUnused
tests/allocator_tests.cpp:715: Failure
master: 'in_memory' is not a supported option for registry persistence
tests/allocator_tests.cpp:712: Failure
Actual function call count doesn't match EXPECT_CALL(this->allocator, initialize(_, _, _))...
         Expected: to be called once
           Actual: never called - unsatisfied and active
../3rdparty/libprocess/include/process/gmock.hpp:295: Failure
Actual function call count doesn't match EXPECT_CALL(filter->mock, filter(testing::A<const DispatchEvent&>()))...
    Expected args: dispatch matcher (1-byte object <12>, 16-byte object <50-B7 48-00 00-00 00-00 00-00 00-00 00-00 00-00>)
         Expected: to be called once
           Actual: never called - unsatisfied and active
[  FAILED  ] AllocatorTest/0.ResourcesUnused, where TypeParam = mesos::internal::master::allocator::HierarchicalAllocatorProcess<mesos::internal::master::allocator::DRFSorter, mesos::internal::master::allocator::DRFSorter> (1 ms)
[ RUN      ] AllocatorTest/0.OutOfOrderDispatch
tests/allocator_tests.cpp:827: Failure
master: 'in_memory' is not a supported option for registry persistence
tests/allocator_tests.cpp:824: Failure
Actual function call count doesn't match EXPECT_CALL(this->allocator, initialize(_, _, _))...
         Expected: to be called once
           Actual: never called - unsatisfied and active
../3rdparty/libprocess/include/process/gmock.hpp:295: Failure
Actual function call count doesn't match EXPECT_CALL(filter->mock, filter(testing::A<const DispatchEvent&>()))...
    Expected args: dispatch matcher (1-byte object <12>, 16-byte object <50-B7 48-00 00-00 00-00 00-00 00-00 00-00 00-00>)
         Expected: to be called once
           Actual: never called - unsatisfied and active
[  FAILED  ] AllocatorTest/0.OutOfOrderDispatch, where TypeParam = mesos::internal::master::allocator::HierarchicalAllocatorProcess<mesos::internal::master::allocator::DRFSorter, mesos::internal::master::allocator::DRFSorter> (1 ms)
[ RUN      ] AllocatorTest/0.SchedulerFailover
tests/allocator_tests.cpp:952: Failure
master: 'in_memory' is not a supported option for registry persistence
tests/allocator_tests.cpp:949: Failure
Actual function call count doesn't match EXPECT_CALL(this->allocator, initialize(_, _, _))...
         Expected: to be called once
           Actual: never called - unsatisfied and active
../3rdparty/libprocess/include/process/gmock.hpp:295: Failure
Actual function call count doesn't match EXPECT_CALL(filter->mock, filter(testing::A<const DispatchEvent&>()))...
    Expected args: dispatch matcher (1-byte object <12>, 16-byte object <50-B7 48-00 00-00 00-00 00-00 00-00 00-00 00-00>)
         Expected: to be called once
           Actual: never called - unsatisfied and active
[  FAILED  ] AllocatorTest/0.SchedulerFailover, where TypeParam = mesos::internal::master::allocator::HierarchicalAllocatorProcess<mesos::internal::master::allocator::DRFSorter, mesos::internal::master::allocator::DRFSorter> (1 ms)
[ RUN      ] AllocatorTest/0.FrameworkExited
tests/allocator_tests.cpp:1081: Failure
master: 'in_memory' is not a supported option for registry persistence
tests/allocator_tests.cpp:1076: Failure
Actual function call count doesn't match EXPECT_CALL(this->allocator, initialize(_, _, _))...
         Expected: to be called once
           Actual: never called - unsatisfied and active
../3rdparty/libprocess/include/process/gmock.hpp:295: Failure
Actual function call count doesn't match EXPECT_CALL(filter->mock, filter(testing::A<const DispatchEvent&>()))...
    Expected args: dispatch matcher (1-byte object <12>, 16-byte object <50-B7 48-00 00-00 00-00 00-00 00-00 00-00 00-00>)
         Expected: to be called once
           Actual: never called - unsatisfied and active
[  FAILED  ] AllocatorTest/0.FrameworkExited, where TypeParam = mesos::internal::master::allocator::HierarchicalAllocatorProcess<mesos::internal::master::allocator::DRFSorter, mesos::internal::master::allocator::DRFSorter> (1 ms)
[ RUN      ] AllocatorTest/0.SlaveLost
tests/allocator_tests.cpp:1230: Failure
master: 'in_memory' is not a supported option for registry persistence
tests/allocator_tests.cpp:1227: Failure
Actual function call count doesn't match EXPECT_CALL(this->allocator, initialize(_, _, _))...
         Expected: to be called once
           Actual: never called - unsatisfied and active
../3rdparty/libprocess/include/process/gmock.hpp:295: Failure
Actual function call count doesn't match EXPECT_CALL(filter->mock, filter(testing::A<const DispatchEvent&>()))...
    Expected args: dispatch matcher (1-byte object <12>, 16-byte object <50-B7 48-00 00-00 00-00 00-00 00-00 00-00 00-00>)
         Expected: to be called once
           Actual: never called - unsatisfied and active
[  FAILED  ] AllocatorTest/0.SlaveLost, where TypeParam = mesos::internal::master::allocator::HierarchicalAllocatorProcess<mesos::internal::master::allocator::DRFSorter, mesos::internal::master::allocator::DRFSorter> (1 ms)
[ RUN      ] AllocatorTest/0.SlaveAdded
tests/allocator_tests.cpp:1341: Failure
master: 'in_memory' is not a supported option for registry persistence
tests/allocator_tests.cpp:1336: Failure
Actual function call count doesn't match EXPECT_CALL(this->allocator, initialize(_, _, _))...
         Expected: to be called once
           Actual: never called - unsatisfied and active
../3rdparty/libprocess/include/process/gmock.hpp:295: Failure
Actual function call count doesn't match EXPECT_CALL(filter->mock, filter(testing::A<const DispatchEvent&>()))...
    Expected args: dispatch matcher (1-byte object <12>, 16-byte object <50-B7 48-00 00-00 00-00 00-00 00-00 00-00 00-00>)
         Expected: to be called once
           Actual: never called - unsatisfied and active
[  FAILED  ] AllocatorTest/0.SlaveAdded, where TypeParam = mesos::internal::master::allocator::HierarchicalAllocatorProcess<mesos::internal::master::allocator::DRFSorter, mesos::internal::master::allocator::DRFSorter> (0 ms)
[ RUN      ] AllocatorTest/0.TaskFinished
tests/allocator_tests.cpp:1442: Failure
master: 'in_memory' is not a supported option for registry persistence
tests/allocator_tests.cpp:1437: Failure
Actual function call count doesn't match EXPECT_CALL(this->allocator, initialize(_, _, _))...
         Expected: to be called once
           Actual: never called - unsatisfied and active
../3rdparty/libprocess/include/process/gmock.hpp:295: Failure
Actual function call count doesn't match EXPECT_CALL(filter->mock, filter(testing::A<const DispatchEvent&>()))...
    Expected args: dispatch matcher (1-byte object <12>, 16-byte object <50-B7 48-00 00-00 00-00 00-00 00-00 00-00 00-00>)
         Expected: to be called once
           Actual: never called - unsatisfied and active
[  FAILED  ] AllocatorTest/0.TaskFinished, where TypeParam = mesos::internal::master::allocator::HierarchicalAllocatorProcess<mesos::internal::master::allocator::DRFSorter, mesos::internal::master::allocator::DRFSorter> (0 ms)
[ RUN      ] AllocatorTest/0.WhitelistSlave
tests/allocator_tests.cpp:1562: Failure
master: 'in_memory' is not a supported option for registry persistence
tests/allocator_tests.cpp:1557: Failure
Actual function call count doesn't match EXPECT_CALL(this->allocator, updateWhitelist(_))...
         Expected: to be called once
           Actual: never called - unsatisfied and active
tests/allocator_tests.cpp:1554: Failure
Actual function call count doesn't match EXPECT_CALL(this->allocator, initialize(_, _, _))...
         Expected: to be called once
           Actual: never called - unsatisfied and active
../3rdparty/libprocess/include/process/gmock.hpp:295: Failure
Actual function call count doesn't match EXPECT_CALL(filter->mock, filter(testing::A<const DispatchEvent&>()))...
    Expected args: dispatch matcher (1-byte object <12>, 16-byte object <50-B7 48-00 00-00 00-00 00-00 00-00 00-00 00-00>)
         Expected: to be called once
           Actual: never called - unsatisfied and active
[  FAILED  ] AllocatorTest/0.WhitelistSlave, where TypeParam = mesos::internal::master::allocator::HierarchicalAllocatorProcess<mesos::internal::master::allocator::DRFSorter, mesos::internal::master::allocator::DRFSorter> (1 ms)
[ RUN      ] AllocatorTest/0.RoleTest
tests/allocator_tests.cpp:1652: Failure
master: 'in_memory' is not a supported option for registry persistence
tests/allocator_tests.cpp:1647: Failure
Actual function call count doesn't match EXPECT_CALL(this->allocator, initialize(_, _, _))...
         Expected: to be called once
           Actual: never called - unsatisfied and active
../3rdparty/libprocess/include/process/gmock.hpp:295: Failure
Actual function call count doesn't match EXPECT_CALL(filter->mock, filter(testing::A<const DispatchEvent&>()))...
    Expected args: dispatch matcher (1-byte object <12>, 16-byte object <50-B7 48-00 00-00 00-00 00-00 00-00 00-00 00-00>)
         Expected: to be called once
           Actual: never called - unsatisfied and active
[  FAILED  ] AllocatorTest/0.RoleTest, where TypeParam = mesos::internal::master::allocator::HierarchicalAllocatorProcess<mesos::internal::master::allocator::DRFSorter, mesos::internal::master::allocator::DRFSorter> (1 ms)
[----------] 10 tests from AllocatorTest/0 (9 ms total)

[----------] 2 tests from AttributesTest
[ RUN      ] AttributesTest.Parsing
[       OK ] AttributesTest.Parsing (0 ms)
[ RUN      ] AttributesTest.Equality
[       OK ] AttributesTest.Equality (0 ms)
[----------] 2 tests from AttributesTest (0 ms total)

[----------] 9 tests from AuthenticationTest
[ RUN      ] AuthenticationTest.UnauthenticatedFramework
tests/authentication_tests.cpp:56: Failure
master: 'in_memory' is not a supported option for registry persistence
../3rdparty/libprocess/include/process/gmock.hpp:295: Failure
Actual function call count doesn't match EXPECT_CALL(filter->mock, filter(testing::A<const DispatchEvent&>()))...
    Expected args: dispatch matcher (1-byte object <12>, 16-byte object <50-B7 48-00 00-00 00-00 00-00 00-00 00-00 00-00>)
         Expected: to be called once
           Actual: never called - unsatisfied and active
[  FAILED  ] AuthenticationTest.UnauthenticatedFramework (1 ms)
[ RUN      ] AuthenticationTest.DisableAuthentication
tests/authentication_tests.cpp:85: Failure
master: 'in_memory' is not a supported option for registry persistence
../3rdparty/libprocess/include/process/gmock.hpp:295: Failure
Actual function call count doesn't match EXPECT_CALL(filter->mock, filter(testing::A<const DispatchEvent&>()))...
    Expected args: dispatch matcher (1-byte object <12>, 16-byte object <50-B7 48-00 00-00 00-00 00-00 00-00 00-00 00-00>)
         Expected: to be called once
           Actual: never called - unsatisfied and active
[  FAILED  ] AuthenticationTest.DisableAuthentication (0 ms)
[ RUN      ] AuthenticationTest.AuthenticatedFramework
tests/authentication_tests.cpp:115: Failure
master: 'in_memory' is not a supported option for registry persistence
../3rdparty/libprocess/include/process/gmock.hpp:295: Failure
Actual function call count doesn't match EXPECT_CALL(filter->mock, filter(testing::A<const DispatchEvent&>()))...
    Expected args: dispatch matcher (1-byte object <12>, 16-byte object <50-B7 48-00 00-00 00-00 00-00 00-00 00-00 00-00>)
         Expected: to be called once
           Actual: never called - unsatisfied and active
[  FAILED  ] AuthenticationTest.AuthenticatedFramework (1 ms)
[ RUN      ] AuthenticationTest.RetryAuthentication
tests/authentication_tests.cpp:143: Failure
master: 'in_memory' is not a supported option for registry persistence
../3rdparty/libprocess/include/process/gmock.hpp:295: Failure
Actual function call count doesn't match EXPECT_CALL(filter->mock, filter(testing::A<const DispatchEvent&>()))...
    Expected args: dispatch matcher (1-byte object <12>, 16-byte object <50-B7 48-00 00-00 00-00 00-00 00-00 00-00 00-00>)
         Expected: to be called once
           Actual: never called - unsatisfied and active
[  FAILED  ] AuthenticationTest.RetryAuthentication (0 ms)
[ RUN      ] AuthenticationTest.DropIntermediateSASLMessage
tests/authentication_tests.cpp:183: Failure
master: 'in_memory' is not a supported option for registry persistence
../3rdparty/libprocess/include/process/gmock.hpp:295: Failure
Actual function call count doesn't match EXPECT_CALL(filter->mock, filter(testing::A<const DispatchEvent&>()))...
    Expected args: dispatch matcher (1-byte object <12>, 16-byte object <50-B7 48-00 00-00 00-00 00-00 00-00 00-00 00-00>)
         Expected: to be called once
           Actual: never called - unsatisfied and active
[  FAILED  ] AuthenticationTest.DropIntermediateSASLMessage (1 ms)
[ RUN      ] AuthenticationTest.DropFinalSASLMessage
tests/authentication_tests.cpp:232: Failure
master: 'in_memory' is not a supported option for registry persistence
../3rdparty/libprocess/include/process/gmock.hpp:295: Failure
Actual function call count doesn't match EXPECT_CALL(filter->mock, filter(testing::A<const DispatchEvent&>()))...
    Expected args: dispatch matcher (1-byte object <12>, 16-byte object <50-B7 48-00 00-00 00-00 00-00 00-00 00-00 00-00>)
         Expected: to be called once
           Actual: never called - unsatisfied and active
[  FAILED  ] AuthenticationTest.DropFinalSASLMessage (0 ms)
[ RUN      ] AuthenticationTest.MasterFailover
tests/authentication_tests.cpp:278: Failure
master: 'in_memory' is not a supported option for registry persistence
../3rdparty/libprocess/include/process/gmock.hpp:295: Failure
Actual function call count doesn't match EXPECT_CALL(filter->mock, filter(testing::A<const DispatchEvent&>()))...
    Expected args: dispatch matcher (1-byte object <12>, 16-byte object <50-B7 48-00 00-00 00-00 00-00 00-00 00-00 00-00>)
         Expected: to be called once
           Actual: never called - unsatisfied and active
[  FAILED  ] AuthenticationTest.MasterFailover (1 ms)
[ RUN      ] AuthenticationTest.LeaderElection
tests/authentication_tests.cpp:322: Failure
master: 'in_memory' is not a supported option for registry persistence
../3rdparty/libprocess/include/process/gmock.hpp:295: Failure
Actual function call count doesn't match EXPECT_CALL(filter->mock, filter(testing::A<const DispatchEvent&>()))...
    Expected args: dispatch matcher (1-byte object <12>, 16-byte object <50-B7 48-00 00-00 00-00 00-00 00-00 00-00 00-00>)
         Expected: to be called once
           Actual: never called - unsatisfied and active
[  FAILED  ] AuthenticationTest.LeaderElection (0 ms)
[ RUN      ] AuthenticationTest.SchedulerFailover
tests/authentication_tests.cpp:361: Failure
master: 'in_memory' is not a supported option for registry persistence
../3rdparty/libprocess/include/process/gmock.hpp:295: Failure
Actual function call count doesn't match EXPECT_CALL(filter->mock, filter(testing::A<const DispatchEvent&>()))...
    Expected args: dispatch matcher (1-byte object <12>, 16-byte object <50-B7 48-00 00-00 00-00 00-00 00-00 00-00 00-00>)
         Expected: to be called once
           Actual: never called - unsatisfied and active
[  FAILED  ] AuthenticationTest.SchedulerFailover (1 ms)
[----------] 9 tests from AuthenticationTest (5 ms total)

[----------] 5 tests from MesosContainerizerProcessTest
[ RUN      ] MesosContainerizerProcessTest.Simple
[       OK ] MesosContainerizerProcessTest.Simple (0 ms)
[ RUN      ] MesosContainerizerProcessTest.MultipleURIs
[       OK ] MesosContainerizerProcessTest.MultipleURIs (0 ms)
[ RUN      ] MesosContainerizerProcessTest.NoUser
[       OK ] MesosContainerizerProcessTest.NoUser (0 ms)
[ RUN      ] MesosContainerizerProcessTest.EmptyHadoop
[       OK ] MesosContainerizerProcessTest.EmptyHadoop (0 ms)
[ RUN      ] MesosContainerizerProcessTest.NoHadoop
[       OK ] MesosContainerizerProcessTest.NoHadoop (1 ms)
[----------] 5 tests from MesosContainerizerProcessTest (1 ms total)

[----------] 6 tests from ExamplesTest
[ RUN      ] ExamplesTest.TestFramework
tests/script.cpp:78: Failure
Failed
test_framework_test.sh exited with status 1
[  FAILED  ] ExamplesTest.TestFramework (222 ms)
[ RUN      ] ExamplesTest.NoExecutorFramework
tests/script.cpp:78: Failure
Failed
no_executor_framework_test.sh exited with status 1
[  FAILED  ] ExamplesTest.NoExecutorFramework (321 ms)
[ RUN      ] ExamplesTest.JavaFramework
tests/script.cpp:78: Failure
Failed
java_framework_test.sh exited with status 1
[  FAILED  ] ExamplesTest.JavaFramework (142 ms)
[ RUN      ] ExamplesTest.JavaException
tests/script.cpp:78: Failure
Failed
java_exception_test.sh exited with status 1
[  FAILED  ] ExamplesTest.JavaException (125 ms)
[ RUN      ] ExamplesTest.JavaLog
[       OK ] ExamplesTest.JavaLog (1986 ms)
[ RUN      ] ExamplesTest.PythonFramework
tests/script.cpp:78: Failure
Failed
python_framework_test.sh exited with status 1
[  FAILED  ] ExamplesTest.PythonFramework (1550 ms)
[----------] 6 tests from ExamplesTest (4346 ms total)

[----------] 3 tests from ExceptionTest
[ RUN      ] ExceptionTest.DeactivateFrameworkOnAbort
tests/exception_tests.cpp:64: Failure
master: 'in_memory' is not a supported option for registry persistence
../3rdparty/libprocess/include/process/gmock.hpp:295: Failure
Actual function call count doesn't match EXPECT_CALL(filter->mock, filter(testing::A<const DispatchEvent&>()))...
    Expected args: dispatch matcher (1-byte object <12>, 16-byte object <50-B7 48-00 00-00 00-00 00-00 00-00 00-00 00-00>)
         Expected: to be called once
           Actual: never called - unsatisfied and active
[  FAILED  ] ExceptionTest.DeactivateFrameworkOnAbort (1 ms)
[ RUN      ] ExceptionTest.DisallowSchedulerActionsOnAbort
tests/exception_tests.cpp:103: Failure
master: 'in_memory' is not a supported option for registry persistence
../3rdparty/libprocess/include/process/gmock.hpp:295: Failure
Actual function call count doesn't match EXPECT_CALL(filter->mock, filter(testing::A<const DispatchEvent&>()))...
    Expected args: dispatch matcher (1-byte object <12>, 16-byte object <50-B7 48-00 00-00 00-00 00-00 00-00 00-00 00-00>)
         Expected: to be called once
           Actual: never called - unsatisfied and active
[  FAILED  ] ExceptionTest.DisallowSchedulerActionsOnAbort (1 ms)
[ RUN      ] ExceptionTest.DisallowSchedulerCallbacksOnAbort
tests/exception_tests.cpp:139: Failure
master: 'in_memory' is not a supported option for registry persistence
../3rdparty/libprocess/include/process/gmock.hpp:295: Failure
Actual function call count doesn't match EXPECT_CALL(filter->mock, filter(testing::A<const DispatchEvent&>()))...
    Expected args: dispatch matcher (1-byte object <12>, 16-byte object <50-B7 48-00 00-00 00-00 00-00 00-00 00-00 00-00>)
         Expected: to be called once
           Actual: never called - unsatisfied and active
[  FAILED  ] ExceptionTest.DisallowSchedulerCallbacksOnAbort (0 ms)
[----------] 3 tests from ExceptionTest (2 ms total)

[----------] 24 tests from FaultToleranceTest
[ RUN      ] FaultToleranceTest.SlaveLost
tests/fault_tolerance_tests.cpp:93: Failure
master: 'in_memory' is not a supported option for registry persistence
../3rdparty/libprocess/include/process/gmock.hpp:295: Failure
Actual function call count doesn't match EXPECT_CALL(filter->mock, filter(testing::A<const DispatchEvent&>()))...
    Expected args: dispatch matcher (1-byte object <12>, 16-byte object <50-B7 48-00 00-00 00-00 00-00 00-00 00-00 00-00>)
         Expected: to be called once
           Actual: never called - unsatisfied and active
[  FAILED  ] FaultToleranceTest.SlaveLost (1 ms)
[ RUN      ] FaultToleranceTest.PartitionedSlave
tests/fault_tolerance_tests.cpp:139: Failure
master: 'in_memory' is not a supported option for registry persistence
../3rdparty/libprocess/include/process/gmock.hpp:295: Failure
Actual function call count doesn't match EXPECT_CALL(filter->mock, filter(testing::A<const DispatchEvent&>()))...
    Expected args: dispatch matcher (1-byte object <12>, 16-byte object <50-B7 48-00 00-00 00-00 00-00 00-00 00-00 00-00>)
         Expected: to be called once
           Actual: never called - unsatisfied and active
[  FAILED  ] FaultToleranceTest.PartitionedSlave (0 ms)
[ RUN      ] FaultToleranceTest.PartitionedSlaveReregistration
tests/fault_tolerance_tests.cpp:214: Failure
master: 'in_memory' is not a supported option for registry persistence
../3rdparty/libprocess/include/process/gmock.hpp:295: Failure
Actual function call count doesn't match EXPECT_CALL(filter->mock, filter(testing::A<const DispatchEvent&>()))...
    Expected args: dispatch matcher (1-byte object <12>, 16-byte object <50-B7 48-00 00-00 00-00 00-00 00-00 00-00 00-00>)
         Expected: to be called once
           Actual: never called - unsatisfied and active
[  FAILED  ] FaultToleranceTest.PartitionedSlaveReregistration (1 ms)
[ RUN      ] FaultToleranceTest.PartitionedSlaveStatusUpdates
tests/fault_tolerance_tests.cpp:366: Failure
master: 'in_memory' is not a supported option for registry persistence
../3rdparty/libprocess/include/process/gmock.hpp:295: Failure
Actual function call count doesn't match EXPECT_CALL(filter->mock, filter(testing::A<const DispatchEvent&>()))...
    Expected args: dispatch matcher (1-byte object <12>, 16-byte object <50-B7 48-00 00-00 00-00 00-00 00-00 00-00 00-00>)
         Expected: to be called once
           Actual: never called - unsatisfied and active
[  FAILED  ] FaultToleranceTest.PartitionedSlaveStatusUpdates (0 ms)
[ RUN      ] FaultToleranceTest.PartitionedSlaveExitedExecutor
tests/fault_tolerance_tests.cpp:478: Failure
master: 'in_memory' is not a supported option for registry persistence
../3rdparty/libprocess/include/process/gmock.hpp:295: Failure
Actual function call count doesn't match EXPECT_CALL(filter->mock, filter(testing::A<const DispatchEvent&>()))...
    Expected args: dispatch matcher (1-byte object <12>, 16-byte object <50-B7 48-00 00-00 00-00 00-00 00-00 00-00 00-00>)
         Expected: to be called once
           Actual: never called - unsatisfied and active
[  FAILED  ] FaultToleranceTest.PartitionedSlaveExitedExecutor (1 ms)
[ RUN      ] FaultToleranceTest.MasterFailover
tests/fault_tolerance_tests.cpp:609: Failure
master: 'in_memory' is not a supported option for registry persistence
../3rdparty/libprocess/include/process/gmock.hpp:295: Failure
Actual function call count doesn't match EXPECT_CALL(filter->mock, filter(testing::A<const DispatchEvent&>()))...
    Expected args: dispatch matcher (1-byte object <12>, 16-byte object <50-B7 48-00 00-00 00-00 00-00 00-00 00-00 00-00>)
         Expected: to be called once
           Actual: never called - unsatisfied and active
[  FAILED  ] FaultToleranceTest.MasterFailover (1 ms)
[ RUN      ] FaultToleranceTest.ReregisterCompletedFrameworks
tests/fault_tolerance_tests.cpp:679: Failure
master: 'in_memory' is not a supported option for registry persistence
../3rdparty/libprocess/include/process/gmock.hpp:295: Failure
Actual function call count doesn't match EXPECT_CALL(filter->mock, filter(testing::A<const DispatchEvent&>()))...
    Expected args: dispatch matcher (1-byte object <12>, 16-byte object <50-B7 48-00 00-00 00-00 00-00 00-00 00-00 00-00>)
         Expected: to be called once
           Actual: never called - unsatisfied and active
[  FAILED  ] FaultToleranceTest.ReregisterCompletedFrameworks (0 ms)
[ RUN      ] FaultToleranceTest.SchedulerFailover
tests/fault_tolerance_tests.cpp:827: Failure
master: 'in_memory' is not a supported option for registry persistence
../3rdparty/libprocess/include/process/gmock.hpp:295: Failure
Actual function call count doesn't match EXPECT_CALL(filter->mock, filter(testing::A<const DispatchEvent&>()))...
    Expected args: dispatch matcher (1-byte object <12>, 16-byte object <50-B7 48-00 00-00 00-00 00-00 00-00 00-00 00-00>)
         Expected: to be called once
           Actual: never called - unsatisfied and active
[  FAILED  ] FaultToleranceTest.SchedulerFailover (0 ms)
[ RUN      ] FaultToleranceTest.SchedulerFailoverRetriedReregistration
tests/fault_tolerance_tests.cpp:906: Failure
master: 'in_memory' is not a supported option for registry persistence
../3rdparty/libprocess/include/process/gmock.hpp:295: Failure
Actual function call count doesn't match EXPECT_CALL(filter->mock, filter(testing::A<const DispatchEvent&>()))...
    Expected args: dispatch matcher (1-byte object <12>, 16-byte object <50-B7 48-00 00-00 00-00 00-00 00-00 00-00 00-00>)
         Expected: to be called once
           Actual: never called - unsatisfied and active
[  FAILED  ] FaultToleranceTest.SchedulerFailoverRetriedReregistration (1 ms)
[ RUN      ] FaultToleranceTest.FrameworkReliableRegistration
tests/fault_tolerance_tests.cpp:984: Failure
master: 'in_memory' is not a supported option for registry persistence
../3rdparty/libprocess/include/process/gmock.hpp:295: Failure
Actual function call count doesn't match EXPECT_CALL(filter->mock, filter(testing::A<const DispatchEvent&>()))...
    Expected args: dispatch matcher (1-byte object <12>, 16-byte object <50-B7 48-00 00-00 00-00 00-00 00-00 00-00 00-00>)
         Expected: to be called once
           Actual: never called - unsatisfied and active
[  FAILED  ] FaultToleranceTest.FrameworkReliableRegistration (0 ms)
[ RUN      ] FaultToleranceTest.FrameworkReregister
tests/fault_tolerance_tests.cpp:1035: Failure
master: 'in_memory' is not a supported option for registry persistence
../3rdparty/libprocess/include/process/gmock.hpp:295: Failure
Actual function call count doesn't match EXPECT_CALL(filter->mock, filter(testing::A<const DispatchEvent&>()))...
    Expected args: dispatch matcher (1-byte object <12>, 16-byte object <50-B7 48-00 00-00 00-00 00-00 00-00 00-00 00-00>)
         Expected: to be called once
           Actual: never called - unsatisfied and active
[  FAILED  ] FaultToleranceTest.FrameworkReregister (1 ms)
[ RUN      ] FaultToleranceTest.TaskLost
tests/fault_tolerance_tests.cpp:1095: Failure
master: 'in_memory' is not a supported option for registry persistence
../3rdparty/libprocess/include/process/gmock.hpp:295: Failure
Actual function call count doesn't match EXPECT_CALL(filter->mock, filter(testing::A<const DispatchEvent&>()))...
    Expected args: dispatch matcher (1-byte object <12>, 16-byte object <50-B7 48-00 00-00 00-00 00-00 00-00 00-00 00-00>)
         Expected: to be called once
           Actual: never called - unsatisfied and active
[  FAILED  ] FaultToleranceTest.TaskLost (0 ms)
[ RUN      ] FaultToleranceTest.SchedulerFailoverStatusUpdate
tests/fault_tolerance_tests.cpp:1162: Failure
master: 'in_memory' is not a supported option for registry persistence
../3rdparty/libprocess/include/process/gmock.hpp:295: Failure
Actual function call count doesn't match EXPECT_CALL(filter->mock, filter(testing::A<const DispatchEvent&>()))...
    Expected args: dispatch matcher (1-byte object <12>, 16-byte object <50-B7 48-00 00-00 00-00 00-00 00-00 00-00 00-00>)
         Expected: to be called once
           Actual: never called - unsatisfied and active
[  FAILED  ] FaultToleranceTest.SchedulerFailoverStatusUpdate (0 ms)
[ RUN      ] FaultToleranceTest.ReregisterFrameworkExitedExecutor
tests/fault_tolerance_tests.cpp:1278: Failure
master: 'in_memory' is not a supported option for registry persistence
../3rdparty/libprocess/include/process/gmock.hpp:295: Failure
Actual function call count doesn't match EXPECT_CALL(filter->mock, filter(testing::A<const DispatchEvent&>()))...
    Expected args: dispatch matcher (1-byte object <12>, 16-byte object <50-B7 48-00 00-00 00-00 00-00 00-00 00-00 00-00>)
         Expected: to be called once
           Actual: never called - unsatisfied and active
[  FAILED  ] FaultToleranceTest.ReregisterFrameworkExitedExecutor (1 ms)
[ RUN      ] FaultToleranceTest.ForwardStatusUpdateUnknownExecutor
tests/fault_tolerance_tests.cpp:1381: Failure
master: 'in_memory' is not a supported option for registry persistence
../3rdparty/libprocess/include/process/gmock.hpp:295: Failure
Actual function call count doesn't match EXPECT_CALL(filter->mock, filter(testing::A<const DispatchEvent&>()))...
    Expected args: dispatch matcher (1-byte object <12>, 16-byte object <50-B7 48-00 00-00 00-00 00-00 00-00 00-00 00-00>)
         Expected: to be called once
           Actual: never called - unsatisfied and active
[  FAILED  ] FaultToleranceTest.ForwardStatusUpdateUnknownExecutor (0 ms)
[ RUN      ] FaultToleranceTest.SchedulerFailoverFrameworkMessage
tests/fault_tolerance_tests.cpp:1462: Failure
master: 'in_memory' is not a supported option for registry persistence
../3rdparty/libprocess/include/process/gmock.hpp:295: Failure
Actual function call count doesn't match EXPECT_CALL(filter->mock, filter(testing::A<const DispatchEvent&>()))...
    Expected args: dispatch matcher (1-byte object <12>, 16-byte object <50-B7 48-00 00-00 00-00 00-00 00-00 00-00 00-00>)
         Expected: to be called once
           Actual: never called - unsatisfied and active
[  FAILED  ] FaultToleranceTest.SchedulerFailoverFrameworkMessage (0 ms)
[ RUN      ] FaultToleranceTest.IgnoreKillTaskFromUnregisteredFramework
tests/fault_tolerance_tests.cpp:1571: Failure
master: 'in_memory' is not a supported option for registry persistence
../3rdparty/libprocess/include/process/gmock.hpp:295: Failure
Actual function call count doesn't match EXPECT_CALL(filter->mock, filter(testing::A<const DispatchEvent&>()))...
    Expected args: dispatch matcher (1-byte object <12>, 16-byte object <50-B7 48-00 00-00 00-00 00-00 00-00 00-00 00-00>)
         Expected: to be called once
           Actual: never called - unsatisfied and active
[  FAILED  ] FaultToleranceTest.IgnoreKillTaskFromUnregisteredFramework (0 ms)
[ RUN      ] FaultToleranceTest.SchedulerExit
tests/fault_tolerance_tests.cpp:1692: Failure
master: 'in_memory' is not a supported option for registry persistence
../3rdparty/libprocess/include/process/gmock.hpp:295: Failure
Actual function call count doesn't match EXPECT_CALL(filter->mock, filter(testing::A<const DispatchEvent&>()))...
    Expected args: dispatch matcher (1-byte object <12>, 16-byte object <50-B7 48-00 00-00 00-00 00-00 00-00 00-00 00-00>)
         Expected: to be called once
           Actual: never called - unsatisfied and active
[  FAILED  ] FaultToleranceTest.SchedulerExit (0 ms)
[ RUN      ] FaultToleranceTest.SlaveReliableRegistration
tests/fault_tolerance_tests.cpp:1754: Failure
master: 'in_memory' is not a supported option for registry persistence
../3rdparty/libprocess/include/process/gmock.hpp:295: Failure
Actual function call count doesn't match EXPECT_CALL(filter->mock, filter(testing::A<const DispatchEvent&>()))...
    Expected args: dispatch matcher (1-byte object <12>, 16-byte object <50-B7 48-00 00-00 00-00 00-00 00-00 00-00 00-00>)
         Expected: to be called once
           Actual: never called - unsatisfied and active
[  FAILED  ] FaultToleranceTest.SlaveReliableRegistration (1 ms)
[ RUN      ] FaultToleranceTest.SlaveReregisterOnZKExpiration
tests/fault_tolerance_tests.cpp:1799: Failure
master: 'in_memory' is not a supported option for registry persistence
../3rdparty/libprocess/include/process/gmock.hpp:295: Failure
Actual function call count doesn't match EXPECT_CALL(filter->mock, filter(testing::A<const DispatchEvent&>()))...
    Expected args: dispatch matcher (1-byte object <12>, 16-byte object <50-B7 48-00 00-00 00-00 00-00 00-00 00-00 00-00>)
         Expected: to be called once
           Actual: never called - unsatisfied and active
[  FAILED  ] FaultToleranceTest.SlaveReregisterOnZKExpiration (0 ms)
[ RUN      ] FaultToleranceTest.SlaveReregisterTerminatedExecutor
tests/fault_tolerance_tests.cpp:1849: Failure
master: 'in_memory' is not a supported option for registry persistence
../3rdparty/libprocess/include/process/gmock.hpp:295: Failure
Actual function call count doesn't match EXPECT_CALL(filter->mock, filter(testing::A<const DispatchEvent&>()))...
    Expected args: dispatch matcher (1-byte object <12>, 16-byte object <50-B7 48-00 00-00 00-00 00-00 00-00 00-00 00-00>)
         Expected: to be called once
           Actual: never called - unsatisfied and active
[  FAILED  ] FaultToleranceTest.SlaveReregisterTerminatedExecutor (0 ms)
[ RUN      ] FaultToleranceTest.ReconcileLostTasks
tests/fault_tolerance_tests.cpp:1923: Failure
master: 'in_memory' is not a supported option for registry persistence
../3rdparty/libprocess/include/process/gmock.hpp:295: Failure
Actual function call count doesn't match EXPECT_CALL(filter->mock, filter(testing::A<const DispatchEvent&>()))...
    Expected args: dispatch matcher (1-byte object <12>, 16-byte object <50-B7 48-00 00-00 00-00 00-00 00-00 00-00 00-00>)
         Expected: to be called once
           Actual: never called - unsatisfied and active
[  FAILED  ] FaultToleranceTest.ReconcileLostTasks (1 ms)
[ RUN      ] FaultToleranceTest.ReconcileIncompleteTasks
tests/fault_tolerance_tests.cpp:1997: Failure
master: 'in_memory' is not a supported option for registry persistence
../3rdparty/libprocess/include/process/gmock.hpp:295: Failure
Actual function call count doesn't match EXPECT_CALL(filter->mock, filter(testing::A<const DispatchEvent&>()))...
    Expected args: dispatch matcher (1-byte object <12>, 16-byte object <50-B7 48-00 00-00 00-00 00-00 00-00 00-00 00-00>)
         Expected: to be called once
           Actual: never called - unsatisfied and active
[  FAILED  ] FaultToleranceTest.ReconcileIncompleteTasks (0 ms)
[ RUN      ] FaultToleranceTest.SplitBrainMasters
tests/fault_tolerance_tests.cpp:2099: Failure
master: 'in_memory' is not a supported option for registry persistence
../3rdparty/libprocess/include/process/gmock.hpp:295: Failure
Actual function call count doesn't match EXPECT_CALL(filter->mock, filter(testing::A<const DispatchEvent&>()))...
    Expected args: dispatch matcher (1-byte object <12>, 16-byte object <50-B7 48-00 00-00 00-00 00-00 00-00 00-00 00-00>)
         Expected: to be called once
           Actual: never called - unsatisfied and active
[  FAILED  ] FaultToleranceTest.SplitBrainMasters (0 ms)
[----------] 24 tests from FaultToleranceTest (11 ms total)

[----------] 6 tests from FilesTest
[ RUN      ] FilesTest.AttachTest
[       OK ] FilesTest.AttachTest (1 ms)
[ RUN      ] FilesTest.DetachTest
[       OK ] FilesTest.DetachTest (1 ms)
[ RUN      ] FilesTest.ReadTest
[       OK ] FilesTest.ReadTest (4 ms)
[ RUN      ] FilesTest.ResolveTest
[       OK ] FilesTest.ResolveTest (5 ms)
[ RUN      ] FilesTest.BrowseTest
[       OK ] FilesTest.BrowseTest (4 ms)
[ RUN      ] FilesTest.DownloadTest
[       OK ] FilesTest.DownloadTest (2 ms)
[----------] 6 tests from FilesTest (17 ms total)

[----------] 3 tests from GarbageCollectorTest
[ RUN      ] GarbageCollectorTest.Schedule
[       OK ] GarbageCollectorTest.Schedule (91 ms)
[ RUN      ] GarbageCollectorTest.Unschedule
[       OK ] GarbageCollectorTest.Unschedule (75 ms)
[ RUN      ] GarbageCollectorTest.Prune
[       OK ] GarbageCollectorTest.Prune (52 ms)
[----------] 3 tests from GarbageCollectorTest (218 ms total)

[----------] 5 tests from GarbageCollectorIntegrationTest
[ RUN      ] GarbageCollectorIntegrationTest.Restart
tests/gc_tests.cpp:255: Failure
master: 'in_memory' is not a supported option for registry persistence
../3rdparty/libprocess/include/process/gmock.hpp:295: Failure
Actual function call count doesn't match EXPECT_CALL(filter->mock, filter(testing::A<const DispatchEvent&>()))...
    Expected args: dispatch matcher (1-byte object <12>, 16-byte object <50-B7 48-00 00-00 00-00 00-00 00-00 00-00 00-00>)
         Expected: to be called once
           Actual: never called - unsatisfied and active
[  FAILED  ] GarbageCollectorIntegrationTest.Restart (1 ms)
[ RUN      ] GarbageCollectorIntegrationTest.ExitedFramework
tests/gc_tests.cpp:356: Failure
master: 'in_memory' is not a supported option for registry persistence
../3rdparty/libprocess/include/process/gmock.hpp:295: Failure
Actual function call count doesn't match EXPECT_CALL(filter->mock, filter(testing::A<const DispatchEvent&>()))...
    Expected args: dispatch matcher (1-byte object <12>, 16-byte object <50-B7 48-00 00-00 00-00 00-00 00-00 00-00 00-00>)
         Expected: to be called once
           Actual: never called - unsatisfied and active
[  FAILED  ] GarbageCollectorIntegrationTest.ExitedFramework (1 ms)
[ RUN      ] GarbageCollectorIntegrationTest.ExitedExecutor
tests/gc_tests.cpp:469: Failure
master: 'in_memory' is not a supported option for registry persistence
../3rdparty/libprocess/include/process/gmock.hpp:295: Failure
Actual function call count doesn't match EXPECT_CALL(filter->mock, filter(testing::A<const DispatchEvent&>()))...
    Expected args: dispatch matcher (1-byte object <12>, 16-byte object <50-B7 48-00 00-00 00-00 00-00 00-00 00-00 00-00>)
         Expected: to be called once
           Actual: never called - unsatisfied and active
[  FAILED  ] GarbageCollectorIntegrationTest.ExitedExecutor (1 ms)
[ RUN      ] GarbageCollectorIntegrationTest.DiskUsage
tests/gc_tests.cpp:568: Failure
master: 'in_memory' is not a supported option for registry persistence
../3rdparty/libprocess/include/process/gmock.hpp:295: Failure
Actual function call count doesn't match EXPECT_CALL(filter->mock, filter(testing::A<const DispatchEvent&>()))...
    Expected args: dispatch matcher (1-byte object <12>, 16-byte object <50-B7 48-00 00-00 00-00 00-00 00-00 00-00 00-00>)
         Expected: to be called once
           Actual: never called - unsatisfied and active
[  FAILED  ] GarbageCollectorIntegrationTest.DiskUsage (0 ms)
[ RUN      ] GarbageCollectorIntegrationTest.Unschedule
tests/gc_tests.cpp:679: Failure
master: 'in_memory' is not a supported option for registry persistence
../3rdparty/libprocess/include/process/gmock.hpp:295: Failure
Actual function call count doesn't match EXPECT_CALL(filter->mock, filter(testing::A<const DispatchEvent&>()))...
    Expected args: dispatch matcher (1-byte object <12>, 16-byte object <50-B7 48-00 00-00 00-00 00-00 00-00 00-00 00-00>)
         Expected: to be called once
           Actual: never called - unsatisfied and active
[  FAILED  ] GarbageCollectorIntegrationTest.Unschedule (0 ms)
[----------] 5 tests from GarbageCollectorIntegrationTest (4 ms total)

[----------] 2 tests from CpuIsolatorTest/0, where TypeParam = mesos::internal::slave::PosixCpuIsolatorProcess
[ RUN      ] CpuIsolatorTest/0.UserCpuUsage
[       OK ] CpuIsolatorTest/0.UserCpuUsage (1005 ms)
[ RUN      ] CpuIsolatorTest/0.SystemCpuUsage
[       OK ] CpuIsolatorTest/0.SystemCpuUsage (1007 ms)
[----------] 2 tests from CpuIsolatorTest/0 (2012 ms total)

[----------] 1 test from NetworkTest
[ RUN      ] NetworkTest.Watch
[       OK ] NetworkTest.Watch (4 ms)
[----------] 1 test from NetworkTest (4 ms total)

[----------] 3 tests from LogStorageTest/0, where TypeParam = mesos::internal::log::LevelDBStorage
[ RUN      ] LogStorageTest/0.Truncate
[       OK ] LogStorageTest/0.Truncate (274 ms)
[ RUN      ] LogStorageTest/0.TruncateWithEmptyLog
[       OK ] LogStorageTest/0.TruncateWithEmptyLog (94 ms)
[ RUN      ] LogStorageTest/0.TruncateWithManyHoles
[       OK ] LogStorageTest/0.TruncateWithManyHoles (86 ms)
[----------] 3 tests from LogStorageTest/0 (455 ms total)

[----------] 4 tests from ReplicaTest
[ RUN      ] ReplicaTest.Promise
[       OK ] ReplicaTest.Promise (237 ms)
[ RUN      ] ReplicaTest.Append
[       OK ] ReplicaTest.Append (238 ms)
[ RUN      ] ReplicaTest.Restore
[       OK ] ReplicaTest.Restore (351 ms)
[ RUN      ] ReplicaTest.NonVoting
[       OK ] ReplicaTest.NonVoting (106 ms)
[----------] 4 tests from ReplicaTest (932 ms total)

[----------] 20 tests from CoordinatorTest
[ RUN      ] CoordinatorTest.Elect
[       OK ] CoordinatorTest.Elect (688 ms)
[ RUN      ] CoordinatorTest.AppendRead
[       OK ] CoordinatorTest.AppendRead (690 ms)
[ RUN      ] CoordinatorTest.AppendReadError
[       OK ] CoordinatorTest.AppendReadError (717 ms)
[ RUN      ] CoordinatorTest.AppendDiscarded
[       OK ] CoordinatorTest.AppendDiscarded (682 ms)
[ RUN      ] CoordinatorTest.ElectNoQuorum
[       OK ] CoordinatorTest.ElectNoQuorum (189 ms)
[ RUN      ] CoordinatorTest.AppendNoQuorum
[       OK ] CoordinatorTest.AppendNoQuorum (670 ms)
[ RUN      ] CoordinatorTest.Failover
[       OK ] CoordinatorTest.Failover (661 ms)
[ RUN      ] CoordinatorTest.Demoted
[       OK ] CoordinatorTest.Demoted (695 ms)
[ RUN      ] CoordinatorTest.Fill
[       OK ] CoordinatorTest.Fill (1121 ms)
[ RUN      ] CoordinatorTest.NotLearnedFill
[       OK ] CoordinatorTest.NotLearnedFill (1129 ms)
[ RUN      ] CoordinatorTest.MultipleAppends
[       OK ] CoordinatorTest.MultipleAppends (1079 ms)
[ RUN      ] CoordinatorTest.MultipleAppendsNotLearnedFill
[       OK ] CoordinatorTest.MultipleAppendsNotLearnedFill (2114 ms)
[ RUN      ] CoordinatorTest.Truncate
[       OK ] CoordinatorTest.Truncate (1102 ms)
[ RUN      ] CoordinatorTest.TruncateNotLearnedFill
[       OK ] CoordinatorTest.TruncateNotLearnedFill (3190 ms)
[ RUN      ] CoordinatorTest.TruncateLearnedFill
[       OK ] CoordinatorTest.TruncateLearnedFill (1843 ms)
[ RUN      ] CoordinatorTest.RacingElect
[       OK ] CoordinatorTest.RacingElect (0 ms)
[ RUN      ] CoordinatorTest.FillNoQuorum
[       OK ] CoordinatorTest.FillNoQuorum (0 ms)
[ RUN      ] CoordinatorTest.FillInconsistent
[       OK ] CoordinatorTest.FillInconsistent (1 ms)
[ RUN      ] CoordinatorTest.LearnedOnOneReplica_NotLearnedOnAnother
[       OK ] CoordinatorTest.LearnedOnOneReplica_NotLearnedOnAnother (0 ms)
[ RUN      ] CoordinatorTest.LearnedOnOneReplica_NotLearnedOnAnother_AnotherFailsAndRecovers
[       OK ] CoordinatorTest.LearnedOnOneReplica_NotLearnedOnAnother_AnotherFailsAndRecovers (0 ms)
[----------] 20 tests from CoordinatorTest (16572 ms total)

[----------] 2 tests from RecoverTest
[ RUN      ] RecoverTest.RacingCatchup
[       OK ] RecoverTest.RacingCatchup (3279 ms)
[ RUN      ] RecoverTest.CatchupRetry
[       OK ] RecoverTest.CatchupRetry (1423 ms)
[----------] 2 tests from RecoverTest (4702 ms total)

[----------] 2 tests from LogTest
[ RUN      ] LogTest.WriteRead
[       OK ] LogTest.WriteRead (751 ms)
[ RUN      ] LogTest.Position
[       OK ] LogTest.Position (629 ms)
[----------] 2 tests from LogTest (1380 ms total)

[----------] 1 test from LogZooKeeperTest
[ RUN      ] LogZooKeeperTest.WriteRead
[       OK ] LogZooKeeperTest.WriteRead (969 ms)
[----------] 1 test from LogZooKeeperTest (969 ms total)

[----------] 1 test from LoggingTest
[ RUN      ] LoggingTest.Toggle
[       OK ] LoggingTest.Toggle (4 ms)
[----------] 1 test from LoggingTest (4 ms total)

[----------] 1 test from MasterContenderDetectorTest
[ RUN      ] MasterContenderDetectorTest.File
tests/master_contender_detector_tests.cpp:90: Failure
master: 'in_memory' is not a supported option for registry persistence
../3rdparty/libprocess/include/process/gmock.hpp:295: Failure
Actual function call count doesn't match EXPECT_CALL(filter->mock, filter(testing::A<const DispatchEvent&>()))...
    Expected args: dispatch matcher (1-byte object <12>, 16-byte object <50-B7 48-00 00-00 00-00 00-00 00-00 00-00 00-00>)
         Expected: to be called once
           Actual: never called - unsatisfied and active
[  FAILED  ] MasterContenderDetectorTest.File (1 ms)
[----------] 1 test from MasterContenderDetectorTest (1 ms total)

[----------] 2 tests from BasicMasterContenderDetectorTest
[ RUN      ] BasicMasterContenderDetectorTest.Contender
[       OK ] BasicMasterContenderDetectorTest.Contender (6309 ms)
[ RUN      ] BasicMasterContenderDetectorTest.Detector
[       OK ] BasicMasterContenderDetectorTest.Detector (5012 ms)
[----------] 2 tests from BasicMasterContenderDetectorTest (11321 ms total)

[----------] 9 tests from ZooKeeperMasterContenderDetectorTest
[ RUN      ] ZooKeeperMasterContenderDetectorTest.MasterContender
2014-03-12 20:36:26,807:20603(0x2ad190d58700):ZOO_ERROR@handle_socket_error_msg@1721: Socket [127.0.0.1:44828] zk retcode=-4, errno=112(Host is down): failed while receiving a server response
2014-03-12 20:36:30,144:20603(0x2ad190d58700):ZOO_ERROR@handle_socket_error_msg@1739: Socket [127.0.0.1:44828] zk retcode=-112, errno=116(Stale NFS file handle): sessionId=0x144b80298860000 has expired.
2014-03-12 20:36:30,145:20603(0x2ad19115a700):ZOO_ERROR@handle_socket_error_msg@1697: Socket [127.0.0.1:44828] zk retcode=-4, errno=111(Connection refused): server refused to accept the client
[       OK ] ZooKeeperMasterContenderDetectorTest.MasterContender (8400 ms)
[ RUN      ] ZooKeeperMasterContenderDetectorTest.ContenderPendingElection
2014-03-12 20:36:33,480:20603(0x2ad19115a700):ZOO_ERROR@handle_socket_error_msg@1697: Socket [127.0.0.1:44828] zk retcode=-4, errno=111(Connection refused): server refused to accept the client
[       OK ] ZooKeeperMasterContenderDetectorTest.ContenderPendingElection (5036 ms)
[ RUN      ] ZooKeeperMasterContenderDetectorTest.MasterContenders
2014-03-12 20:36:36,816:20603(0x2ad19115a700):ZOO_ERROR@handle_socket_error_msg@1697: Socket [127.0.0.1:44828] zk retcode=-4, errno=111(Connection refused): server refused to accept the client
2014-03-12 20:36:40,153:20603(0x2ad19115a700):ZOO_ERROR@handle_socket_error_msg@1697: Socket [127.0.0.1:44828] zk retcode=-4, errno=111(Connection refused): server refused to accept the client
2014-03-12 20:36:43,488:20603(0x2ad19115a700):ZOO_ERROR@handle_socket_error_msg@1697: Socket [127.0.0.1:44828] zk retcode=-4, errno=111(Connection refused): server refused to accept the client
[       OK ] ZooKeeperMasterContenderDetectorTest.MasterContenders (10205 ms)
[ RUN      ] ZooKeeperMasterContenderDetectorTest.NonRetryableFrrors
2014-03-12 20:36:46,824:20603(0x2ad19115a700):ZOO_ERROR@handle_socket_error_msg@1697: Socket [127.0.0.1:44828] zk retcode=-4, errno=111(Connection refused): server refused to accept the client
2014-03-12 20:36:50,160:20603(0x2ad19115a700):ZOO_ERROR@handle_socket_error_msg@1697: Socket [127.0.0.1:44828] zk retcode=-4, errno=111(Connection refused): server refused to accept the client
2014-03-12 20:36:53,496:20603(0x2ad19115a700):ZOO_ERROR@handle_socket_error_msg@1697: Socket [127.0.0.1:44828] zk retcode=-4, errno=111(Connection refused): server refused to accept the client
2014-03-12 20:36:56,832:20603(0x2ad19115a700):ZOO_ERROR@handle_socket_error_msg@1697: Socket [127.0.0.1:44828] zk retcode=-4, errno=111(Connection refused): server refused to accept the client
[       OK ] ZooKeeperMasterContenderDetectorTest.NonRetryableFrrors (13750 ms)
[ RUN      ] ZooKeeperMasterContenderDetectorTest.ContenderDetectorShutdownNetwork
2014-03-12 20:37:00,168:20603(0x2ad19115a700):ZOO_ERROR@handle_socket_error_msg@1697: Socket [127.0.0.1:44828] zk retcode=-4, errno=111(Connection refused): server refused to accept the client
2014-03-12 20:37:03,504:20603(0x2ad19115a700):ZOO_ERROR@handle_socket_error_msg@1697: Socket [127.0.0.1:44828] zk retcode=-4, errno=111(Connection refused): server refused to accept the client
2014-03-12 20:37:04,212:20603(0x2ad19136c700):ZOO_ERROR@handle_socket_error_msg@1721: Socket [127.0.0.1:42619] zk retcode=-4, errno=112(Host is down): failed while receiving a server response
2014-03-12 20:37:04,212:20603(0x2ad19176e700):ZOO_ERROR@handle_socket_error_msg@1721: Socket [127.0.0.1:42619] zk retcode=-4, errno=112(Host is down): failed while receiving a server response
2014-03-12 20:37:04,214:20603(0x2ad19239a700):ZOO_ERROR@handle_socket_error_msg@1697: Socket [127.0.0.1:42619] zk retcode=-4, errno=111(Connection refused): server refused to accept the client
2014-03-12 20:37:04,214:20603(0x2ad19176e700):ZOO_ERROR@handle_socket_error_msg@1697: Socket [127.0.0.1:42619] zk retcode=-4, errno=111(Connection refused): server refused to accept the client
2014-03-12 20:37:06,840:20603(0x2ad19115a700):ZOO_ERROR@handle_socket_error_msg@1697: Socket [127.0.0.1:44828] zk retcode=-4, errno=111(Connection refused): server refused to accept the client
[       OK ] ZooKeeperMasterContenderDetectorTest.ContenderDetectorShutdownNetwork (8444 ms)
[ RUN      ] ZooKeeperMasterContenderDetectorTest.MasterDetectorTimedoutSession
2014-03-12 20:37:10,177:20603(0x2ad19115a700):ZOO_ERROR@handle_socket_error_msg@1697: Socket [127.0.0.1:44828] zk retcode=-4, errno=111(Connection refused): server refused to accept the client
2014-03-12 20:37:13,513:20603(0x2ad19115a700):ZOO_ERROR@handle_socket_error_msg@1697: Socket [127.0.0.1:44828] zk retcode=-4, errno=111(Connection refused): server refused to accept the client
2014-03-12 20:37:16,850:20603(0x2ad19115a700):ZOO_ERROR@handle_socket_error_msg@1697: Socket [127.0.0.1:44828] zk retcode=-4, errno=111(Connection refused): server refused to accept the client
2014-03-12 20:37:17,648:20603(0x2ad19196f700):ZOO_ERROR@handle_socket_error_msg@1721: Socket [127.0.0.1:56187] zk retcode=-4, errno=112(Host is down): failed while receiving a server response
2014-03-12 20:37:17,648:20603(0x2ad19259b700):ZOO_ERROR@handle_socket_error_msg@1721: Socket [127.0.0.1:56187] zk retcode=-4, errno=112(Host is down): failed while receiving a server response
2014-03-12 20:37:17,649:20603(0x2ad19136c700):ZOO_ERROR@handle_socket_error_msg@1721: Socket [127.0.0.1:56187] zk retcode=-4, errno=112(Host is down): failed while receiving a server response
2014-03-12 20:37:17,663:20603(0x2ad19176e700):ZOO_ERROR@handle_socket_error_msg@1697: Socket [127.0.0.1:56187] zk retcode=-4, errno=111(Connection refused): server refused to accept the client
2014-03-12 20:37:17,670:20603(0x2ad19239a700):ZOO_ERROR@handle_socket_error_msg@1697: Socket [127.0.0.1:56187] zk retcode=-4, errno=111(Connection refused): server refused to accept the client
2014-03-12 20:37:17,692:20603(0x2ad19279c700):ZOO_ERROR@handle_socket_error_msg@1697: Socket [127.0.0.1:56187] zk retcode=-4, errno=111(Connection refused): server refused to accept the client
[       OK ] ZooKeeperMasterContenderDetectorTest.MasterDetectorTimedoutSession (10113 ms)
[ RUN      ] ZooKeeperMasterContenderDetectorTest.MasterDetectorExpireMasterZKSession
2014-03-12 20:37:20,186:20603(0x2ad19115a700):ZOO_ERROR@handle_socket_error_msg@1697: Socket [127.0.0.1:44828] zk retcode=-4, errno=111(Connection refused): server refused to accept the client
2014-03-12 20:37:23,523:20603(0x2ad19115a700):ZOO_ERROR@handle_socket_error_msg@1697: Socket [127.0.0.1:44828] zk retcode=-4, errno=111(Connection refused): server refused to accept the client
2014-03-12 20:37:26,859:20603(0x2ad19115a700):ZOO_ERROR@handle_socket_error_msg@1697: Socket [127.0.0.1:44828] zk retcode=-4, errno=111(Connection refused): server refused to accept the client
2014-03-12 20:37:27,828:20603(0x2ad19239a700):ZOO_ERROR@handle_socket_error_msg@1721: Socket [127.0.0.1:40229] zk retcode=-4, errno=112(Host is down): failed while receiving a server response
2014-03-12 20:37:30,196:20603(0x2ad19115a700):ZOO_ERROR@handle_socket_error_msg@1697: Socket [127.0.0.1:44828] zk retcode=-4, errno=111(Connection refused): server refused to accept the client
2014-03-12 20:37:31,165:20603(0x2ad19239a700):ZOO_ERROR@handle_socket_error_msg@1739: Socket [127.0.0.1:40229] zk retcode=-112, errno=116(Stale NFS file handle): sessionId=0x144b80373120000 has expired.
[       OK ] ZooKeeperMasterContenderDetectorTest.MasterDetectorExpireMasterZKSession (13477 ms)
[ RUN      ] ZooKeeperMasterContenderDetectorTest.MasterDetectorExpireSlaveZKSession
2014-03-12 20:37:33,532:20603(0x2ad19115a700):ZOO_ERROR@handle_socket_error_msg@1697: Socket [127.0.0.1:44828] zk retcode=-4, errno=111(Connection refused): server refused to accept the client
2014-03-12 20:37:36,270:20603(0x2ad19259b700):ZOO_ERROR@handle_socket_error_msg@1721: Socket [127.0.0.1:56896] zk retcode=-4, errno=112(Host is down): failed while receiving a server response
2014-03-12 20:37:36,868:20603(0x2ad19115a700):ZOO_ERROR@handle_socket_error_msg@1697: Socket [127.0.0.1:44828] zk retcode=-4, errno=111(Connection refused): server refused to accept the client
2014-03-12 20:37:39,607:20603(0x2ad19259b700):ZOO_ERROR@handle_socket_error_msg@1739: Socket [127.0.0.1:56896] zk retcode=-112, errno=116(Stale NFS file handle): sessionId=0x144b803a7b70001 has expired.
[       OK ] ZooKeeperMasterContenderDetectorTest.MasterDetectorExpireSlaveZKSession (8438 ms)
[ RUN      ] ZooKeeperMasterContenderDetectorTest.MasterDetectorExpireSlaveZKSessionNewMaster
2014-03-12 20:37:40,204:20603(0x2ad19115a700):ZOO_ERROR@handle_socket_error_msg@1697: Socket [127.0.0.1:44828] zk retcode=-4, errno=111(Connection refused): server refused to accept the client
2014-03-12 20:37:43,540:20603(0x2ad19115a700):ZOO_ERROR@handle_socket_error_msg@1697: Socket [127.0.0.1:44828] zk retcode=-4, errno=111(Connection refused): server refused to accept the client
2014-03-12 20:37:46,876:20603(0x2ad19115a700):ZOO_ERROR@handle_socket_error_msg@1697: Socket [127.0.0.1:44828] zk retcode=-4, errno=111(Connection refused): server refused to accept the client
2014-03-12 20:37:49,703:20603(0x2ad190b57700):ZOO_ERROR@handle_socket_error_msg@1721: Socket [127.0.0.1:34921] zk retcode=-4, errno=112(Host is down): failed while receiving a server response
2014-03-12 20:37:49,707:20603(0x2ad19136c700):ZOO_ERROR@handle_socket_error_msg@1721: Socket [127.0.0.1:34921] zk retcode=-4, errno=112(Host is down): failed while receiving a server response
2014-03-12 20:37:49,708:20603(0x2ad19136c700):ZOO_ERROR@handle_socket_error_msg@1739: Socket [127.0.0.1:34921] zk retcode=-112, errno=116(Stale NFS file handle): sessionId=0x144b803c8ad0000 has expired.
2014-03-12 20:37:50,212:20603(0x2ad19115a700):ZOO_ERROR@handle_socket_error_msg@1697: Socket [127.0.0.1:44828] zk retcode=-4, errno=111(Connection refused): server refused to accept the client
2014-03-12 20:37:53,040:20603(0x2ad190b57700):ZOO_ERROR@handle_socket_error_msg@1739: Socket [127.0.0.1:34921] zk retcode=-112, errno=116(Stale NFS file handle): sessionId=0x144b803c8ad0002 has expired.
[       OK ] ZooKeeperMasterContenderDetectorTest.MasterDetectorExpireSlaveZKSessionNewMaster (13451 ms)
[----------] 9 tests from ZooKeeperMasterContenderDetectorTest (91314 ms total)

[----------] 16 tests from MasterTest
[ RUN      ] MasterTest.TaskRunning
tests/master_tests.cpp:89: Failure
master: 'in_memory' is not a supported option for registry persistence
../3rdparty/libprocess/include/process/gmock.hpp:295: Failure
Actual function call count doesn't match EXPECT_CALL(filter->mock, filter(testing::A<const DispatchEvent&>()))...
    Expected args: dispatch matcher (1-byte object <12>, 16-byte object <50-B7 48-00 00-00 00-00 00-00 00-00 00-00 00-00>)
         Expected: to be called once
           Actual: never called - unsatisfied and active
[  FAILED  ] MasterTest.TaskRunning (1 ms)
[ RUN      ] MasterTest.ShutdownFrameworkWhileTaskRunning
tests/master_tests.cpp:162: Failure
master: 'in_memory' is not a supported option for registry persistence
../3rdparty/libprocess/include/process/gmock.hpp:295: Failure
Actual function call count doesn't match EXPECT_CALL(filter->mock, filter(testing::A<const DispatchEvent&>()))...
    Expected args: dispatch matcher (1-byte object <12>, 16-byte object <50-B7 48-00 00-00 00-00 00-00 00-00 00-00 00-00>)
         Expected: to be called once
           Actual: never called - unsatisfied and active
[  FAILED  ] MasterTest.ShutdownFrameworkWhileTaskRunning (0 ms)
[ RUN      ] MasterTest.KillTask
tests/master_tests.cpp:238: Failure
master: 'in_memory' is not a supported option for registry persistence
../3rdparty/libprocess/include/process/gmock.hpp:295: Failure
Actual function call count doesn't match EXPECT_CALL(filter->mock, filter(testing::A<const DispatchEvent&>()))...
    Expected args: dispatch matcher (1-byte object <12>, 16-byte object <50-B7 48-00 00-00 00-00 00-00 00-00 00-00 00-00>)
         Expected: to be called once
           Actual: never called - unsatisfied and active
[  FAILED  ] MasterTest.KillTask (1 ms)
[ RUN      ] MasterTest.StatusUpdateAck
tests/master_tests.cpp:314: Failure
master: 'in_memory' is not a supported option for registry persistence
../3rdparty/libprocess/include/process/gmock.hpp:295: Failure
Actual function call count doesn't match EXPECT_CALL(filter->mock, filter(testing::A<const DispatchEvent&>()))...
    Expected args: dispatch matcher (1-byte object <12>, 16-byte object <50-B7 48-00 00-00 00-00 00-00 00-00 00-00 00-00>)
         Expected: to be called once
           Actual: never called - unsatisfied and active
[  FAILED  ] MasterTest.StatusUpdateAck (0 ms)
[ RUN      ] MasterTest.RecoverResources
tests/master_tests.cpp:382: Failure
master: 'in_memory' is not a supported option for registry persistence
../3rdparty/libprocess/include/process/gmock.hpp:295: Failure
Actual function call count doesn't match EXPECT_CALL(filter->mock, filter(testing::A<const DispatchEvent&>()))...
    Expected args: dispatch matcher (1-byte object <12>, 16-byte object <50-B7 48-00 00-00 00-00 00-00 00-00 00-00 00-00>)
         Expected: to be called once
           Actual: never called - unsatisfied and active
[  FAILED  ] MasterTest.RecoverResources (1 ms)
[ RUN      ] MasterTest.FrameworkMessage
tests/master_tests.cpp:502: Failure
master: 'in_memory' is not a supported option for registry persistence
../3rdparty/libprocess/include/process/gmock.hpp:295: Failure
Actual function call count doesn't match EXPECT_CALL(filter->mock, filter(testing::A<const DispatchEvent&>()))...
    Expected args: dispatch matcher (1-byte object <12>, 16-byte object <50-B7 48-00 00-00 00-00 00-00 00-00 00-00 00-00>)
         Expected: to be called once
           Actual: never called - unsatisfied and active
[  FAILED  ] MasterTest.FrameworkMessage (1 ms)
[ RUN      ] MasterTest.MultipleExecutors
tests/master_tests.cpp:584: Failure
master: 'in_memory' is not a supported option for registry persistence
../3rdparty/libprocess/include/process/gmock.hpp:295: Failure
Actual function call count doesn't match EXPECT_CALL(filter->mock, filter(testing::A<const DispatchEvent&>()))...
    Expected args: dispatch matcher (1-byte object <12>, 16-byte object <50-B7 48-00 00-00 00-00 00-00 00-00 00-00 00-00>)
         Expected: to be called once
           Actual: never called - unsatisfied and active
[  FAILED  ] MasterTest.MultipleExecutors (0 ms)
[ RUN      ] MasterTest.ShutdownUnregisteredExecutor
tests/master_tests.cpp:690: Failure
master: 'in_memory' is not a supported option for registry persistence
../3rdparty/libprocess/include/process/gmock.hpp:295: Failure
Actual function call count doesn't match EXPECT_CALL(filter->mock, filter(testing::A<const DispatchEvent&>()))...
    Expected args: dispatch matcher (1-byte object <12>, 16-byte object <50-B7 48-00 00-00 00-00 00-00 00-00 00-00 00-00>)
         Expected: to be called once
           Actual: never called - unsatisfied and active
[  FAILED  ] MasterTest.ShutdownUnregisteredExecutor (1 ms)
[ RUN      ] MasterTest.RemoveUnregisteredTerminatedExecutor
tests/master_tests.cpp:782: Failure
master: 'in_memory' is not a supported option for registry persistence
../3rdparty/libprocess/include/process/gmock.hpp:295: Failure
Actual function call count doesn't match EXPECT_CALL(filter->mock, filter(testing::A<const DispatchEvent&>()))...
    Expected args: dispatch matcher (1-byte object <12>, 16-byte object <50-B7 48-00 00-00 00-00 00-00 00-00 00-00 00-00>)
         Expected: to be called once
           Actual: never called - unsatisfied and active
[  FAILED  ] MasterTest.RemoveUnregisteredTerminatedExecutor (0 ms)
[ RUN      ] MasterTest.MasterInfo
tests/master_tests.cpp:856: Failure
master: 'in_memory' is not a supported option for registry persistence
../3rdparty/libprocess/include/process/gmock.hpp:295: Failure
Actual function call count doesn't match EXPECT_CALL(filter->mock, filter(testing::A<const DispatchEvent&>()))...
    Expected args: dispatch matcher (1-byte object <12>, 16-byte object <50-B7 48-00 00-00 00-00 00-00 00-00 00-00 00-00>)
         Expected: to be called once
           Actual: never called - unsatisfied and active
[  FAILED  ] MasterTest.MasterInfo (1 ms)
[ RUN      ] MasterTest.MasterInfoOnReElection
tests/master_tests.cpp:888: Failure
master: 'in_memory' is not a supported option for registry persistence
../3rdparty/libprocess/include/process/gmock.hpp:295: Failure
Actual function call count doesn't match EXPECT_CALL(filter->mock, filter(testing::A<const DispatchEvent&>()))...
    Expected args: dispatch matcher (1-byte object <12>, 16-byte object <50-B7 48-00 00-00 00-00 00-00 00-00 00-00 00-00>)
         Expected: to be called once
           Actual: never called - unsatisfied and active
[  FAILED  ] MasterTest.MasterInfoOnReElection (1 ms)
[ RUN      ] MasterTest.MasterLost
tests/master_tests.cpp:997: Failure
master: 'in_memory' is not a supported option for registry persistence
../3rdparty/libprocess/include/process/gmock.hpp:295: Failure
Actual function call count doesn't match EXPECT_CALL(filter->mock, filter(testing::A<const DispatchEvent&>()))...
    Expected args: dispatch matcher (1-byte object <12>, 16-byte object <50-B7 48-00 00-00 00-00 00-00 00-00 00-00 00-00>)
         Expected: to be called once
           Actual: never called - unsatisfied and active
[  FAILED  ] MasterTest.MasterLost (7 ms)
[ RUN      ] MasterTest.ReconcileTaskTest
tests/master_tests.cpp:1048: Failure
master: 'in_memory' is not a supported option for registry persistence
../3rdparty/libprocess/include/process/gmock.hpp:295: Failure
Actual function call count doesn't match EXPECT_CALL(filter->mock, filter(testing::A<const DispatchEvent&>()))...
    Expected args: dispatch matcher (1-byte object <12>, 16-byte object <50-B7 48-00 00-00 00-00 00-00 00-00 00-00 00-00>)
         Expected: to be called once
           Actual: never called - unsatisfied and active
[  FAILED  ] MasterTest.ReconcileTaskTest (1 ms)
[ RUN      ] MasterTest.LaunchCombinedOfferTest
tests/master_tests.cpp:1126: Failure
master: 'in_memory' is not a supported option for registry persistence
../3rdparty/libprocess/include/process/gmock.hpp:295: Failure
Actual function call count doesn't match EXPECT_CALL(filter->mock, filter(testing::A<const DispatchEvent&>()))...
    Expected args: dispatch matcher (1-byte object <12>, 16-byte object <50-B7 48-00 00-00 00-00 00-00 00-00 00-00 00-00>)
         Expected: to be called once
           Actual: never called - unsatisfied and active
[  FAILED  ] MasterTest.LaunchCombinedOfferTest (0 ms)
[ RUN      ] MasterTest.LaunchAcrossSlavesTest
tests/master_tests.cpp:1265: Failure
master: 'in_memory' is not a supported option for registry persistence
../3rdparty/libprocess/include/process/gmock.hpp:295: Failure
Actual function call count doesn't match EXPECT_CALL(filter->mock, filter(testing::A<const DispatchEvent&>()))...
    Expected args: dispatch matcher (1-byte object <12>, 16-byte object <50-B7 48-00 00-00 00-00 00-00 00-00 00-00 00-00>)
         Expected: to be called once
           Actual: never called - unsatisfied and active
[  FAILED  ] MasterTest.LaunchAcrossSlavesTest (1 ms)
[ RUN      ] MasterTest.LaunchDuplicateOfferTest
tests/master_tests.cpp:1349: Failure
master: 'in_memory' is not a supported option for registry persistence
../3rdparty/libprocess/include/process/gmock.hpp:295: Failure
Actual function call count doesn't match EXPECT_CALL(filter->mock, filter(testing::A<const DispatchEvent&>()))...
    Expected args: dispatch matcher (1-byte object <12>, 16-byte object <50-B7 48-00 00-00 00-00 00-00 00-00 00-00 00-00>)
         Expected: to be called once
           Actual: never called - unsatisfied and active
[  FAILED  ] MasterTest.LaunchDuplicateOfferTest (0 ms)
[----------] 16 tests from MasterTest (16 ms total)

[----------] 1 test from WhitelistTest
[ RUN      ] WhitelistTest.WhitelistSlave
tests/master_tests.cpp:965: Failure
master: 'in_memory' is not a supported option for registry persistence
../3rdparty/libprocess/include/process/gmock.hpp:295: Failure
Actual function call count doesn't match EXPECT_CALL(filter->mock, filter(testing::A<const DispatchEvent&>()))...
    Expected args: dispatch matcher (1-byte object <12>, 16-byte object <50-B7 48-00 00-00 00-00 00-00 00-00 00-00 00-00>)
         Expected: to be called once
           Actual: never called - unsatisfied and active
[  FAILED  ] WhitelistTest.WhitelistSlave (11 ms)
[----------] 1 test from WhitelistTest (12 ms total)

[----------] 1 test from MasterZooKeeperTest
[ RUN      ] MasterZooKeeperTest.LostZooKeeperCluster
tests/master_tests.cpp:1460: Failure
StartMaster(): 'in_memory' is not a supported option for registry persistence
../3rdparty/libprocess/include/process/gmock.hpp:295: Failure
Actual function call count doesn't match EXPECT_CALL(filter->mock, filter(testing::A<const DispatchEvent&>()))...
    Expected args: dispatch matcher (1-byte object <12>, 16-byte object <50-B7 48-00 00-00 00-00 00-00 00-00 00-00 00-00>)
         Expected: to be called once
           Actual: never called - unsatisfied and active
[  FAILED  ] MasterZooKeeperTest.LostZooKeeperCluster (1 ms)
[----------] 1 test from MasterZooKeeperTest (1 ms total)

[----------] 2 tests from MonitorTest
[ RUN      ] MonitorTest.Collection
[       OK ] MonitorTest.Collection (124 ms)
[ RUN      ] MonitorTest.Statistics
[       OK ] MonitorTest.Statistics (106 ms)
[----------] 2 tests from MonitorTest (230 ms total)

[----------] 2 tests from PathsTest
[ RUN      ] PathsTest.CreateExecutorDirectory
[       OK ] PathsTest.CreateExecutorDirectory (2 ms)
[ RUN      ] PathsTest.format
[       OK ] PathsTest.format (2 ms)
[----------] 2 tests from PathsTest (4 ms total)

[----------] 1 test from ProtobufIOTest
[ RUN      ] ProtobufIOTest.Basic
2014-03-12 20:37:53,548:20603(0x2ad19115a700):ZOO_ERROR@handle_socket_error_msg@1697: Socket [127.0.0.1:44828] zk retcode=-4, errno=111(Connection refused): server refused to accept the client
[       OK ] ProtobufIOTest.Basic (664 ms)
[----------] 1 test from ProtobufIOTest (664 ms total)

[----------] 4 tests from RegistrarTest
[ RUN      ] RegistrarTest.recover
[       OK ] RegistrarTest.recover (360 ms)
[ RUN      ] RegistrarTest.admit
[       OK ] RegistrarTest.admit (264 ms)
[ RUN      ] RegistrarTest.readmit
[       OK ] RegistrarTest.readmit (240 ms)
[ RUN      ] RegistrarTest.remove
[       OK ] RegistrarTest.remove (611 ms)
[----------] 4 tests from RegistrarTest (1475 ms total)

[----------] 1 test from HealthTest
[ RUN      ] HealthTest.ObserveEndpoint
tests/repair_tests.cpp:98: Failure
master: 'in_memory' is not a supported option for registry persistence
../3rdparty/libprocess/include/process/gmock.hpp:295: Failure
Actual function call count doesn't match EXPECT_CALL(filter->mock, filter(testing::A<const DispatchEvent&>()))...
    Expected args: dispatch matcher (1-byte object <12>, 16-byte object <50-B7 48-00 00-00 00-00 00-00 00-00 00-00 00-00>)
         Expected: to be called once
           Actual: never called - unsatisfied and active
[  FAILED  ] HealthTest.ObserveEndpoint (1 ms)
[----------] 1 test from HealthTest (1 ms total)

[----------] 8 tests from ResourceOffersTest
[ RUN      ] ResourceOffersTest.ResourceOfferWithMultipleSlaves
tests/resource_offers_tests.cpp:61: Failure
master: 'in_memory' is not a supported option for registry persistence
../3rdparty/libprocess/include/process/gmock.hpp:295: Failure
Actual function call count doesn't match EXPECT_CALL(filter->mock, filter(testing::A<const DispatchEvent&>()))...
    Expected args: dispatch matcher (1-byte object <12>, 16-byte object <50-B7 48-00 00-00 00-00 00-00 00-00 00-00 00-00>)
         Expected: to be called once
           Actual: never called - unsatisfied and active
[  FAILED  ] ResourceOffersTest.ResourceOfferWithMultipleSlaves (1 ms)
[ RUN      ] ResourceOffersTest.TaskUsesNoResources
tests/resource_offers_tests.cpp:103: Failure
master: 'in_memory' is not a supported option for registry persistence
../3rdparty/libprocess/include/process/gmock.hpp:295: Failure
Actual function call count doesn't match EXPECT_CALL(filter->mock, filter(testing::A<const DispatchEvent&>()))...
    Expected args: dispatch matcher (1-byte object <12>, 16-byte object <50-B7 48-00 00-00 00-00 00-00 00-00 00-00 00-00>)
         Expected: to be called once
           Actual: never called - unsatisfied and active
[  FAILED  ] ResourceOffersTest.TaskUsesNoResources (1 ms)
[ RUN      ] ResourceOffersTest.TaskUsesInvalidResources
tests/resource_offers_tests.cpp:156: Failure
master: 'in_memory' is not a supported option for registry persistence
../3rdparty/libprocess/include/process/gmock.hpp:295: Failure
Actual function call count doesn't match EXPECT_CALL(filter->mock, filter(testing::A<const DispatchEvent&>()))...
    Expected args: dispatch matcher (1-byte object <12>, 16-byte object <50-B7 48-00 00-00 00-00 00-00 00-00 00-00 00-00>)
         Expected: to be called once
           Actual: never called - unsatisfied and active
[  FAILED  ] ResourceOffersTest.TaskUsesInvalidResources (0 ms)
[ RUN      ] ResourceOffersTest.TaskUsesMoreResourcesThanOffered
tests/resource_offers_tests.cpp:214: Failure
master: 'in_memory' is not a supported option for registry persistence
../3rdparty/libprocess/include/process/gmock.hpp:295: Failure
Actual function call count doesn't match EXPECT_CALL(filter->mock, filter(testing::A<const DispatchEvent&>()))...
    Expected args: dispatch matcher (1-byte object <12>, 16-byte object <50-B7 48-00 00-00 00-00 00-00 00-00 00-00 00-00>)
         Expected: to be called once
           Actual: never called - unsatisfied and active
[  FAILED  ] ResourceOffersTest.TaskUsesMoreResourcesThanOffered (1 ms)
[ RUN      ] ResourceOffersTest.ResourcesGetReofferedAfterFrameworkStops
tests/resource_offers_tests.cpp:274: Failure
master: 'in_memory' is not a supported option for registry persistence
../3rdparty/libprocess/include/process/gmock.hpp:295: Failure
Actual function call count doesn't match EXPECT_CALL(filter->mock, filter(testing::A<const DispatchEvent&>()))...
    Expected args: dispatch matcher (1-byte object <12>, 16-byte object <50-B7 48-00 00-00 00-00 00-00 00-00 00-00 00-00>)
         Expected: to be called once
           Actual: never called - unsatisfied and active
[  FAILED  ] ResourceOffersTest.ResourcesGetReofferedAfterFrameworkStops (1 ms)
[ RUN      ] ResourceOffersTest.ResourcesGetReofferedWhenUnused
tests/resource_offers_tests.cpp:322: Failure
master: 'in_memory' is not a supported option for registry persistence
../3rdparty/libprocess/include/process/gmock.hpp:295: Failure
Actual function call count doesn't match EXPECT_CALL(filter->mock, filter(testing::A<const DispatchEvent&>()))...
    Expected args: dispatch matcher (1-byte object <12>, 16-byte object <50-B7 48-00 00-00 00-00 00-00 00-00 00-00 00-00>)
         Expected: to be called once
           Actual: never called - unsatisfied and active
[  FAILED  ] ResourceOffersTest.ResourcesGetReofferedWhenUnused (2 ms)
[ RUN      ] ResourceOffersTest.ResourcesGetReofferedAfterTaskInfoError
tests/resource_offers_tests.cpp:374: Failure
master: 'in_memory' is not a supported option for registry persistence
../3rdparty/libprocess/include/process/gmock.hpp:295: Failure
Actual function call count doesn't match EXPECT_CALL(filter->mock, filter(testing::A<const DispatchEvent&>()))...
    Expected args: dispatch matcher (1-byte object <12>, 16-byte object <50-B7 48-00 00-00 00-00 00-00 00-00 00-00 00-00>)
         Expected: to be called once
           Actual: never called - unsatisfied and active
[  FAILED  ] ResourceOffersTest.ResourcesGetReofferedAfterTaskInfoError (0 ms)
[ RUN      ] ResourceOffersTest.Request
tests/resource_offers_tests.cpp:467: Failure
master: 'in_memory' is not a supported option for registry persistence
tests/resource_offers_tests.cpp:463: Failure
Actual function call count doesn't match EXPECT_CALL(allocator, initialize(_, _, _))...
         Expected: to be called once
           Actual: never called - unsatisfied and active
../3rdparty/libprocess/include/process/gmock.hpp:295: Failure
Actual function call count doesn't match EXPECT_CALL(filter->mock, filter(testing::A<const DispatchEvent&>()))...
    Expected args: dispatch matcher (1-byte object <12>, 16-byte object <50-B7 48-00 00-00 00-00 00-00 00-00 00-00 00-00>)
         Expected: to be called once
           Actual: never called - unsatisfied and active
[  FAILED  ] ResourceOffersTest.Request (1 ms)
[----------] 8 tests from ResourceOffersTest (8 ms total)

[----------] 1 test from MultipleExecutorsTest
[ RUN      ] MultipleExecutorsTest.TasksExecutorInfoDiffers
tests/resource_offers_tests.cpp:519: Failure
master: 'in_memory' is not a supported option for registry persistence
../3rdparty/libprocess/include/process/gmock.hpp:295: Failure
Actual function call count doesn't match EXPECT_CALL(filter->mock, filter(testing::A<const DispatchEvent&>()))...
    Expected args: dispatch matcher (1-byte object <12>, 16-byte object <50-B7 48-00 00-00 00-00 00-00 00-00 00-00 00-00>)
         Expected: to be called once
           Actual: never called - unsatisfied and active
[  FAILED  ] MultipleExecutorsTest.TasksExecutorInfoDiffers (1 ms)
[----------] 1 test from MultipleExecutorsTest (1 ms total)

[----------] 34 tests from ResourcesTest
[ RUN      ] ResourcesTest.Parsing
[       OK ] ResourcesTest.Parsing (0 ms)
[ RUN      ] ResourcesTest.ParsingWithRoles
[       OK ] ResourcesTest.ParsingWithRoles (0 ms)
[ RUN      ] ResourcesTest.ParseError
[       OK ] ResourcesTest.ParseError (0 ms)
[ RUN      ] ResourcesTest.Resources
[       OK ] ResourcesTest.Resources (1 ms)
[ RUN      ] ResourcesTest.Printing
[       OK ] ResourcesTest.Printing (0 ms)
[ RUN      ] ResourcesTest.InitializedIsEmpty
[       OK ] ResourcesTest.InitializedIsEmpty (0 ms)
[ RUN      ] ResourcesTest.BadResourcesNotAllocatable
[       OK ] ResourcesTest.BadResourcesNotAllocatable (0 ms)
[ RUN      ] ResourcesTest.ScalarEquals
[       OK ] ResourcesTest.ScalarEquals (0 ms)
[ RUN      ] ResourcesTest.ScalarSubset
[       OK ] ResourcesTest.ScalarSubset (0 ms)
[ RUN      ] ResourcesTest.ScalarSubset2
[       OK ] ResourcesTest.ScalarSubset2 (0 ms)
[ RUN      ] ResourcesTest.ScalarAddition
[       OK ] ResourcesTest.ScalarAddition (0 ms)
[ RUN      ] ResourcesTest.ScalarAddition2
[       OK ] ResourcesTest.ScalarAddition2 (0 ms)
[ RUN      ] ResourcesTest.ScalarSubtraction
[       OK ] ResourcesTest.ScalarSubtraction (0 ms)
[ RUN      ] ResourcesTest.ScalarSubtraction2
[       OK ] ResourcesTest.ScalarSubtraction2 (0 ms)
[ RUN      ] ResourcesTest.RangesEquals
[       OK ] ResourcesTest.RangesEquals (0 ms)
[ RUN      ] ResourcesTest.RangesSubset
[       OK ] ResourcesTest.RangesSubset (0 ms)
[ RUN      ] ResourcesTest.RangesAddition
[       OK ] ResourcesTest.RangesAddition (0 ms)
[ RUN      ] ResourcesTest.RangesAddition2
[       OK ] ResourcesTest.RangesAddition2 (0 ms)
[ RUN      ] ResourcesTest.RangesAdditon3
[       OK ] ResourcesTest.RangesAdditon3 (0 ms)
[ RUN      ] ResourcesTest.RangesAddition4
[       OK ] ResourcesTest.RangesAddition4 (1 ms)
[ RUN      ] ResourcesTest.RangesSubtraction
[       OK ] ResourcesTest.RangesSubtraction (0 ms)
[ RUN      ] ResourcesTest.RangesSubtraction1
[       OK ] ResourcesTest.RangesSubtraction1 (0 ms)
[ RUN      ] ResourcesTest.RangesSubtraction2
[       OK ] ResourcesTest.RangesSubtraction2 (0 ms)
[ RUN      ] ResourcesTest.RangesSubtraction3
[       OK ] ResourcesTest.RangesSubtraction3 (0 ms)
[ RUN      ] ResourcesTest.RangesSubtraction4
[       OK ] ResourcesTest.RangesSubtraction4 (0 ms)
[ RUN      ] ResourcesTest.RangesSubtraction5
[       OK ] ResourcesTest.RangesSubtraction5 (0 ms)
[ RUN      ] ResourcesTest.RangesSubtraction6
[       OK ] ResourcesTest.RangesSubtraction6 (0 ms)
[ RUN      ] ResourcesTest.SetEquals
[       OK ] ResourcesTest.SetEquals (0 ms)
[ RUN      ] ResourcesTest.SetSubset
[       OK ] ResourcesTest.SetSubset (0 ms)
[ RUN      ] ResourcesTest.SetAddition
[       OK ] ResourcesTest.SetAddition (0 ms)
[ RUN      ] ResourcesTest.SetSubtraction
[       OK ] ResourcesTest.SetSubtraction (0 ms)
[ RUN      ] ResourcesTest.EmptyUnequal
[       OK ] ResourcesTest.EmptyUnequal (0 ms)
[ RUN      ] ResourcesTest.FlattenRoles
[       OK ] ResourcesTest.FlattenRoles (0 ms)
[ RUN      ] ResourcesTest.Find
[       OK ] ResourcesTest.Find (1 ms)
[----------] 34 tests from ResourcesTest (3 ms total)

[----------] 3 tests from SASL
[ RUN      ] SASL.success
[       OK ] SASL.success (29 ms)
[ RUN      ] SASL.failed1
[       OK ] SASL.failed1 (3 ms)
[ RUN      ] SASL.failed2
[       OK ] SASL.failed2 (4 ms)
[----------] 3 tests from SASL (36 ms total)

[----------] 2 tests from SlaveStateTest
[ RUN      ] SlaveStateTest.CheckpointProtobuf
[       OK ] SlaveStateTest.CheckpointProtobuf (122 ms)
[ RUN      ] SlaveStateTest.CheckpointString
[       OK ] SlaveStateTest.CheckpointString (0 ms)
[----------] 2 tests from SlaveStateTest (123 ms total)

[----------] 23 tests from SlaveRecoveryTest/0, where TypeParam = mesos::internal::slave::MesosContainerizer
[ RUN      ] SlaveRecoveryTest/0.RecoverSlaveState
tests/slave_recovery_tests.cpp:138: Failure
master: 'in_memory' is not a supported option for registry persistence
../3rdparty/libprocess/include/process/gmock.hpp:295: Failure
Actual function call count doesn't match EXPECT_CALL(filter->mock, filter(testing::A<const DispatchEvent&>()))...
    Expected args: dispatch matcher (1-byte object <12>, 16-byte object <50-B7 48-00 00-00 00-00 00-00 00-00 00-00 00-00>)
         Expected: to be called once
           Actual: never called - unsatisfied and active
[  FAILED  ] SlaveRecoveryTest/0.RecoverSlaveState, where TypeParam = mesos::internal::slave::MesosContainerizer (1 ms)
[ RUN      ] SlaveRecoveryTest/0.RecoverStatusUpdateManager
tests/slave_recovery_tests.cpp:317: Failure
master: 'in_memory' is not a supported option for registry persistence
../3rdparty/libprocess/include/process/gmock.hpp:295: Failure
Actual function call count doesn't match EXPECT_CALL(filter->mock, filter(testing::A<const DispatchEvent&>()))...
    Expected args: dispatch matcher (1-byte object <12>, 16-byte object <50-B7 48-00 00-00 00-00 00-00 00-00 00-00 00-00>)
         Expected: to be called once
           Actual: never called - unsatisfied and active
[  FAILED  ] SlaveRecoveryTest/0.RecoverStatusUpdateManager, where TypeParam = mesos::internal::slave::MesosContainerizer (1 ms)
[ RUN      ] SlaveRecoveryTest/0.ReconnectExecutor
tests/slave_recovery_tests.cpp:408: Failure
master: 'in_memory' is not a supported option for registry persistence
../3rdparty/libprocess/include/process/gmock.hpp:295: Failure
Actual function call count doesn't match EXPECT_CALL(filter->mock, filter(testing::A<const DispatchEvent&>()))...
    Expected args: dispatch matcher (1-byte object <12>, 16-byte object <50-B7 48-00 00-00 00-00 00-00 00-00 00-00 00-00>)
         Expected: to be called once
           Actual: never called - unsatisfied and active
[  FAILED  ] SlaveRecoveryTest/0.ReconnectExecutor, where TypeParam = mesos::internal::slave::MesosContainerizer (0 ms)
[ RUN      ] SlaveRecoveryTest/0.RecoverUnregisteredExecutor
tests/slave_recovery_tests.cpp:508: Failure
master: 'in_memory' is not a supported option for registry persistence
../3rdparty/libprocess/include/process/gmock.hpp:295: Failure
Actual function call count doesn't match EXPECT_CALL(filter->mock, filter(testing::A<const DispatchEvent&>()))...
    Expected args: dispatch matcher (1-byte object <12>, 16-byte object <50-B7 48-00 00-00 00-00 00-00 00-00 00-00 00-00>)
         Expected: to be called once
           Actual: never called - unsatisfied and active
[  FAILED  ] SlaveRecoveryTest/0.RecoverUnregisteredExecutor, where TypeParam = mesos::internal::slave::MesosContainerizer (0 ms)
[ RUN      ] SlaveRecoveryTest/0.RecoverTerminatedExecutor
tests/slave_recovery_tests.cpp:618: Failure
master: 'in_memory' is not a supported option for registry persistence
../3rdparty/libprocess/include/process/gmock.hpp:295: Failure
Actual function call count doesn't match EXPECT_CALL(filter->mock, filter(testing::A<const DispatchEvent&>()))...
    Expected args: dispatch matcher (1-byte object <12>, 16-byte object <50-B7 48-00 00-00 00-00 00-00 00-00 00-00 00-00>)
         Expected: to be called once
           Actual: never called - unsatisfied and active
[  FAILED  ] SlaveRecoveryTest/0.RecoverTerminatedExecutor, where TypeParam = mesos::internal::slave::MesosContainerizer (1 ms)
[ RUN      ] SlaveRecoveryTest/0.RecoverCompletedExecutor
tests/slave_recovery_tests.cpp:837: Failure
master: 'in_memory' is not a supported option for registry persistence
../3rdparty/libprocess/include/process/gmock.hpp:295: Failure
Actual function call count doesn't match EXPECT_CALL(filter->mock, filter(testing::A<const DispatchEvent&>()))...
    Expected args: dispatch matcher (1-byte object <12>, 16-byte object <50-B7 48-00 00-00 00-00 00-00 00-00 00-00 00-00>)
         Expected: to be called once
           Actual: never called - unsatisfied and active
[  FAILED  ] SlaveRecoveryTest/0.RecoverCompletedExecutor, where TypeParam = mesos::internal::slave::MesosContainerizer (0 ms)
[ RUN      ] SlaveRecoveryTest/0.CleanupExecutor
tests/slave_recovery_tests.cpp:927: Failure
master: 'in_memory' is not a supported option for registry persistence
../3rdparty/libprocess/include/process/gmock.hpp:295: Failure
Actual function call count doesn't match EXPECT_CALL(filter->mock, filter(testing::A<const DispatchEvent&>()))...
    Expected args: dispatch matcher (1-byte object <12>, 16-byte object <50-B7 48-00 00-00 00-00 00-00 00-00 00-00 00-00>)
         Expected: to be called once
           Actual: never called - unsatisfied and active
[  FAILED  ] SlaveRecoveryTest/0.CleanupExecutor, where TypeParam = mesos::internal::slave::MesosContainerizer (0 ms)
[ RUN      ] SlaveRecoveryTest/0.RemoveNonCheckpointingFramework
tests/slave_recovery_tests.cpp:1027: Failure
master: 'in_memory' is not a supported option for registry persistence
../3rdparty/libprocess/include/process/gmock.hpp:295: Failure
Actual function call count doesn't match EXPECT_CALL(filter->mock, filter(testing::A<const DispatchEvent&>()))...
    Expected args: dispatch matcher (1-byte object <12>, 16-byte object <50-B7 48-00 00-00 00-00 00-00 00-00 00-00 00-00>)
         Expected: to be called once
           Actual: never called - unsatisfied and active
[  FAILED  ] SlaveRecoveryTest/0.RemoveNonCheckpointingFramework, where TypeParam = mesos::internal::slave::MesosContainerizer (1 ms)
[ RUN      ] SlaveRecoveryTest/0.NonCheckpointingFramework
tests/slave_recovery_tests.cpp:1115: Failure
master: 'in_memory' is not a supported option for registry persistence
../3rdparty/libprocess/include/process/gmock.hpp:295: Failure
Actual function call count doesn't match EXPECT_CALL(filter->mock, filter(testing::A<const DispatchEvent&>()))...
    Expected args: dispatch matcher (1-byte object <12>, 16-byte object <50-B7 48-00 00-00 00-00 00-00 00-00 00-00 00-00>)
         Expected: to be called once
           Actual: never called - unsatisfied and active
[  FAILED  ] SlaveRecoveryTest/0.NonCheckpointingFramework, where TypeParam = mesos::internal::slave::MesosContainerizer (0 ms)
[ RUN      ] SlaveRecoveryTest/0.NonCheckpointingSlave
tests/slave_recovery_tests.cpp:1198: Failure
master: 'in_memory' is not a supported option for registry persistence
../3rdparty/libprocess/include/process/gmock.hpp:295: Failure
Actual function call count doesn't match EXPECT_CALL(filter->mock, filter(testing::A<const DispatchEvent&>()))...
    Expected args: dispatch matcher (1-byte object <12>, 16-byte object <50-B7 48-00 00-00 00-00 00-00 00-00 00-00 00-00>)
         Expected: to be called once
           Actual: never called - unsatisfied and active
[  FAILED  ] SlaveRecoveryTest/0.NonCheckpointingSlave, where TypeParam = mesos::internal::slave::MesosContainerizer (0 ms)
[ RUN      ] SlaveRecoveryTest/0.KillTask
tests/slave_recovery_tests.cpp:1255: Failure
master: 'in_memory' is not a supported option for registry persistence
../3rdparty/libprocess/include/process/gmock.hpp:295: Failure
Actual function call count doesn't match EXPECT_CALL(filter->mock, filter(testing::A<const DispatchEvent&>()))...
    Expected args: dispatch matcher (1-byte object <12>, 16-byte object <50-B7 48-00 00-00 00-00 00-00 00-00 00-00 00-00>)
         Expected: to be called once
           Actual: never called - unsatisfied and active
[  FAILED  ] SlaveRecoveryTest/0.KillTask, where TypeParam = mesos::internal::slave::MesosContainerizer (1 ms)
[ RUN      ] SlaveRecoveryTest/0.Reboot
tests/slave_recovery_tests.cpp:1371: Failure
master: 'in_memory' is not a supported option for registry persistence
../3rdparty/libprocess/include/process/gmock.hpp:295: Failure
Actual function call count doesn't match EXPECT_CALL(filter->mock, filter(testing::A<const DispatchEvent&>()))...
    Expected args: dispatch matcher (1-byte object <12>, 16-byte object <50-B7 48-00 00-00 00-00 00-00 00-00 00-00 00-00>)
         Expected: to be called once
           Actual: never called - unsatisfied and active
[  FAILED  ] SlaveRecoveryTest/0.Reboot, where TypeParam = mesos::internal::slave::MesosContainerizer (1 ms)
[ RUN      ] SlaveRecoveryTest/0.GCExecutor
tests/slave_recovery_tests.cpp:1480: Failure
master: 'in_memory' is not a supported option for registry persistence
../3rdparty/libprocess/include/process/gmock.hpp:295: Failure
Actual function call count doesn't match EXPECT_CALL(filter->mock, filter(testing::A<const DispatchEvent&>()))...
    Expected args: dispatch matcher (1-byte object <12>, 16-byte object <50-B7 48-00 00-00 00-00 00-00 00-00 00-00 00-00>)
         Expected: to be called once
           Actual: never called - unsatisfied and active
[  FAILED  ] SlaveRecoveryTest/0.GCExecutor, where TypeParam = mesos::internal::slave::MesosContainerizer (1 ms)
[ RUN      ] SlaveRecoveryTest/0.ShutdownSlave
tests/slave_recovery_tests.cpp:1623: Failure
master: 'in_memory' is not a supported option for registry persistence
../3rdparty/libprocess/include/process/gmock.hpp:295: Failure
Actual function call count doesn't match EXPECT_CALL(filter->mock, filter(testing::A<const DispatchEvent&>()))...
    Expected args: dispatch matcher (1-byte object <12>, 16-byte object <50-B7 48-00 00-00 00-00 00-00 00-00 00-00 00-00>)
         Expected: to be called once
           Actual: never called - unsatisfied and active
[  FAILED  ] SlaveRecoveryTest/0.ShutdownSlave, where TypeParam = mesos::internal::slave::MesosContainerizer (1 ms)
[ RUN      ] SlaveRecoveryTest/0.RegisterDisconnectedSlave
tests/slave_recovery_tests.cpp:1741: Failure
master: 'in_memory' is not a supported option for registry persistence
../3rdparty/libprocess/include/process/gmock.hpp:295: Failure
Actual function call count doesn't match EXPECT_CALL(filter->mock, filter(testing::A<const DispatchEvent&>()))...
    Expected args: dispatch matcher (1-byte object <12>, 16-byte object <50-B7 48-00 00-00 00-00 00-00 00-00 00-00 00-00>)
         Expected: to be called once
           Actual: never called - unsatisfied and active
[  FAILED  ] SlaveRecoveryTest/0.RegisterDisconnectedSlave, where TypeParam = mesos::internal::slave::MesosContainerizer (1 ms)
[ RUN      ] SlaveRecoveryTest/0.ReconcileKillTask
tests/slave_recovery_tests.cpp:1841: Failure
master: 'in_memory' is not a supported option for registry persistence
../3rdparty/libprocess/include/process/gmock.hpp:295: Failure
Actual function call count doesn't match EXPECT_CALL(filter->mock, filter(testing::A<const DispatchEvent&>()))...
    Expected args: dispatch matcher (1-byte object <12>, 16-byte object <50-B7 48-00 00-00 00-00 00-00 00-00 00-00 00-00>)
         Expected: to be called once
           Actual: never called - unsatisfied and active
[  FAILED  ] SlaveRecoveryTest/0.ReconcileKillTask, where TypeParam = mesos::internal::slave::MesosContainerizer (1 ms)
[ RUN      ] SlaveRecoveryTest/0.ReconcileShutdownFramework
tests/slave_recovery_tests.cpp:1941: Failure
master: 'in_memory' is not a supported option for registry persistence
../3rdparty/libprocess/include/process/gmock.hpp:295: Failure
Actual function call count doesn't match EXPECT_CALL(filter->mock, filter(testing::A<const DispatchEvent&>()))...
    Expected args: dispatch matcher (1-byte object <12>, 16-byte object <50-B7 48-00 00-00 00-00 00-00 00-00 00-00 00-00>)
         Expected: to be called once
           Actual: never called - unsatisfied and active
[  FAILED  ] SlaveRecoveryTest/0.ReconcileShutdownFramework, where TypeParam = mesos::internal::slave::MesosContainerizer (1 ms)
[ RUN      ] SlaveRecoveryTest/0.ReconcileTasksMissingFromSlave
tests/slave_recovery_tests.cpp:2047: Failure
master: 'in_memory' is not a supported option for registry persistence
tests/slave_recovery_tests.cpp:2044: Failure
Actual function call count doesn't match EXPECT_CALL(allocator, initialize(_, _, _))...
         Expected: to be called once
           Actual: never called - unsatisfied and active
../3rdparty/libprocess/include/process/gmock.hpp:295: Failure
Actual function call count doesn't match EXPECT_CALL(filter->mock, filter(testing::A<const DispatchEvent&>()))...
    Expected args: dispatch matcher (1-byte object <12>, 16-byte object <50-B7 48-00 00-00 00-00 00-00 00-00 00-00 00-00>)
         Expected: to be called once
           Actual: never called - unsatisfied and active
[  FAILED  ] SlaveRecoveryTest/0.ReconcileTasksMissingFromSlave, where TypeParam = mesos::internal::slave::MesosContainerizer (1 ms)
[ RUN      ] SlaveRecoveryTest/0.SchedulerFailover
tests/slave_recovery_tests.cpp:2213: Failure
master: 'in_memory' is not a supported option for registry persistence
../3rdparty/libprocess/include/process/gmock.hpp:295: Failure
Actual function call count doesn't match EXPECT_CALL(filter->mock, filter(testing::A<const DispatchEvent&>()))...
    Expected args: dispatch matcher (1-byte object <12>, 16-byte object <50-B7 48-00 00-00 00-00 00-00 00-00 00-00 00-00>)
         Expected: to be called once
           Actual: never called - unsatisfied and active
[  FAILED  ] SlaveRecoveryTest/0.SchedulerFailover, where TypeParam = mesos::internal::slave::MesosContainerizer (1 ms)
[ RUN      ] SlaveRecoveryTest/0.PartitionedSlave
tests/slave_recovery_tests.cpp:2364: Failure
master: 'in_memory' is not a supported option for registry persistence
../3rdparty/libprocess/include/process/gmock.hpp:295: Failure
Actual function call count doesn't match EXPECT_CALL(filter->mock, filter(testing::A<const DispatchEvent&>()))...
    Expected args: dispatch matcher (1-byte object <12>, 16-byte object <50-B7 48-00 00-00 00-00 00-00 00-00 00-00 00-00>)
         Expected: to be called once
           Actual: never called - unsatisfied and active
[  FAILED  ] SlaveRecoveryTest/0.PartitionedSlave, where TypeParam = mesos::internal::slave::MesosContainerizer (1 ms)
[ RUN      ] SlaveRecoveryTest/0.MasterFailover
tests/slave_recovery_tests.cpp:2501: Failure
master: 'in_memory' is not a supported option for registry persistence
../3rdparty/libprocess/include/process/gmock.hpp:295: Failure
Actual function call count doesn't match EXPECT_CALL(filter->mock, filter(testing::A<const DispatchEvent&>()))...
    Expected args: dispatch matcher (1-byte object <12>, 16-byte object <50-B7 48-00 00-00 00-00 00-00 00-00 00-00 00-00>)
         Expected: to be called once
           Actual: never called - unsatisfied and active
[  FAILED  ] SlaveRecoveryTest/0.MasterFailover, where TypeParam = mesos::internal::slave::MesosContainerizer (1 ms)
[ RUN      ] SlaveRecoveryTest/0.MultipleFrameworks
tests/slave_recovery_tests.cpp:2642: Failure
master: 'in_memory' is not a supported option for registry persistence
../3rdparty/libprocess/include/process/gmock.hpp:295: Failure
Actual function call count doesn't match EXPECT_CALL(filter->mock, filter(testing::A<const DispatchEvent&>()))...
    Expected args: dispatch matcher (1-byte object <12>, 16-byte object <50-B7 48-00 00-00 00-00 00-00 00-00 00-00 00-00>)
         Expected: to be called once
           Actual: never called - unsatisfied and active
[  FAILED  ] SlaveRecoveryTest/0.MultipleFrameworks, where TypeParam = mesos::internal::slave::MesosContainerizer (1 ms)
[ RUN      ] SlaveRecoveryTest/0.MultipleSlaves
tests/slave_recovery_tests.cpp:2813: Failure
master: 'in_memory' is not a supported option for registry persistence
../3rdparty/libprocess/include/process/gmock.hpp:295: Failure
Actual function call count doesn't match EXPECT_CALL(filter->mock, filter(testing::A<const DispatchEvent&>()))...
    Expected args: dispatch matcher (1-byte object <12>, 16-byte object <50-B7 48-00 00-00 00-00 00-00 00-00 00-00 00-00>)
         Expected: to be called once
           Actual: never called - unsatisfied and active
[  FAILED  ] SlaveRecoveryTest/0.MultipleSlaves, where TypeParam = mesos::internal::slave::MesosContainerizer (6 ms)
[----------] 23 tests from SlaveRecoveryTest/0 (29 ms total)

[----------] 2 tests from SorterTest
[ RUN      ] SorterTest.DRFSorter
[       OK ] SorterTest.DRFSorter (0 ms)
[ RUN      ] SorterTest.WDRFSorter
[       OK ] SorterTest.WDRFSorter (1 ms)
[----------] 2 tests from SorterTest (1 ms total)

[----------] 7 tests from LevelDBStateTest
[ RUN      ] LevelDBStateTest.FetchAndStoreAndFetch
[       OK ] LevelDBStateTest.FetchAndStoreAndFetch (169 ms)
[ RUN      ] LevelDBStateTest.FetchAndStoreAndStoreAndFetch
[       OK ] LevelDBStateTest.FetchAndStoreAndStoreAndFetch (182 ms)
[ RUN      ] LevelDBStateTest.FetchAndStoreAndStoreFailAndFetch
[       OK ] LevelDBStateTest.FetchAndStoreAndStoreFailAndFetch (165 ms)
[ RUN      ] LevelDBStateTest.FetchAndStoreAndExpungeAndFetch
[       OK ] LevelDBStateTest.FetchAndStoreAndExpungeAndFetch (188 ms)
[ RUN      ] LevelDBStateTest.FetchAndStoreAndExpungeAndExpunge
[       OK ] LevelDBStateTest.FetchAndStoreAndExpungeAndExpunge (215 ms)
[ RUN      ] LevelDBStateTest.FetchAndStoreAndExpungeAndStoreAndFetch
[       OK ] LevelDBStateTest.FetchAndStoreAndExpungeAndStoreAndFetch (210 ms)
[ RUN      ] LevelDBStateTest.Names
2014-03-12 20:37:56,886:20603(0x2ad19115a700):ZOO_ERROR@handle_socket_error_msg@1697: Socket [127.0.0.1:44828] zk retcode=-4, errno=111(Connection refused): server refused to accept the client
[       OK ] LevelDBStateTest.Names (119 ms)
[----------] 7 tests from LevelDBStateTest (1248 ms total)

[----------] 7 tests from ZooKeeperStateTest
[ RUN      ] ZooKeeperStateTest.FetchAndStoreAndFetch
[       OK ] ZooKeeperStateTest.FetchAndStoreAndFetch (47 ms)
[ RUN      ] ZooKeeperStateTest.FetchAndStoreAndStoreAndFetch
[       OK ] ZooKeeperStateTest.FetchAndStoreAndStoreAndFetch (56 ms)
[ RUN      ] ZooKeeperStateTest.FetchAndStoreAndStoreFailAndFetch
[       OK ] ZooKeeperStateTest.FetchAndStoreAndStoreFailAndFetch (46 ms)
[ RUN      ] ZooKeeperStateTest.FetchAndStoreAndExpungeAndFetch
[       OK ] ZooKeeperStateTest.FetchAndStoreAndExpungeAndFetch (55 ms)
[ RUN      ] ZooKeeperStateTest.FetchAndStoreAndExpungeAndExpunge
[       OK ] ZooKeeperStateTest.FetchAndStoreAndExpungeAndExpunge (57 ms)
[ RUN      ] ZooKeeperStateTest.FetchAndStoreAndExpungeAndStoreAndFetch
[       OK ] ZooKeeperStateTest.FetchAndStoreAndExpungeAndStoreAndFetch (59 ms)
[ RUN      ] ZooKeeperStateTest.Names
[       OK ] ZooKeeperStateTest.Names (47 ms)
[----------] 7 tests from ZooKeeperStateTest (367 ms total)

[----------] 7 tests from StatusUpdateManagerTest
[ RUN      ] StatusUpdateManagerTest.CheckpointStatusUpdate
tests/status_update_manager_tests.cpp:95: Failure
master: 'in_memory' is not a supported option for registry persistence
../3rdparty/libprocess/include/process/gmock.hpp:295: Failure
Actual function call count doesn't match EXPECT_CALL(filter->mock, filter(testing::A<const DispatchEvent&>()))...
    Expected args: dispatch matcher (1-byte object <12>, 16-byte object <50-B7 48-00 00-00 00-00 00-00 00-00 00-00 00-00>)
         Expected: to be called once
           Actual: never called - unsatisfied and active
[  FAILED  ] StatusUpdateManagerTest.CheckpointStatusUpdate (7 ms)
[ RUN      ] StatusUpdateManagerTest.RetryStatusUpdate
tests/status_update_manager_tests.cpp:194: Failure
master: 'in_memory' is not a supported option for registry persistence
../3rdparty/libprocess/include/process/gmock.hpp:295: Failure
Actual function call count doesn't match EXPECT_CALL(filter->mock, filter(testing::A<const DispatchEvent&>()))...
    Expected args: dispatch matcher (1-byte object <12>, 16-byte object <50-B7 48-00 00-00 00-00 00-00 00-00 00-00 00-00>)
         Expected: to be called once
           Actual: never called - unsatisfied and active
[  FAILED  ] StatusUpdateManagerTest.RetryStatusUpdate (1 ms)
[ RUN      ] StatusUpdateManagerTest.IgnoreDuplicateStatusUpdateAck
tests/status_update_manager_tests.cpp:269: Failure
master: 'in_memory' is not a supported option for registry persistence
../3rdparty/libprocess/include/process/gmock.hpp:295: Failure
Actual function call count doesn't match EXPECT_CALL(filter->mock, filter(testing::A<const DispatchEvent&>()))...
    Expected args: dispatch matcher (1-byte object <12>, 16-byte object <50-B7 48-00 00-00 00-00 00-00 00-00 00-00 00-00>)
         Expected: to be called once
           Actual: never called - unsatisfied and active
[  FAILED  ] StatusUpdateManagerTest.IgnoreDuplicateStatusUpdateAck (0 ms)
[ RUN      ] StatusUpdateManagerTest.IgnoreUnexpectedStatusUpdateAck
tests/status_update_manager_tests.cpp:384: Failure
master: 'in_memory' is not a supported option for registry persistence
../3rdparty/libprocess/include/process/gmock.hpp:295: Failure
Actual function call count doesn't match EXPECT_CALL(filter->mock, filter(testing::A<const DispatchEvent&>()))...
    Expected args: dispatch matcher (1-byte object <12>, 16-byte object <50-B7 48-00 00-00 00-00 00-00 00-00 00-00 00-00>)
         Expected: to be called once
           Actual: never called - unsatisfied and active
[  FAILED  ] StatusUpdateManagerTest.IgnoreUnexpectedStatusUpdateAck (1 ms)
[ RUN      ] StatusUpdateManagerTest.DuplicateTerminalUpdateBeforeAck
tests/status_update_manager_tests.cpp:475: Failure
master: 'in_memory' is not a supported option for registry persistence
../3rdparty/libprocess/include/process/gmock.hpp:295: Failure
Actual function call count doesn't match EXPECT_CALL(filter->mock, filter(testing::A<const DispatchEvent&>()))...
    Expected args: dispatch matcher (1-byte object <12>, 16-byte object <50-B7 48-00 00-00 00-00 00-00 00-00 00-00 00-00>)
         Expected: to be called once
           Actual: never called - unsatisfied and active
[  FAILED  ] StatusUpdateManagerTest.DuplicateTerminalUpdateBeforeAck (0 ms)
[ RUN      ] StatusUpdateManagerTest.DuplicateTerminalUpdateAfterAck
tests/status_update_manager_tests.cpp:587: Failure
master: 'in_memory' is not a supported option for registry persistence
../3rdparty/libprocess/include/process/gmock.hpp:295: Failure
Actual function call count doesn't match EXPECT_CALL(filter->mock, filter(testing::A<const DispatchEvent&>()))...
    Expected args: dispatch matcher (1-byte object <12>, 16-byte object <50-B7 48-00 00-00 00-00 00-00 00-00 00-00 00-00>)
         Expected: to be called once
           Actual: never called - unsatisfied and active
[  FAILED  ] StatusUpdateManagerTest.DuplicateTerminalUpdateAfterAck (1 ms)
[ RUN      ] StatusUpdateManagerTest.DuplicateUpdateBeforeAck
tests/status_update_manager_tests.cpp:686: Failure
master: 'in_memory' is not a supported option for registry persistence
../3rdparty/libprocess/include/process/gmock.hpp:295: Failure
Actual function call count doesn't match EXPECT_CALL(filter->mock, filter(testing::A<const DispatchEvent&>()))...
    Expected args: dispatch matcher (1-byte object <12>, 16-byte object <50-B7 48-00 00-00 00-00 00-00 00-00 00-00 00-00>)
         Expected: to be called once
           Actual: never called - unsatisfied and active
[  FAILED  ] StatusUpdateManagerTest.DuplicateUpdateBeforeAck (1 ms)
[----------] 7 tests from StatusUpdateManagerTest (11 ms total)

[----------] 1 test from ZooKeeper
[ RUN      ] ZooKeeper.URL
[       OK ] ZooKeeper.URL (0 ms)
[----------] 1 test from ZooKeeper (0 ms total)

[----------] 3 tests from FsTest
[ RUN      ] FsTest.MountTableRead
[       OK ] FsTest.MountTableRead (9 ms)
[ RUN      ] FsTest.MountTableHasOption
[       OK ] FsTest.MountTableHasOption (0 ms)
[ RUN      ] FsTest.FileSystemTableRead
[       OK ] FsTest.FileSystemTableRead (1 ms)
[----------] 3 tests from FsTest (10 ms total)

[----------] 6 tests from ZooKeeperTest
[ RUN      ] ZooKeeperTest.Auth
2014-03-12 20:38:00,220:20603(0x2ad19115a700):ZOO_ERROR@handle_socket_error_msg@1697: Socket [127.0.0.1:44828] zk retcode=-4, errno=111(Connection refused): server refused to accept the client
[       OK ] ZooKeeperTest.Auth (4042 ms)
[ RUN      ] ZooKeeperTest.SessionTimeoutNegotiation
[       OK ] ZooKeeperTest.SessionTimeoutNegotiation (42 ms)
[ RUN      ] ZooKeeperTest.Create
2014-03-12 20:38:03,556:20603(0x2ad19115a700):ZOO_ERROR@handle_socket_error_msg@1697: Socket [127.0.0.1:44828] zk retcode=-4, errno=111(Connection refused): server refused to accept the client
[       OK ] ZooKeeperTest.Create (4042 ms)
[ RUN      ] ZooKeeperTest.LeaderDetector
[       OK ] ZooKeeperTest.LeaderDetector (94 ms)
[ RUN      ] ZooKeeperTest.LeaderDetectorTimeoutHandling
2014-03-12 20:38:05,605:20603(0x2ad19239a700):ZOO_ERROR@handle_socket_error_msg@1721: Socket [127.0.0.1:49787] zk retcode=-4, errno=112(Host is down): failed while receiving a server response
2014-03-12 20:38:05,617:20603(0x2ad190d58700):ZOO_ERROR@handle_socket_error_msg@1697: Socket [127.0.0.1:49787] zk retcode=-4, errno=111(Connection refused): server refused to accept the client
2014-03-12 20:38:06,892:20603(0x2ad19115a700):ZOO_ERROR@handle_socket_error_msg@1697: Socket [127.0.0.1:44828] zk retcode=-4, errno=111(Connection refused): server refused to accept the client
2014-03-12 20:38:10,228:20603(0x2ad19115a700):ZOO_ERROR@handle_socket_error_msg@1697: Socket [127.0.0.1:44828] zk retcode=-4, errno=111(Connection refused): server refused to accept the client
2014-03-12 20:38:13,564:20603(0x2ad19115a700):ZOO_ERROR@handle_socket_error_msg@1697: Socket [127.0.0.1:44828] zk retcode=-4, errno=111(Connection refused): server refused to accept the client
2014-03-12 20:38:16,900:20603(0x2ad19115a700):ZOO_ERROR@handle_socket_error_msg@1697: Socket [127.0.0.1:44828] zk retcode=-4, errno=111(Connection refused): server refused to accept the client
[       OK ] ZooKeeperTest.LeaderDetectorTimeoutHandling (12483 ms)
[ RUN      ] ZooKeeperTest.LeaderContender
2014-03-12 20:38:18,096:20603(0x2ad19279c700):ZOO_ERROR@handle_socket_error_msg@1721: Socket [127.0.0.1:42585] zk retcode=-4, errno=112(Host is down): failed while receiving a server response
2014-03-12 20:38:20,236:20603(0x2ad19115a700):ZOO_ERROR@handle_socket_error_msg@1697: Socket [127.0.0.1:44828] zk retcode=-4, errno=111(Connection refused): server refused to accept the client
2014-03-12 20:38:21,434:20603(0x2ad19279c700):ZOO_ERROR@handle_socket_error_msg@1739: Socket [127.0.0.1:42585] zk retcode=-112, errno=116(Stale NFS file handle): sessionId=0x144b8045eb60000 has expired.
2014-03-12 20:38:21,460:20603(0x2ad19259b700):ZOO_ERROR@handle_socket_error_msg@1721: Socket [127.0.0.1:42585] zk retcode=-4, errno=112(Host is down): failed while receiving a server response
2014-03-12 20:38:21,468:20603(0x2ad19259b700):ZOO_ERROR@handle_socket_error_msg@1739: Socket [127.0.0.1:42585] zk retcode=-112, errno=116(Stale NFS file handle): sessionId=0x144b8045eb60001 has expired.
2014-03-12 20:38:21,477:20603(0x2ad19279c700):ZOO_ERROR@handle_socket_error_msg@1721: Socket [127.0.0.1:42585] zk retcode=-4, errno=112(Host is down): failed while receiving a server response
2014-03-12 20:38:21,491:20603(0x2ad19259b700):ZOO_ERROR@handle_socket_error_msg@1697: Socket [127.0.0.1:42585] zk retcode=-4, errno=111(Connection refused): server refused to accept the client
2014-03-12 20:38:23,572:20603(0x2ad19115a700):ZOO_ERROR@handle_socket_error_msg@1697: Socket [127.0.0.1:44828] zk retcode=-4, errno=111(Connection refused): server refused to accept the client
[       OK ] ZooKeeperTest.LeaderContender (6823 ms)
[----------] 6 tests from ZooKeeperTest (27526 ms total)

[----------] 9 tests from GroupTest
[ RUN      ] GroupTest.Group
[       OK ] GroupTest.Group (67 ms)
[ RUN      ] GroupTest.GroupJoinWithDisconnect
2014-03-12 20:38:24,922:20603(0x2ad19259b700):ZOO_ERROR@handle_socket_error_msg@1697: Socket [127.0.0.1:34418] zk retcode=-4, errno=111(Connection refused): server refused to accept the client
[       OK ] GroupTest.GroupJoinWithDisconnect (1726 ms)
[ RUN      ] GroupTest.GroupDataWithDisconnect
2014-03-12 20:38:26,688:20603(0x2ad19259b700):ZOO_ERROR@handle_socket_error_msg@1721: Socket [127.0.0.1:48343] zk retcode=-4, errno=112(Host is down): failed while receiving a server response
2014-03-12 20:38:26,689:20603(0x2ad19259b700):ZOO_ERROR@handle_socket_error_msg@1697: Socket [127.0.0.1:48343] zk retcode=-4, errno=111(Connection refused): server refused to accept the client
2014-03-12 20:38:26,908:20603(0x2ad19115a700):ZOO_ERROR@handle_socket_error_msg@1697: Socket [127.0.0.1:44828] zk retcode=-4, errno=111(Connection refused): server refused to accept the client
[       OK ] GroupTest.GroupDataWithDisconnect (2054 ms)
[ RUN      ] GroupTest.GroupCancelWithDisconnect
2014-03-12 20:38:28,732:20603(0x2ad190d58700):ZOO_ERROR@handle_socket_error_msg@1721: Socket [127.0.0.1:57040] zk retcode=-4, errno=112(Host is down): failed while receiving a server response
2014-03-12 20:38:28,734:20603(0x2ad190d58700):ZOO_ERROR@handle_socket_error_msg@1697: Socket [127.0.0.1:57040] zk retcode=-4, errno=111(Connection refused): server refused to accept the client
2014-03-12 20:38:30,244:20603(0x2ad19115a700):ZOO_ERROR@handle_socket_error_msg@1697: Socket [127.0.0.1:44828] zk retcode=-4, errno=111(Connection refused): server refused to accept the client
[       OK ] GroupTest.GroupCancelWithDisconnect (2173 ms)
[ RUN      ] GroupTest.GroupWatchWithSessionExpiration
2014-03-12 20:38:30,913:20603(0x2ad19156d700):ZOO_ERROR@handle_socket_error_msg@1721: Socket [127.0.0.1:46775] zk retcode=-4, errno=112(Host is down): failed while receiving a server response
2014-03-12 20:38:32,916:20603(0x2ad19156d700):ZOO_ERROR@handle_socket_error_msg@1739: Socket [127.0.0.1:46775] zk retcode=-112, errno=116(Stale NFS file handle): sessionId=0x144b80490da0000 has expired.
[       OK ] GroupTest.GroupWatchWithSessionExpiration (2049 ms)
[ RUN      ] GroupTest.MultipleGroups
2014-03-12 20:38:32,985:20603(0x2ad19259b700):ZOO_ERROR@handle_socket_error_msg@1721: Socket [127.0.0.1:49007] zk retcode=-4, errno=112(Host is down): failed while receiving a server response
[       OK ] GroupTest.MultipleGroups (66 ms)
[ RUN      ] GroupTest.GroupPathWithRestrictivePerms
2014-03-12 20:38:33,580:20603(0x2ad19115a700):ZOO_ERROR@handle_socket_error_msg@1697: Socket [127.0.0.1:44828] zk retcode=-4, errno=111(Connection refused): server refused to accept the client
2014-03-12 20:38:36,916:20603(0x2ad19115a700):ZOO_ERROR@handle_socket_error_msg@1697: Socket [127.0.0.1:44828] zk retcode=-4, errno=111(Connection refused): server refused to accept the client
2014-03-12 20:38:40,252:20603(0x2ad19115a700):ZOO_ERROR@handle_socket_error_msg@1697: Socket [127.0.0.1:44828] zk retcode=-4, errno=111(Connection refused): server refused to accept the client
[       OK ] GroupTest.GroupPathWithRestrictivePerms (8060 ms)
[ RUN      ] GroupTest.RetryableErrors
2014-03-12 20:38:43,068:20603(0x2ad193f4b700):ZOO_ERROR@handle_socket_error_msg@1721: Socket [127.0.0.1:40784] zk retcode=-4, errno=112(Host is down): failed while receiving a server response
2014-03-12 20:38:43,589:20603(0x2ad19115a700):ZOO_ERROR@handle_socket_error_msg@1697: Socket [127.0.0.1:44828] zk retcode=-4, errno=111(Connection refused): server refused to accept the client
2014-03-12 20:38:45,071:20603(0x2ad193f4b700):ZOO_ERROR@handle_socket_error_msg@1739: Socket [127.0.0.1:40784] zk retcode=-112, errno=116(Stale NFS file handle): sessionId=0x144b804b8990000 has expired.
2014-03-12 20:38:46,925:20603(0x2ad19115a700):ZOO_ERROR@handle_socket_error_msg@1697: Socket [127.0.0.1:44828] zk retcode=-4, errno=111(Connection refused): server refused to accept the client
2014-03-12 20:38:47,116:20603(0x2ad19279c700):ZOO_ERROR@handle_socket_error_msg@1721: Socket [127.0.0.1:40784] zk retcode=-4, errno=112(Host is down): failed while receiving a server response
2014-03-12 20:38:49,119:20603(0x2ad19279c700):ZOO_ERROR@handle_socket_error_msg@1739: Socket [127.0.0.1:40784] zk retcode=-112, errno=116(Stale NFS file handle): sessionId=0x144b804b8990001 has expired.
2014-03-12 20:38:50,260:20603(0x2ad19115a700):ZOO_ERROR@handle_socket_error_msg@1697: Socket [127.0.0.1:44828] zk retcode=-4, errno=111(Connection refused): server refused to accept the client
2014-03-12 20:38:51,136:20603(0x2ad193f4b700):ZOO_ERROR@handle_socket_error_msg@1721: Socket [127.0.0.1:40784] zk retcode=-4, errno=112(Host is down): failed while receiving a server response
2014-03-12 20:38:53,136:20603(0x2ad193f4b700):ZOO_ERROR@handle_socket_error_msg@1739: Socket [127.0.0.1:40784] zk retcode=-112, errno=116(Stale NFS file handle): sessionId=0x144b804b8990002 has expired.
2014-03-12 20:38:53,596:20603(0x2ad19115a700):ZOO_ERROR@handle_socket_error_msg@1697: Socket [127.0.0.1:44828] zk retcode=-4, errno=111(Connection refused): server refused to accept the client
2014-03-12 20:38:55,152:20603(0x2ad19279c700):ZOO_ERROR@handle_socket_error_msg@1721: Socket [127.0.0.1:40784] zk retcode=-4, errno=112(Host is down): failed while receiving a server response
2014-03-12 20:38:56,933:20603(0x2ad19115a700):ZOO_ERROR@handle_socket_error_msg@1697: Socket [127.0.0.1:44828] zk retcode=-4, errno=111(Connection refused): server refused to accept the client
2014-03-12 20:38:57,155:20603(0x2ad19279c700):ZOO_ERROR@handle_socket_error_msg@1739: Socket [127.0.0.1:40784] zk retcode=-112, errno=116(Stale NFS file handle): sessionId=0x144b804b8990003 has expired.
[       OK ] GroupTest.RetryableErrors (18137 ms)
[ RUN      ] GroupTest.LabelledGroup
[       OK ] GroupTest.LabelledGroup (53 ms)
[----------] 9 tests from GroupTest (34385 ms total)

[----------] 2 tests from AllocatorZooKeeperTest/0, where TypeParam = mesos::internal::master::allocator::HierarchicalAllocatorProcess<mesos::internal::master::allocator::DRFSorter, mesos::internal::master::allocator::DRFSorter>
[ RUN      ] AllocatorZooKeeperTest/0.FrameworkReregistersFirst
tests/allocator_zookeeper_tests.cpp:111: Failure
master: 'in_memory' is not a supported option for registry persistence
../3rdparty/libprocess/include/process/gmock.hpp:295: Failure
Actual function call count doesn't match EXPECT_CALL(filter->mock, filter(testing::A<const DispatchEvent&>()))...
    Expected args: dispatch matcher (1-byte object <12>, 16-byte object <50-B7 48-00 00-00 00-00 00-00 00-00 00-00 00-00>)
         Expected: to be called once
           Actual: never called - unsatisfied and active
[  FAILED  ] AllocatorZooKeeperTest/0.FrameworkReregistersFirst, where TypeParam = mesos::internal::master::allocator::HierarchicalAllocatorProcess<mesos::internal::master::allocator::DRFSorter, mesos::internal::master::allocator::DRFSorter> (0 ms)
[ RUN      ] AllocatorZooKeeperTest/0.SlaveReregistersFirst
tests/allocator_zookeeper_tests.cpp:226: Failure
master: 'in_memory' is not a supported option for registry persistence
../3rdparty/libprocess/include/process/gmock.hpp:295: Failure
Actual function call count doesn't match EXPECT_CALL(filter->mock, filter(testing::A<const DispatchEvent&>()))...
    Expected args: dispatch matcher (1-byte object <12>, 16-byte object <50-B7 48-00 00-00 00-00 00-00 00-00 00-00 00-00>)
         Expected: to be called once
           Actual: never called - unsatisfied and active
[  FAILED  ] AllocatorZooKeeperTest/0.SlaveReregistersFirst, where TypeParam = mesos::internal::master::allocator::HierarchicalAllocatorProcess<mesos::internal::master::allocator::DRFSorter, mesos::internal::master::allocator::DRFSorter> (0 ms)
[----------] 2 tests from AllocatorZooKeeperTest/0 (1 ms total)

[----------] Global test environment tear-down
[==========] 267 tests from 47 test cases ran. (200563 ms total)
[  PASSED  ] 147 tests.
[  FAILED  ] 120 tests, listed below:
[  FAILED  ] DRFAllocatorTest.DRFAllocatorProcess
[  FAILED  ] ReservationAllocatorTest.ReservedResources
[  FAILED  ] ReservationAllocatorTest.ResourcesReturned
[  FAILED  ] AllocatorTest/0.MockAllocator, where TypeParam = mesos::internal::master::allocator::HierarchicalAllocatorProcess<mesos::internal::master::allocator::DRFSorter, mesos::internal::master::allocator::DRFSorter>
[  FAILED  ] AllocatorTest/0.ResourcesUnused, where TypeParam = mesos::internal::master::allocator::HierarchicalAllocatorProcess<mesos::internal::master::allocator::DRFSorter, mesos::internal::master::allocator::DRFSorter>
[  FAILED  ] AllocatorTest/0.OutOfOrderDispatch, where TypeParam = mesos::internal::master::allocator::HierarchicalAllocatorProcess<mesos::internal::master::allocator::DRFSorter, mesos::internal::master::allocator::DRFSorter>
[  FAILED  ] AllocatorTest/0.SchedulerFailover, where TypeParam = mesos::internal::master::allocator::HierarchicalAllocatorProcess<mesos::internal::master::allocator::DRFSorter, mesos::internal::master::allocator::DRFSorter>
[  FAILED  ] AllocatorTest/0.FrameworkExited, where TypeParam = mesos::internal::master::allocator::HierarchicalAllocatorProcess<mesos::internal::master::allocator::DRFSorter, mesos::internal::master::allocator::DRFSorter>
[  FAILED  ] AllocatorTest/0.SlaveLost, where TypeParam = mesos::internal::master::allocator::HierarchicalAllocatorProcess<mesos::internal::master::allocator::DRFSorter, mesos::internal::master::allocator::DRFSorter>
[  FAILED  ] AllocatorTest/0.SlaveAdded, where TypeParam = mesos::internal::master::allocator::HierarchicalAllocatorProcess<mesos::internal::master::allocator::DRFSorter, mesos::internal::master::allocator::DRFSorter>
[  FAILED  ] AllocatorTest/0.TaskFinished, where TypeParam = mesos::internal::master::allocator::HierarchicalAllocatorProcess<mesos::internal::master::allocator::DRFSorter, mesos::internal::master::allocator::DRFSorter>
[  FAILED  ] AllocatorTest/0.WhitelistSlave, where TypeParam = mesos::internal::master::allocator::HierarchicalAllocatorProcess<mesos::internal::master::allocator::DRFSorter, mesos::internal::master::allocator::DRFSorter>
[  FAILED  ] AllocatorTest/0.RoleTest, where TypeParam = mesos::internal::master::allocator::HierarchicalAllocatorProcess<mesos::internal::master::allocator::DRFSorter, mesos::internal::master::allocator::DRFSorter>
[  FAILED  ] AuthenticationTest.UnauthenticatedFramework
[  FAILED  ] AuthenticationTest.DisableAuthentication
[  FAILED  ] AuthenticationTest.AuthenticatedFramework
[  FAILED  ] AuthenticationTest.RetryAuthentication
[  FAILED  ] AuthenticationTest.DropIntermediateSASLMessage
[  FAILED  ] AuthenticationTest.DropFinalSASLMessage
[  FAILED  ] AuthenticationTest.MasterFailover
[  FAILED  ] AuthenticationTest.LeaderElection
[  FAILED  ] AuthenticationTest.SchedulerFailover
[  FAILED  ] ExamplesTest.TestFramework
[  FAILED  ] ExamplesTest.NoExecutorFramework
[  FAILED  ] ExamplesTest.JavaFramework
[  FAILED  ] ExamplesTest.JavaException
[  FAILED  ] ExamplesTest.PythonFramework
[  FAILED  ] ExceptionTest.DeactivateFrameworkOnAbort
[  FAILED  ] ExceptionTest.DisallowSchedulerActionsOnAbort
[  FAILED  ] ExceptionTest.DisallowSchedulerCallbacksOnAbort
[  FAILED  ] FaultToleranceTest.SlaveLost
[  FAILED  ] FaultToleranceTest.PartitionedSlave
[  FAILED  ] FaultToleranceTest.PartitionedSlaveReregistration
[  FAILED  ] FaultToleranceTest.PartitionedSlaveStatusUpdates
[  FAILED  ] FaultToleranceTest.PartitionedSlaveExitedExecutor
[  FAILED  ] FaultToleranceTest.MasterFailover
[  FAILED  ] FaultToleranceTest.ReregisterCompletedFrameworks
[  FAILED  ] FaultToleranceTest.SchedulerFailover
[  FAILED  ] FaultToleranceTest.SchedulerFailoverRetriedReregistration
[  FAILED  ] FaultToleranceTest.FrameworkReliableRegistration
[  FAILED  ] FaultToleranceTest.FrameworkReregister
[  FAILED  ] FaultToleranceTest.TaskLost
[  FAILED  ] FaultToleranceTest.SchedulerFailoverStatusUpdate
[  FAILED  ] FaultToleranceTest.ReregisterFrameworkExitedExecutor
[  FAILED  ] FaultToleranceTest.ForwardStatusUpdateUnknownExecutor
[  FAILED  ] FaultToleranceTest.SchedulerFailoverFrameworkMessage
[  FAILED  ] FaultToleranceTest.IgnoreKillTaskFromUnregisteredFramework
[  FAILED  ] FaultToleranceTest.SchedulerExit
[  FAILED  ] FaultToleranceTest.SlaveReliableRegistration
[  FAILED  ] FaultToleranceTest.SlaveReregisterOnZKExpiration
[  FAILED  ] FaultToleranceTest.SlaveReregisterTerminatedExecutor
[  FAILED  ] FaultToleranceTest.ReconcileLostTasks
[  FAILED  ] FaultToleranceTest.ReconcileIncompleteTasks
[  FAILED  ] FaultToleranceTest.SplitBrainMasters
[  FAILED  ] GarbageCollectorIntegrationTest.Restart
[  FAILED  ] GarbageCollectorIntegrationTest.ExitedFramework
[  FAILED  ] GarbageCollectorIntegrationTest.ExitedExecutor
[  FAILED  ] GarbageCollectorIntegrationTest.DiskUsage
[  FAILED  ] GarbageCollectorIntegrationTest.Unschedule
[  FAILED  ] MasterContenderDetectorTest.File
[  FAILED  ] MasterTest.TaskRunning
[  FAILED  ] MasterTest.ShutdownFrameworkWhileTaskRunning
[  FAILED  ] MasterTest.KillTask
[  FAILED  ] MasterTest.StatusUpdateAck
[  FAILED  ] MasterTest.RecoverResources
[  FAILED  ] MasterTest.FrameworkMessage
[  FAILED  ] MasterTest.MultipleExecutors
[  FAILED  ] MasterTest.ShutdownUnregisteredExecutor
[  FAILED  ] MasterTest.RemoveUnregisteredTerminatedExecutor
[  FAILED  ] MasterTest.MasterInfo
[  FAILED  ] MasterTest.MasterInfoOnReElection
[  FAILED  ] MasterTest.MasterLost
[  FAILED  ] MasterTest.ReconcileTaskTest
[  FAILED  ] MasterTest.LaunchCombinedOfferTest
[  FAILED  ] MasterTest.LaunchAcrossSlavesTest
[  FAILED  ] MasterTest.LaunchDuplicateOfferTest
[  FAILED  ] WhitelistTest.WhitelistSlave
[  FAILED  ] MasterZooKeeperTest.LostZooKeeperCluster
[  FAILED  ] HealthTest.ObserveEndpoint
[  FAILED  ] ResourceOffersTest.ResourceOfferWithMultipleSlaves
[  FAILED  ] ResourceOffersTest.TaskUsesNoResources
[  FAILED  ] ResourceOffersTest.TaskUsesInvalidResources
[  FAILED  ] ResourceOffersTest.TaskUsesMoreResourcesThanOffered
[  FAILED  ] ResourceOffersTest.ResourcesGetReofferedAfterFrameworkStops
[  FAILED  ] ResourceOffersTest.ResourcesGetReofferedWhenUnused
[  FAILED  ] ResourceOffersTest.ResourcesGetReofferedAfterTaskInfoError
[  FAILED  ] ResourceOffersTest.Request
[  FAILED  ] MultipleExecutorsTest.TasksExecutorInfoDiffers
[  FAILED  ] SlaveRecoveryTest/0.RecoverSlaveState, where TypeParam = mesos::internal::slave::MesosContainerizer
[  FAILED  ] SlaveRecoveryTest/0.RecoverStatusUpdateManager, where TypeParam = mesos::internal::slave::MesosContainerizer
[  FAILED  ] SlaveRecoveryTest/0.ReconnectExecutor, where TypeParam = mesos::internal::slave::MesosContainerizer
[  FAILED  ] SlaveRecoveryTest/0.RecoverUnregisteredExecutor, where TypeParam = mesos::internal::slave::MesosContainerizer
[  FAILED  ] SlaveRecoveryTest/0.RecoverTerminatedExecutor, where TypeParam = mesos::internal::slave::MesosContainerizer
[  FAILED  ] SlaveRecoveryTest/0.RecoverCompletedExecutor, where TypeParam = mesos::internal::slave::MesosContainerizer
[  FAILED  ] SlaveRecoveryTest/0.CleanupExecutor, where TypeParam = mesos::internal::slave::MesosContainerizer
[  FAILED  ] SlaveRecoveryTest/0.RemoveNonCheckpointingFramework, where TypeParam = mesos::internal::slave::MesosContainerizer
[  FAILED  ] SlaveRecoveryTest/0.NonCheckpointingFramework, where TypeParam = mesos::internal::slave::MesosContainerizer
[  FAILED  ] SlaveRecoveryTest/0.NonCheckpointingSlave, where TypeParam = mesos::internal::slave::MesosContainerizer
[  FAILED  ] SlaveRecoveryTest/0.KillTask, where TypeParam = mesos::internal::slave::MesosContainerizer
[  FAILED  ] SlaveRecoveryTest/0.Reboot, where TypeParam = mesos::internal::slave::MesosContainerizer
[  FAILED  ] SlaveRecoveryTest/0.GCExecutor, where TypeParam = mesos::internal::slave::MesosContainerizer
[  FAILED  ] SlaveRecoveryTest/0.ShutdownSlave, where TypeParam = mesos::internal::slave::MesosContainerizer
[  FAILED  ] SlaveRecoveryTest/0.RegisterDisconnectedSlave, where TypeParam = mesos::internal::slave::MesosContainerizer
[  FAILED  ] SlaveRecoveryTest/0.ReconcileKillTask, where TypeParam = mesos::internal::slave::MesosContainerizer
[  FAILED  ] SlaveRecoveryTest/0.ReconcileShutdownFramework, where TypeParam = mesos::internal::slave::MesosContainerizer
[  FAILED  ] SlaveRecoveryTest/0.ReconcileTasksMissingFromSlave, where TypeParam = mesos::internal::slave::MesosContainerizer
[  FAILED  ] SlaveRecoveryTest/0.SchedulerFailover, where TypeParam = mesos::internal::slave::MesosContainerizer
[  FAILED  ] SlaveRecoveryTest/0.PartitionedSlave, where TypeParam = mesos::internal::slave::MesosContainerizer
[  FAILED  ] SlaveRecoveryTest/0.MasterFailover, where TypeParam = mesos::internal::slave::MesosContainerizer
[  FAILED  ] SlaveRecoveryTest/0.MultipleFrameworks, where TypeParam = mesos::internal::slave::MesosContainerizer
[  FAILED  ] SlaveRecoveryTest/0.MultipleSlaves, where TypeParam = mesos::internal::slave::MesosContainerizer
[  FAILED  ] StatusUpdateManagerTest.CheckpointStatusUpdate
[  FAILED  ] StatusUpdateManagerTest.RetryStatusUpdate
[  FAILED  ] StatusUpdateManagerTest.IgnoreDuplicateStatusUpdateAck
[  FAILED  ] StatusUpdateManagerTest.IgnoreUnexpectedStatusUpdateAck
[  FAILED  ] StatusUpdateManagerTest.DuplicateTerminalUpdateBeforeAck
[  FAILED  ] StatusUpdateManagerTest.DuplicateTerminalUpdateAfterAck
[  FAILED  ] StatusUpdateManagerTest.DuplicateUpdateBeforeAck
[  FAILED  ] AllocatorZooKeeperTest/0.FrameworkReregistersFirst, where TypeParam = mesos::internal::master::allocator::HierarchicalAllocatorProcess<mesos::internal::master::allocator::DRFSorter, mesos::internal::master::allocator::DRFSorter>
[  FAILED  ] AllocatorZooKeeperTest/0.SlaveReregistersFirst, where TypeParam = mesos::internal::master::allocator::HierarchicalAllocatorProcess<mesos::internal::master::allocator::DRFSorter, mesos::internal::master::allocator::DRFSorter>

120 FAILED TESTS
  YOU HAVE 1 DISABLED TEST

make[3]: *** [check-local] Error 1
make[3]: Leaving directory `/x1/jenkins/jenkins-slave/workspace/mesos-reviewbot/src'
make[2]: *** [check-am] Error 2
make[2]: Leaving directory `/x1/jenkins/jenkins-slave/workspace/mesos-reviewbot/src'
make[1]: *** [check] Error 2
make[1]: Leaving directory `/x1/jenkins/jenkins-slave/workspace/mesos-reviewbot/src'
make: *** [check-recursive] Error 1


- Mesos ReviewBot


On March 12, 2014, 6:36 p.m., Ben Mahler wrote:
> 
> -----------------------------------------------------------
> This is an automatically generated e-mail. To reply, visit:
> https://reviews.apache.org/r/19135/
> -----------------------------------------------------------
> 
> (Updated March 12, 2014, 6:36 p.m.)
> 
> 
> Review request for mesos, Benjamin Hindman and Vinod Kone.
> 
> 
> Bugs: MESOS-764
>     https://issues.apache.org/jira/browse/MESOS-764
> 
> 
> Repository: mesos-git
> 
> 
> Description
> -------
> 
> Initial commits of the Registrar integration with the Master will be used with (1) InMemoryStorage and (2) non-strict operations.
> 
> This is the review for (2).
> 
> 
> Diffs
> -----
> 
>   src/master/flags.hpp 012eb5a502938fdcc9bb52189e9e42ca6e3c5da7 
>   src/master/main.cpp a99fb6494f1dbbfce91698d5aaded2b982bbaab5 
> 
> Diff: https://reviews.apache.org/r/19135/diff/
> 
> 
> Testing
> -------
> 
> make check
> 
> 
> Thanks,
> 
> Ben Mahler
> 
>


Mime
  • Unnamed multipart/alternative (inline, None, 0 bytes)
View raw message