mesos-dev mailing list archives

Site index · List index
Message view « Date » · « Thread »
Top « Date » · « Thread »
From Apache Jenkins Server <jenk...@builds.apache.org>
Subject Build failed in Jenkins: Mesos-Trunk-Ubuntu-Build-Out-Of-Src-Disable-Java-Disable-Python-Disable-Webui #1849
Date Wed, 22 Jan 2014 21:57:10 GMT
See <https://builds.apache.org/job/Mesos-Trunk-Ubuntu-Build-Out-Of-Src-Disable-Java-Disable-Python-Disable-Webui/1849/changes>

Changes:

[bmahler] Added another argument to strings::format.

[bmahler] Removed the deprecated monitoring statistics.

[bmahler] Reverted metering from Statistics.

[bmahler] Added a List type in stout.

[bmahler] Exposed TimeSeries and added "sparsification" of older values.

[bmahler] Refactored the ResourceMonitor to use TimeSeries directly instead of Statistics.

[bmahler] Updated the monitoring endpoint to return instantaneous values.

[bmahler] Added a Top abstraction to the webui.

------------------------------------------
[...truncated 1711 lines...]
make[4]: Leaving directory `<https://builds.apache.org/job/Mesos-Trunk-Ubuntu-Build-Out-Of-Src-Disable-Java-Disable-Python-Disable-Webui/ws/build/3rdparty/libprocess/3rdparty'>
Making check in .
make[4]: Entering directory `<https://builds.apache.org/job/Mesos-Trunk-Ubuntu-Build-Out-Of-Src-Disable-Java-Disable-Python-Disable-Webui/ws/build/3rdparty/libprocess'>
/bin/bash ./libtool  --tag=CXX   --mode=compile g++ -DPACKAGE_NAME=\"libprocess\" -DPACKAGE_TARNAME=\"libprocess\"
-DPACKAGE_VERSION=\"0.0.1\" -DPACKAGE_STRING=\"libprocess\ 0.0.1\" -DPACKAGE_BUGREPORT=\"\"
-DPACKAGE_URL=\"\" -DPACKAGE=\"libprocess\" -DVERSION=\"0.0.1\" -DSTDC_HEADERS=1 -DHAVE_SYS_TYPES_H=1
-DHAVE_SYS_STAT_H=1 -DHAVE_STDLIB_H=1 -DHAVE_STRING_H=1 -DHAVE_MEMORY_H=1 -DHAVE_STRINGS_H=1
-DHAVE_INTTYPES_H=1 -DHAVE_STDINT_H=1 -DHAVE_UNISTD_H=1 -DHAVE_DLFCN_H=1 -DLT_OBJDIR=\".libs/\"
-DHAVE_PTHREAD=1 -DHAVE_LIBZ=1 -I. -I../../../3rdparty/libprocess  -I../../../3rdparty/libprocess/include
-I../../../3rdparty/libprocess/3rdparty/stout/include -I3rdparty/boost-1.53.0 -I3rdparty/glog-0.3.3/src
-I3rdparty/libev-4.15 -I3rdparty/ry-http-parser-1c3624a     -g -g2 -O2 -MT libprocess_la-latch.lo
-MD -MP -MF .deps/libprocess_la-latch.Tpo -c -o libprocess_la-latch.lo `test -f 'src/latch.cpp'
|| echo '../../../3rdparty/libprocess/'`src/latch.cpp
libtool: compile:  g++ -DPACKAGE_NAME=\"libprocess\" -DPACKAGE_TARNAME=\"libprocess\" -DPACKAGE_VERSION=\"0.0.1\"
"-DPACKAGE_STRING=\"libprocess 0.0.1\"" -DPACKAGE_BUGREPORT=\"\" -DPACKAGE_URL=\"\" -DPACKAGE=\"libprocess\"
-DVERSION=\"0.0.1\" -DSTDC_HEADERS=1 -DHAVE_SYS_TYPES_H=1 -DHAVE_SYS_STAT_H=1 -DHAVE_STDLIB_H=1
-DHAVE_STRING_H=1 -DHAVE_MEMORY_H=1 -DHAVE_STRINGS_H=1 -DHAVE_INTTYPES_H=1 -DHAVE_STDINT_H=1
-DHAVE_UNISTD_H=1 -DHAVE_DLFCN_H=1 -DLT_OBJDIR=\".libs/\" -DHAVE_PTHREAD=1 -DHAVE_LIBZ=1 -I.
-I../../../3rdparty/libprocess -I../../../3rdparty/libprocess/include -I../../../3rdparty/libprocess/3rdparty/stout/include
-I3rdparty/boost-1.53.0 -I3rdparty/glog-0.3.3/src -I3rdparty/libev-4.15 -I3rdparty/ry-http-parser-1c3624a
-g -g2 -O2 -MT libprocess_la-latch.lo -MD -MP -MF .deps/libprocess_la-latch.Tpo -c ../../../3rdparty/libprocess/src/latch.cpp
 -fPIC -DPIC -o libprocess_la-latch.o
mv -f .deps/libprocess_la-latch.Tpo .deps/libprocess_la-latch.Plo
/bin/bash ./libtool  --tag=CXX   --mode=compile g++ -DPACKAGE_NAME=\"libprocess\" -DPACKAGE_TARNAME=\"libprocess\"
-DPACKAGE_VERSION=\"0.0.1\" -DPACKAGE_STRING=\"libprocess\ 0.0.1\" -DPACKAGE_BUGREPORT=\"\"
-DPACKAGE_URL=\"\" -DPACKAGE=\"libprocess\" -DVERSION=\"0.0.1\" -DSTDC_HEADERS=1 -DHAVE_SYS_TYPES_H=1
-DHAVE_SYS_STAT_H=1 -DHAVE_STDLIB_H=1 -DHAVE_STRING_H=1 -DHAVE_MEMORY_H=1 -DHAVE_STRINGS_H=1
-DHAVE_INTTYPES_H=1 -DHAVE_STDINT_H=1 -DHAVE_UNISTD_H=1 -DHAVE_DLFCN_H=1 -DLT_OBJDIR=\".libs/\"
-DHAVE_PTHREAD=1 -DHAVE_LIBZ=1 -I. -I../../../3rdparty/libprocess  -I../../../3rdparty/libprocess/include
-I../../../3rdparty/libprocess/3rdparty/stout/include -I3rdparty/boost-1.53.0 -I3rdparty/glog-0.3.3/src
-I3rdparty/libev-4.15 -I3rdparty/ry-http-parser-1c3624a     -g -g2 -O2 -MT libprocess_la-pid.lo
-MD -MP -MF .deps/libprocess_la-pid.Tpo -c -o libprocess_la-pid.lo `test -f 'src/pid.cpp'
|| echo '../../../3rdparty/libprocess/'`src/pid.cpp
libtool: compile:  g++ -DPACKAGE_NAME=\"libprocess\" -DPACKAGE_TARNAME=\"libprocess\" -DPACKAGE_VERSION=\"0.0.1\"
"-DPACKAGE_STRING=\"libprocess 0.0.1\"" -DPACKAGE_BUGREPORT=\"\" -DPACKAGE_URL=\"\" -DPACKAGE=\"libprocess\"
-DVERSION=\"0.0.1\" -DSTDC_HEADERS=1 -DHAVE_SYS_TYPES_H=1 -DHAVE_SYS_STAT_H=1 -DHAVE_STDLIB_H=1
-DHAVE_STRING_H=1 -DHAVE_MEMORY_H=1 -DHAVE_STRINGS_H=1 -DHAVE_INTTYPES_H=1 -DHAVE_STDINT_H=1
-DHAVE_UNISTD_H=1 -DHAVE_DLFCN_H=1 -DLT_OBJDIR=\".libs/\" -DHAVE_PTHREAD=1 -DHAVE_LIBZ=1 -I.
-I../../../3rdparty/libprocess -I../../../3rdparty/libprocess/include -I../../../3rdparty/libprocess/3rdparty/stout/include
-I3rdparty/boost-1.53.0 -I3rdparty/glog-0.3.3/src -I3rdparty/libev-4.15 -I3rdparty/ry-http-parser-1c3624a
-g -g2 -O2 -MT libprocess_la-pid.lo -MD -MP -MF .deps/libprocess_la-pid.Tpo -c ../../../3rdparty/libprocess/src/pid.cpp
 -fPIC -DPIC -o libprocess_la-pid.o
mv -f .deps/libprocess_la-pid.Tpo .deps/libprocess_la-pid.Plo
/bin/bash ./libtool  --tag=CXX   --mode=compile g++ -DPACKAGE_NAME=\"libprocess\" -DPACKAGE_TARNAME=\"libprocess\"
-DPACKAGE_VERSION=\"0.0.1\" -DPACKAGE_STRING=\"libprocess\ 0.0.1\" -DPACKAGE_BUGREPORT=\"\"
-DPACKAGE_URL=\"\" -DPACKAGE=\"libprocess\" -DVERSION=\"0.0.1\" -DSTDC_HEADERS=1 -DHAVE_SYS_TYPES_H=1
-DHAVE_SYS_STAT_H=1 -DHAVE_STDLIB_H=1 -DHAVE_STRING_H=1 -DHAVE_MEMORY_H=1 -DHAVE_STRINGS_H=1
-DHAVE_INTTYPES_H=1 -DHAVE_STDINT_H=1 -DHAVE_UNISTD_H=1 -DHAVE_DLFCN_H=1 -DLT_OBJDIR=\".libs/\"
-DHAVE_PTHREAD=1 -DHAVE_LIBZ=1 -I. -I../../../3rdparty/libprocess  -I../../../3rdparty/libprocess/include
-I../../../3rdparty/libprocess/3rdparty/stout/include -I3rdparty/boost-1.53.0 -I3rdparty/glog-0.3.3/src
-I3rdparty/libev-4.15 -I3rdparty/ry-http-parser-1c3624a     -g -g2 -O2 -MT libprocess_la-process.lo
-MD -MP -MF .deps/libprocess_la-process.Tpo -c -o libprocess_la-process.lo `test -f 'src/process.cpp'
|| echo '../../../3rdparty/libprocess/'`src/process.cpp
libtool: compile:  g++ -DPACKAGE_NAME=\"libprocess\" -DPACKAGE_TARNAME=\"libprocess\" -DPACKAGE_VERSION=\"0.0.1\"
"-DPACKAGE_STRING=\"libprocess 0.0.1\"" -DPACKAGE_BUGREPORT=\"\" -DPACKAGE_URL=\"\" -DPACKAGE=\"libprocess\"
-DVERSION=\"0.0.1\" -DSTDC_HEADERS=1 -DHAVE_SYS_TYPES_H=1 -DHAVE_SYS_STAT_H=1 -DHAVE_STDLIB_H=1
-DHAVE_STRING_H=1 -DHAVE_MEMORY_H=1 -DHAVE_STRINGS_H=1 -DHAVE_INTTYPES_H=1 -DHAVE_STDINT_H=1
-DHAVE_UNISTD_H=1 -DHAVE_DLFCN_H=1 -DLT_OBJDIR=\".libs/\" -DHAVE_PTHREAD=1 -DHAVE_LIBZ=1 -I.
-I../../../3rdparty/libprocess -I../../../3rdparty/libprocess/include -I../../../3rdparty/libprocess/3rdparty/stout/include
-I3rdparty/boost-1.53.0 -I3rdparty/glog-0.3.3/src -I3rdparty/libev-4.15 -I3rdparty/ry-http-parser-1c3624a
-g -g2 -O2 -MT libprocess_la-process.lo -MD -MP -MF .deps/libprocess_la-process.Tpo -c ../../../3rdparty/libprocess/src/process.cpp
 -fPIC -DPIC -o libprocess_la-process.o
mv -f .deps/libprocess_la-process.Tpo .deps/libprocess_la-process.Plo
/bin/bash ./libtool  --tag=CXX   --mode=compile g++ -DPACKAGE_NAME=\"libprocess\" -DPACKAGE_TARNAME=\"libprocess\"
-DPACKAGE_VERSION=\"0.0.1\" -DPACKAGE_STRING=\"libprocess\ 0.0.1\" -DPACKAGE_BUGREPORT=\"\"
-DPACKAGE_URL=\"\" -DPACKAGE=\"libprocess\" -DVERSION=\"0.0.1\" -DSTDC_HEADERS=1 -DHAVE_SYS_TYPES_H=1
-DHAVE_SYS_STAT_H=1 -DHAVE_STDLIB_H=1 -DHAVE_STRING_H=1 -DHAVE_MEMORY_H=1 -DHAVE_STRINGS_H=1
-DHAVE_INTTYPES_H=1 -DHAVE_STDINT_H=1 -DHAVE_UNISTD_H=1 -DHAVE_DLFCN_H=1 -DLT_OBJDIR=\".libs/\"
-DHAVE_PTHREAD=1 -DHAVE_LIBZ=1 -I. -I../../../3rdparty/libprocess  -I../../../3rdparty/libprocess/include
-I../../../3rdparty/libprocess/3rdparty/stout/include -I3rdparty/boost-1.53.0 -I3rdparty/glog-0.3.3/src
-I3rdparty/libev-4.15 -I3rdparty/ry-http-parser-1c3624a     -g -g2 -O2 -MT libprocess_la-statistics.lo
-MD -MP -MF .deps/libprocess_la-statistics.Tpo -c -o libprocess_la-statistics.lo `test -f
'src/statistics.cpp' || echo '../../../3rdparty/libprocess/'`src/statistics.cpp
libtool: compile:  g++ -DPACKAGE_NAME=\"libprocess\" -DPACKAGE_TARNAME=\"libprocess\" -DPACKAGE_VERSION=\"0.0.1\"
"-DPACKAGE_STRING=\"libprocess 0.0.1\"" -DPACKAGE_BUGREPORT=\"\" -DPACKAGE_URL=\"\" -DPACKAGE=\"libprocess\"
-DVERSION=\"0.0.1\" -DSTDC_HEADERS=1 -DHAVE_SYS_TYPES_H=1 -DHAVE_SYS_STAT_H=1 -DHAVE_STDLIB_H=1
-DHAVE_STRING_H=1 -DHAVE_MEMORY_H=1 -DHAVE_STRINGS_H=1 -DHAVE_INTTYPES_H=1 -DHAVE_STDINT_H=1
-DHAVE_UNISTD_H=1 -DHAVE_DLFCN_H=1 -DLT_OBJDIR=\".libs/\" -DHAVE_PTHREAD=1 -DHAVE_LIBZ=1 -I.
-I../../../3rdparty/libprocess -I../../../3rdparty/libprocess/include -I../../../3rdparty/libprocess/3rdparty/stout/include
-I3rdparty/boost-1.53.0 -I3rdparty/glog-0.3.3/src -I3rdparty/libev-4.15 -I3rdparty/ry-http-parser-1c3624a
-g -g2 -O2 -MT libprocess_la-statistics.lo -MD -MP -MF .deps/libprocess_la-statistics.Tpo
-c ../../../3rdparty/libprocess/src/statistics.cpp  -fPIC -DPIC -o libprocess_la-statistics.o
mv -f .deps/libprocess_la-statistics.Tpo .deps/libprocess_la-statistics.Plo
/bin/bash ./libtool --tag=CXX   --mode=link g++  -g -g2 -O2   -o libprocess.la  libprocess_la-latch.lo
libprocess_la-pid.lo libprocess_la-process.lo libprocess_la-statistics.lo 3rdparty/glog-0.3.3/libglog.la
3rdparty/libry_http_parser.la 3rdparty/libev-4.15/libev.la  -lz  -lrt
libtool: link: (cd .libs/libprocess.lax/libry_http_parser.a && ar x "<https://builds.apache.org/job/Mesos-Trunk-Ubuntu-Build-Out-Of-Src-Disable-Java-Disable-Python-Disable-Webui/ws/build/3rdparty/libprocess/3rdparty/.libs/libry_http_parser.a")>
libtool: link: ar cru .libs/libprocess.a  libprocess_la-latch.o libprocess_la-pid.o libprocess_la-process.o
libprocess_la-statistics.o  .libs/libprocess.lax/libry_http_parser.a/libry_http_parser_la-http_parser.o

libtool: link: ranlib .libs/libprocess.a
libtool: link: rm -fr .libs/libprocess.lax
libtool: link: ( cd ".libs" && rm -f "libprocess.la" && ln -s "../libprocess.la"
"libprocess.la" )
make  tests
make[5]: Entering directory `<https://builds.apache.org/job/Mesos-Trunk-Ubuntu-Build-Out-Of-Src-Disable-Java-Disable-Python-Disable-Webui/ws/build/3rdparty/libprocess'>
g++ -DPACKAGE_NAME=\"libprocess\" -DPACKAGE_TARNAME=\"libprocess\" -DPACKAGE_VERSION=\"0.0.1\"
-DPACKAGE_STRING=\"libprocess\ 0.0.1\" -DPACKAGE_BUGREPORT=\"\" -DPACKAGE_URL=\"\" -DPACKAGE=\"libprocess\"
-DVERSION=\"0.0.1\" -DSTDC_HEADERS=1 -DHAVE_SYS_TYPES_H=1 -DHAVE_SYS_STAT_H=1 -DHAVE_STDLIB_H=1
-DHAVE_STRING_H=1 -DHAVE_MEMORY_H=1 -DHAVE_STRINGS_H=1 -DHAVE_INTTYPES_H=1 -DHAVE_STDINT_H=1
-DHAVE_UNISTD_H=1 -DHAVE_DLFCN_H=1 -DLT_OBJDIR=\".libs/\" -DHAVE_PTHREAD=1 -DHAVE_LIBZ=1 -I.
-I../../../3rdparty/libprocess  -I../../../3rdparty/libprocess/src -I3rdparty/gmock-1.6.0/gtest/include
-I3rdparty/gmock-1.6.0/include -I../../../3rdparty/libprocess/include -I../../../3rdparty/libprocess/3rdparty/stout/include
-I3rdparty/boost-1.53.0 -I3rdparty/glog-0.3.3/src -I3rdparty/libev-4.15 -I3rdparty/ry-http-parser-1c3624a
    -g -g2 -O2 -MT tests-decoder_tests.o -MD -MP -MF .deps/tests-decoder_tests.Tpo -c -o tests-decoder_tests.o
`test -f 'src/tests/decoder_tests.cpp' || echo '../../../3rdparty/libprocess/'`src/tests/decoder_tests.cpp
mv -f .deps/tests-decoder_tests.Tpo .deps/tests-decoder_tests.Po
g++ -DPACKAGE_NAME=\"libprocess\" -DPACKAGE_TARNAME=\"libprocess\" -DPACKAGE_VERSION=\"0.0.1\"
-DPACKAGE_STRING=\"libprocess\ 0.0.1\" -DPACKAGE_BUGREPORT=\"\" -DPACKAGE_URL=\"\" -DPACKAGE=\"libprocess\"
-DVERSION=\"0.0.1\" -DSTDC_HEADERS=1 -DHAVE_SYS_TYPES_H=1 -DHAVE_SYS_STAT_H=1 -DHAVE_STDLIB_H=1
-DHAVE_STRING_H=1 -DHAVE_MEMORY_H=1 -DHAVE_STRINGS_H=1 -DHAVE_INTTYPES_H=1 -DHAVE_STDINT_H=1
-DHAVE_UNISTD_H=1 -DHAVE_DLFCN_H=1 -DLT_OBJDIR=\".libs/\" -DHAVE_PTHREAD=1 -DHAVE_LIBZ=1 -I.
-I../../../3rdparty/libprocess  -I../../../3rdparty/libprocess/src -I3rdparty/gmock-1.6.0/gtest/include
-I3rdparty/gmock-1.6.0/include -I../../../3rdparty/libprocess/include -I../../../3rdparty/libprocess/3rdparty/stout/include
-I3rdparty/boost-1.53.0 -I3rdparty/glog-0.3.3/src -I3rdparty/libev-4.15 -I3rdparty/ry-http-parser-1c3624a
    -g -g2 -O2 -MT tests-encoder_tests.o -MD -MP -MF .deps/tests-encoder_tests.Tpo -c -o tests-encoder_tests.o
`test -f 'src/tests/encoder_tests.cpp' || echo '../../../3rdparty/libprocess/'`src/tests/encoder_tests.cpp
mv -f .deps/tests-encoder_tests.Tpo .deps/tests-encoder_tests.Po
g++ -DPACKAGE_NAME=\"libprocess\" -DPACKAGE_TARNAME=\"libprocess\" -DPACKAGE_VERSION=\"0.0.1\"
-DPACKAGE_STRING=\"libprocess\ 0.0.1\" -DPACKAGE_BUGREPORT=\"\" -DPACKAGE_URL=\"\" -DPACKAGE=\"libprocess\"
-DVERSION=\"0.0.1\" -DSTDC_HEADERS=1 -DHAVE_SYS_TYPES_H=1 -DHAVE_SYS_STAT_H=1 -DHAVE_STDLIB_H=1
-DHAVE_STRING_H=1 -DHAVE_MEMORY_H=1 -DHAVE_STRINGS_H=1 -DHAVE_INTTYPES_H=1 -DHAVE_STDINT_H=1
-DHAVE_UNISTD_H=1 -DHAVE_DLFCN_H=1 -DLT_OBJDIR=\".libs/\" -DHAVE_PTHREAD=1 -DHAVE_LIBZ=1 -I.
-I../../../3rdparty/libprocess  -I../../../3rdparty/libprocess/src -I3rdparty/gmock-1.6.0/gtest/include
-I3rdparty/gmock-1.6.0/include -I../../../3rdparty/libprocess/include -I../../../3rdparty/libprocess/3rdparty/stout/include
-I3rdparty/boost-1.53.0 -I3rdparty/glog-0.3.3/src -I3rdparty/libev-4.15 -I3rdparty/ry-http-parser-1c3624a
    -g -g2 -O2 -MT tests-http_tests.o -MD -MP -MF .deps/tests-http_tests.Tpo -c -o tests-http_tests.o
`test -f 'src/tests/http_tests.cpp' || echo '../../../3rdparty/libprocess/'`src/tests/http_tests.cpp
mv -f .deps/tests-http_tests.Tpo .deps/tests-http_tests.Po
g++ -DPACKAGE_NAME=\"libprocess\" -DPACKAGE_TARNAME=\"libprocess\" -DPACKAGE_VERSION=\"0.0.1\"
-DPACKAGE_STRING=\"libprocess\ 0.0.1\" -DPACKAGE_BUGREPORT=\"\" -DPACKAGE_URL=\"\" -DPACKAGE=\"libprocess\"
-DVERSION=\"0.0.1\" -DSTDC_HEADERS=1 -DHAVE_SYS_TYPES_H=1 -DHAVE_SYS_STAT_H=1 -DHAVE_STDLIB_H=1
-DHAVE_STRING_H=1 -DHAVE_MEMORY_H=1 -DHAVE_STRINGS_H=1 -DHAVE_INTTYPES_H=1 -DHAVE_STDINT_H=1
-DHAVE_UNISTD_H=1 -DHAVE_DLFCN_H=1 -DLT_OBJDIR=\".libs/\" -DHAVE_PTHREAD=1 -DHAVE_LIBZ=1 -I.
-I../../../3rdparty/libprocess  -I../../../3rdparty/libprocess/src -I3rdparty/gmock-1.6.0/gtest/include
-I3rdparty/gmock-1.6.0/include -I../../../3rdparty/libprocess/include -I../../../3rdparty/libprocess/3rdparty/stout/include
-I3rdparty/boost-1.53.0 -I3rdparty/glog-0.3.3/src -I3rdparty/libev-4.15 -I3rdparty/ry-http-parser-1c3624a
    -g -g2 -O2 -MT tests-io_tests.o -MD -MP -MF .deps/tests-io_tests.Tpo -c -o tests-io_tests.o
`test -f 'src/tests/io_tests.cpp' || echo '../../../3rdparty/libprocess/'`src/tests/io_tests.cpp
mv -f .deps/tests-io_tests.Tpo .deps/tests-io_tests.Po
g++ -DPACKAGE_NAME=\"libprocess\" -DPACKAGE_TARNAME=\"libprocess\" -DPACKAGE_VERSION=\"0.0.1\"
-DPACKAGE_STRING=\"libprocess\ 0.0.1\" -DPACKAGE_BUGREPORT=\"\" -DPACKAGE_URL=\"\" -DPACKAGE=\"libprocess\"
-DVERSION=\"0.0.1\" -DSTDC_HEADERS=1 -DHAVE_SYS_TYPES_H=1 -DHAVE_SYS_STAT_H=1 -DHAVE_STDLIB_H=1
-DHAVE_STRING_H=1 -DHAVE_MEMORY_H=1 -DHAVE_STRINGS_H=1 -DHAVE_INTTYPES_H=1 -DHAVE_STDINT_H=1
-DHAVE_UNISTD_H=1 -DHAVE_DLFCN_H=1 -DLT_OBJDIR=\".libs/\" -DHAVE_PTHREAD=1 -DHAVE_LIBZ=1 -I.
-I../../../3rdparty/libprocess  -I../../../3rdparty/libprocess/src -I3rdparty/gmock-1.6.0/gtest/include
-I3rdparty/gmock-1.6.0/include -I../../../3rdparty/libprocess/include -I../../../3rdparty/libprocess/3rdparty/stout/include
-I3rdparty/boost-1.53.0 -I3rdparty/glog-0.3.3/src -I3rdparty/libev-4.15 -I3rdparty/ry-http-parser-1c3624a
    -g -g2 -O2 -MT tests-main.o -MD -MP -MF .deps/tests-main.Tpo -c -o tests-main.o `test
-f 'src/tests/main.cpp' || echo '../../../3rdparty/libprocess/'`src/tests/main.cpp
mv -f .deps/tests-main.Tpo .deps/tests-main.Po
g++ -DPACKAGE_NAME=\"libprocess\" -DPACKAGE_TARNAME=\"libprocess\" -DPACKAGE_VERSION=\"0.0.1\"
-DPACKAGE_STRING=\"libprocess\ 0.0.1\" -DPACKAGE_BUGREPORT=\"\" -DPACKAGE_URL=\"\" -DPACKAGE=\"libprocess\"
-DVERSION=\"0.0.1\" -DSTDC_HEADERS=1 -DHAVE_SYS_TYPES_H=1 -DHAVE_SYS_STAT_H=1 -DHAVE_STDLIB_H=1
-DHAVE_STRING_H=1 -DHAVE_MEMORY_H=1 -DHAVE_STRINGS_H=1 -DHAVE_INTTYPES_H=1 -DHAVE_STDINT_H=1
-DHAVE_UNISTD_H=1 -DHAVE_DLFCN_H=1 -DLT_OBJDIR=\".libs/\" -DHAVE_PTHREAD=1 -DHAVE_LIBZ=1 -I.
-I../../../3rdparty/libprocess  -I../../../3rdparty/libprocess/src -I3rdparty/gmock-1.6.0/gtest/include
-I3rdparty/gmock-1.6.0/include -I../../../3rdparty/libprocess/include -I../../../3rdparty/libprocess/3rdparty/stout/include
-I3rdparty/boost-1.53.0 -I3rdparty/glog-0.3.3/src -I3rdparty/libev-4.15 -I3rdparty/ry-http-parser-1c3624a
    -g -g2 -O2 -MT tests-owned_tests.o -MD -MP -MF .deps/tests-owned_tests.Tpo -c -o tests-owned_tests.o
`test -f 'src/tests/owned_tests.cpp' || echo '../../../3rdparty/libprocess/'`src/tests/owned_tests.cpp
mv -f .deps/tests-owned_tests.Tpo .deps/tests-owned_tests.Po
g++ -DPACKAGE_NAME=\"libprocess\" -DPACKAGE_TARNAME=\"libprocess\" -DPACKAGE_VERSION=\"0.0.1\"
-DPACKAGE_STRING=\"libprocess\ 0.0.1\" -DPACKAGE_BUGREPORT=\"\" -DPACKAGE_URL=\"\" -DPACKAGE=\"libprocess\"
-DVERSION=\"0.0.1\" -DSTDC_HEADERS=1 -DHAVE_SYS_TYPES_H=1 -DHAVE_SYS_STAT_H=1 -DHAVE_STDLIB_H=1
-DHAVE_STRING_H=1 -DHAVE_MEMORY_H=1 -DHAVE_STRINGS_H=1 -DHAVE_INTTYPES_H=1 -DHAVE_STDINT_H=1
-DHAVE_UNISTD_H=1 -DHAVE_DLFCN_H=1 -DLT_OBJDIR=\".libs/\" -DHAVE_PTHREAD=1 -DHAVE_LIBZ=1 -I.
-I../../../3rdparty/libprocess  -I../../../3rdparty/libprocess/src -I3rdparty/gmock-1.6.0/gtest/include
-I3rdparty/gmock-1.6.0/include -I../../../3rdparty/libprocess/include -I../../../3rdparty/libprocess/3rdparty/stout/include
-I3rdparty/boost-1.53.0 -I3rdparty/glog-0.3.3/src -I3rdparty/libev-4.15 -I3rdparty/ry-http-parser-1c3624a
    -g -g2 -O2 -MT tests-process_tests.o -MD -MP -MF .deps/tests-process_tests.Tpo -c -o tests-process_tests.o
`test -f 'src/tests/process_tests.cpp' || echo '../../../3rdparty/libprocess/'`src/tests/process_tests.cpp
mv -f .deps/tests-process_tests.Tpo .deps/tests-process_tests.Po
g++ -DPACKAGE_NAME=\"libprocess\" -DPACKAGE_TARNAME=\"libprocess\" -DPACKAGE_VERSION=\"0.0.1\"
-DPACKAGE_STRING=\"libprocess\ 0.0.1\" -DPACKAGE_BUGREPORT=\"\" -DPACKAGE_URL=\"\" -DPACKAGE=\"libprocess\"
-DVERSION=\"0.0.1\" -DSTDC_HEADERS=1 -DHAVE_SYS_TYPES_H=1 -DHAVE_SYS_STAT_H=1 -DHAVE_STDLIB_H=1
-DHAVE_STRING_H=1 -DHAVE_MEMORY_H=1 -DHAVE_STRINGS_H=1 -DHAVE_INTTYPES_H=1 -DHAVE_STDINT_H=1
-DHAVE_UNISTD_H=1 -DHAVE_DLFCN_H=1 -DLT_OBJDIR=\".libs/\" -DHAVE_PTHREAD=1 -DHAVE_LIBZ=1 -I.
-I../../../3rdparty/libprocess  -I../../../3rdparty/libprocess/src -I3rdparty/gmock-1.6.0/gtest/include
-I3rdparty/gmock-1.6.0/include -I../../../3rdparty/libprocess/include -I../../../3rdparty/libprocess/3rdparty/stout/include
-I3rdparty/boost-1.53.0 -I3rdparty/glog-0.3.3/src -I3rdparty/libev-4.15 -I3rdparty/ry-http-parser-1c3624a
    -g -g2 -O2 -MT tests-shared_tests.o -MD -MP -MF .deps/tests-shared_tests.Tpo -c -o tests-shared_tests.o
`test -f 'src/tests/shared_tests.cpp' || echo '../../../3rdparty/libprocess/'`src/tests/shared_tests.cpp
mv -f .deps/tests-shared_tests.Tpo .deps/tests-shared_tests.Po
g++ -DPACKAGE_NAME=\"libprocess\" -DPACKAGE_TARNAME=\"libprocess\" -DPACKAGE_VERSION=\"0.0.1\"
-DPACKAGE_STRING=\"libprocess\ 0.0.1\" -DPACKAGE_BUGREPORT=\"\" -DPACKAGE_URL=\"\" -DPACKAGE=\"libprocess\"
-DVERSION=\"0.0.1\" -DSTDC_HEADERS=1 -DHAVE_SYS_TYPES_H=1 -DHAVE_SYS_STAT_H=1 -DHAVE_STDLIB_H=1
-DHAVE_STRING_H=1 -DHAVE_MEMORY_H=1 -DHAVE_STRINGS_H=1 -DHAVE_INTTYPES_H=1 -DHAVE_STDINT_H=1
-DHAVE_UNISTD_H=1 -DHAVE_DLFCN_H=1 -DLT_OBJDIR=\".libs/\" -DHAVE_PTHREAD=1 -DHAVE_LIBZ=1 -I.
-I../../../3rdparty/libprocess  -I../../../3rdparty/libprocess/src -I3rdparty/gmock-1.6.0/gtest/include
-I3rdparty/gmock-1.6.0/include -I../../../3rdparty/libprocess/include -I../../../3rdparty/libprocess/3rdparty/stout/include
-I3rdparty/boost-1.53.0 -I3rdparty/glog-0.3.3/src -I3rdparty/libev-4.15 -I3rdparty/ry-http-parser-1c3624a
    -g -g2 -O2 -MT tests-statistics_tests.o -MD -MP -MF .deps/tests-statistics_tests.Tpo -c
-o tests-statistics_tests.o `test -f 'src/tests/statistics_tests.cpp' || echo '../../../3rdparty/libprocess/'`src/tests/statistics_tests.cpp
mv -f .deps/tests-statistics_tests.Tpo .deps/tests-statistics_tests.Po
g++ -DPACKAGE_NAME=\"libprocess\" -DPACKAGE_TARNAME=\"libprocess\" -DPACKAGE_VERSION=\"0.0.1\"
-DPACKAGE_STRING=\"libprocess\ 0.0.1\" -DPACKAGE_BUGREPORT=\"\" -DPACKAGE_URL=\"\" -DPACKAGE=\"libprocess\"
-DVERSION=\"0.0.1\" -DSTDC_HEADERS=1 -DHAVE_SYS_TYPES_H=1 -DHAVE_SYS_STAT_H=1 -DHAVE_STDLIB_H=1
-DHAVE_STRING_H=1 -DHAVE_MEMORY_H=1 -DHAVE_STRINGS_H=1 -DHAVE_INTTYPES_H=1 -DHAVE_STDINT_H=1
-DHAVE_UNISTD_H=1 -DHAVE_DLFCN_H=1 -DLT_OBJDIR=\".libs/\" -DHAVE_PTHREAD=1 -DHAVE_LIBZ=1 -I.
-I../../../3rdparty/libprocess  -I../../../3rdparty/libprocess/src -I3rdparty/gmock-1.6.0/gtest/include
-I3rdparty/gmock-1.6.0/include -I../../../3rdparty/libprocess/include -I../../../3rdparty/libprocess/3rdparty/stout/include
-I3rdparty/boost-1.53.0 -I3rdparty/glog-0.3.3/src -I3rdparty/libev-4.15 -I3rdparty/ry-http-parser-1c3624a
    -g -g2 -O2 -MT tests-timeseries_tests.o -MD -MP -MF .deps/tests-timeseries_tests.Tpo -c
-o tests-timeseries_tests.o `test -f 'src/tests/timeseries_tests.cpp' || echo '../../../3rdparty/libprocess/'`src/tests/timeseries_tests.cpp
mv -f .deps/tests-timeseries_tests.Tpo .deps/tests-timeseries_tests.Po
g++ -DPACKAGE_NAME=\"libprocess\" -DPACKAGE_TARNAME=\"libprocess\" -DPACKAGE_VERSION=\"0.0.1\"
-DPACKAGE_STRING=\"libprocess\ 0.0.1\" -DPACKAGE_BUGREPORT=\"\" -DPACKAGE_URL=\"\" -DPACKAGE=\"libprocess\"
-DVERSION=\"0.0.1\" -DSTDC_HEADERS=1 -DHAVE_SYS_TYPES_H=1 -DHAVE_SYS_STAT_H=1 -DHAVE_STDLIB_H=1
-DHAVE_STRING_H=1 -DHAVE_MEMORY_H=1 -DHAVE_STRINGS_H=1 -DHAVE_INTTYPES_H=1 -DHAVE_STDINT_H=1
-DHAVE_UNISTD_H=1 -DHAVE_DLFCN_H=1 -DLT_OBJDIR=\".libs/\" -DHAVE_PTHREAD=1 -DHAVE_LIBZ=1 -I.
-I../../../3rdparty/libprocess  -I../../../3rdparty/libprocess/src -I3rdparty/gmock-1.6.0/gtest/include
-I3rdparty/gmock-1.6.0/include -I../../../3rdparty/libprocess/include -I../../../3rdparty/libprocess/3rdparty/stout/include
-I3rdparty/boost-1.53.0 -I3rdparty/glog-0.3.3/src -I3rdparty/libev-4.15 -I3rdparty/ry-http-parser-1c3624a
    -g -g2 -O2 -MT tests-time_tests.o -MD -MP -MF .deps/tests-time_tests.Tpo -c -o tests-time_tests.o
`test -f 'src/tests/time_tests.cpp' || echo '../../../3rdparty/libprocess/'`src/tests/time_tests.cpp
mv -f .deps/tests-time_tests.Tpo .deps/tests-time_tests.Po
/bin/bash ./libtool --tag=CXX   --mode=link g++  -g -g2 -O2   -o tests tests-decoder_tests.o
tests-encoder_tests.o tests-http_tests.o tests-io_tests.o tests-main.o tests-owned_tests.o
tests-process_tests.o tests-shared_tests.o tests-statistics_tests.o tests-timeseries_tests.o
tests-time_tests.o 3rdparty/libgmock.la libprocess.la -lz  -lrt
libtool: link: g++ -g -g2 -O2 -o tests tests-decoder_tests.o tests-encoder_tests.o tests-http_tests.o
tests-io_tests.o tests-main.o tests-owned_tests.o tests-process_tests.o tests-shared_tests.o
tests-statistics_tests.o tests-timeseries_tests.o tests-time_tests.o  3rdparty/.libs/libgmock.a
./.libs/libprocess.a <https://builds.apache.org/job/Mesos-Trunk-Ubuntu-Build-Out-Of-Src-Disable-Java-Disable-Python-Disable-Webui/ws/build/3rdparty/libprocess/3rdparty/glog-0.3.3/.libs/libglog.a>
-lpthread <https://builds.apache.org/job/Mesos-Trunk-Ubuntu-Build-Out-Of-Src-Disable-Java-Disable-Python-Disable-Webui/ws/build/3rdparty/libprocess/3rdparty/libev-4.15/.libs/libev.a>
-lm -lz -lrt
make[5]: Leaving directory `<https://builds.apache.org/job/Mesos-Trunk-Ubuntu-Build-Out-Of-Src-Disable-Java-Disable-Python-Disable-Webui/ws/build/3rdparty/libprocess'>
make  check-local
make[5]: Entering directory `<https://builds.apache.org/job/Mesos-Trunk-Ubuntu-Build-Out-Of-Src-Disable-Java-Disable-Python-Disable-Webui/ws/build/3rdparty/libprocess'>
./tests
WARNING: Logging before InitGoogleLogging() is written to STDERR
I0122 21:57:10.310528 27472 process.cpp:1571] libprocess is initialized on 67.195.138.8:57817
for 8 cpus
[==========] Running 61 tests from 10 test cases.
[----------] Global test environment set-up.
[----------] 3 tests from Decoder
[ RUN      ] Decoder.Request
[       OK ] Decoder.Request (0 ms)
[ RUN      ] Decoder.RequestHeaderContinuation
[       OK ] Decoder.RequestHeaderContinuation (0 ms)
[ RUN      ] Decoder.Response
[       OK ] Decoder.Response (0 ms)
[----------] 3 tests from Decoder (0 ms total)

[----------] 2 tests from Encoder
[ RUN      ] Encoder.Response
[       OK ] Encoder.Response (0 ms)
[ RUN      ] Encoder.AcceptableEncodings
[       OK ] Encoder.AcceptableEncodings (1 ms)
[----------] 2 tests from Encoder (1 ms total)

[----------] 5 tests from HTTP
[ RUN      ] HTTP.Endpoints
I0122 21:57:10.311552 27479 process.cpp:3168] Handling HTTP event for process '(1)' with path:
'/(1)/body'
I0122 21:57:10.311825 27481 process.cpp:991] Socket error while receiving: Connection reset
by peer
I0122 21:57:10.312007 27478 process.cpp:3168] Handling HTTP event for process '(1)' with path:
'/(1)/pipe'
I0122 21:57:10.312177 27477 process.cpp:1751] Starting "chunked" streaming
I0122 21:57:10.312556 27481 process.cpp:993] Socket closed while receiving
[       OK ] HTTP.Endpoints (1 ms)
[ RUN      ] HTTP.Encode
[       OK ] HTTP.Encode (0 ms)
[ RUN      ] HTTP.PathParse
[       OK ] HTTP.PathParse (1 ms)
[ RUN      ] HTTP.Get
I0122 21:57:10.313158 27475 process.cpp:3168] Handling HTTP event for process '(2)' with path:
'/(2)/get'
I0122 21:57:10.313490 27481 process.cpp:993] Socket closed while receiving
I0122 21:57:10.313773 27475 process.cpp:3168] Handling HTTP event for process '(2)' with path:
'/(2)/get'
I0122 21:57:10.314013 27481 process.cpp:993] Socket closed while receiving
[       OK ] HTTP.Get (1 ms)
[ RUN      ] HTTP.Post
I0122 21:57:10.314396 27480 process.cpp:3168] Handling HTTP event for process '(3)' with path:
'/(3)/post'
I0122 21:57:10.314645 27481 process.cpp:993] Socket closed while receiving
[       OK ] HTTP.Post (0 ms)
[----------] 5 tests from HTTP (3 ms total)

[----------] 3 tests from IO
[ RUN      ] IO.Poll
[       OK ] IO.Poll (0 ms)
[ RUN      ] IO.Read
[       OK ] IO.Read (1 ms)
[ RUN      ] IO.BufferedRead
[       OK ] IO.BufferedRead (2 ms)
[----------] 3 tests from IO (3 ms total)

[----------] 3 tests from Owned
[ RUN      ] Owned.Access
[       OK ] Owned.Access (0 ms)
[ RUN      ] Owned.Null
[       OK ] Owned.Null (0 ms)
[ RUN      ] Owned.Share
[       OK ] Owned.Share (0 ms)
[----------] 3 tests from Owned (0 ms total)

[----------] 32 tests from Process
[ RUN      ] Process.event
[       OK ] Process.event (0 ms)
[ RUN      ] Process.future
[       OK ] Process.future (0 ms)
[ RUN      ] Process.associate
[       OK ] Process.associate (0 ms)
[ RUN      ] Process.onAny
[       OK ] Process.onAny (0 ms)
[ RUN      ] Process.then
[       OK ] Process.then (0 ms)
[ RUN      ] Process.chain
[       OK ] Process.chain (0 ms)
[ RUN      ] Process.spawn
[       OK ] Process.spawn (1 ms)
[ RUN      ] Process.dispatch
[       OK ] Process.dispatch (0 ms)
[ RUN      ] Process.defer1
[       OK ] Process.defer1 (1 ms)
[ RUN      ] Process.defer2
[       OK ] Process.defer2 (0 ms)
[ RUN      ] Process.defer3
[       OK ] Process.defer3 (0 ms)
[ RUN      ] Process.handlers
[       OK ] Process.handlers (0 ms)
[ RUN      ] Process.expect
[       OK ] Process.expect (3 ms)
[ RUN      ] Process.action
[       OK ] Process.action (1 ms)
[ RUN      ] Process.inheritance
[       OK ] Process.inheritance (0 ms)
[ RUN      ] Process.thunk
[       OK ] Process.thunk (0 ms)
[ RUN      ] Process.delegate
I0122 21:57:10.323567 27472 process.cpp:3151] Delegating message 'func' to (13)@67.195.138.8:57817
[       OK ] Process.delegate (0 ms)
[ RUN      ] Process.delay
[       OK ] Process.delay (5 ms)
[ RUN      ] Process.order
[       OK ] Process.order (0 ms)
[ RUN      ] Process.donate
[       OK ] Process.donate (0 ms)
[ RUN      ] Process.exited
[       OK ] Process.exited (0 ms)
[ RUN      ] Process.select
[       OK ] Process.select (0 ms)
[ RUN      ] Process.collect
[       OK ] Process.collect (0 ms)
[ RUN      ] Process.await
[       OK ] Process.await (1 ms)
[ RUN      ] Process.settle
[       OK ] Process.settle (40 ms)
[ RUN      ] Process.pid
[       OK ] Process.pid (0 ms)
[ RUN      ] Process.listener
[       OK ] Process.listener (0 ms)
[ RUN      ] Process.executor
[       OK ] Process.executor (0 ms)
[ RUN      ] Process.remote
I0122 21:57:10.370146 27481 process.cpp:993] Socket closed while receiving
[       OK ] Process.remote (1 ms)
[ RUN      ] Process.async
[       OK ] Process.async (1 ms)
[ RUN      ] Process.limiter
[       OK ] Process.limiter (7 ms)
[ RUN      ] Process.provide
I0122 21:57:10.378293 27477 process.cpp:3168] Handling HTTP event for process '(30)' with
path: '/(30)/'
I0122 21:57:10.378391 27477 process.cpp:1719] Sending file at '/tmp/BYrSnM/lorem.txt' with
length 446
I0122 21:57:10.378573 27481 process.cpp:993] Socket closed while receiving
[       OK ] Process.provide (0 ms)
[----------] 32 tests from Process (61 ms total)

[----------] 4 tests from Shared
[ RUN      ] Shared.ConstAccess
[       OK ] Shared.ConstAccess (1 ms)
[ RUN      ] Shared.Null
[       OK ] Shared.Null (0 ms)
[ RUN      ] Shared.Reset
[       OK ] Shared.Reset (0 ms)
[ RUN      ] Shared.Own
[       OK ] Shared.Own (0 ms)
[----------] 4 tests from Shared (1 ms total)

[----------] 3 tests from Statistics
[ RUN      ] Statistics.set
[       OK ] Statistics.set (0 ms)
[ RUN      ] Statistics.increment
[       OK ] Statistics.increment (0 ms)
[ RUN      ] Statistics.decrement
[       OK ] Statistics.decrement (1 ms)
[----------] 3 tests from Statistics (1 ms total)

[----------] 3 tests from TimeSeries
[ RUN      ] TimeSeries.set
[       OK ] TimeSeries.set (0 ms)
[ RUN      ] TimeSeries.sparsify
../../../3rdparty/libprocess/src/tests/timeseries_tests.cpp:56: Failure
Value of: series
  Actual: 88-byte object <FF-FF FF-FF FF-FF FF-7F 0A-00 00-00 00-00 00-00 38-F2 25-01 00-00
00-00 00-00 00-00 00-00 00-00 90-D2 25-01 00-00 00-00 40-DC 25-01 00-00 00-00 B0-C2 25-01
00-00 00-00 09-00 00-00 00-00 00-00 00-00 00-00 00-00 00-00 01-00 00-00 51-2B 00-00 00-00
00-00 00-00 00-00>
Expected: List<int>(0, 1, 2, 3, 4, 5, 6, 7, 8, 9)
Which is: { 0, 1, 2, 3, 4, 5, 6, 7, 8, 9 }
[  FAILED  ] TimeSeries.sparsify (0 ms)
[ RUN      ] TimeSeries.truncate
[       OK ] TimeSeries.truncate (1 ms)
[----------] 3 tests from TimeSeries (1 ms total)

[----------] 3 tests from TimeTest
[ RUN      ] TimeTest.Arithmetic
[       OK ] TimeTest.Arithmetic (0 ms)
[ RUN      ] TimeTest.Now
[       OK ] TimeTest.Now (0 ms)
[ RUN      ] TimeTest.Output
[       OK ] TimeTest.Output (0 ms)
[----------] 3 tests from TimeTest (0 ms total)

[----------] Global test environment tear-down
[==========] 61 tests from 10 test cases ran. (71 ms total)
[  PASSED  ] 60 tests.
[  FAILED  ] 1 test, listed below:
[  FAILED  ] TimeSeries.sparsify

 1 FAILED TEST
  YOU HAVE 1 DISABLED TEST

make[5]: *** [check-local] Error 1
make[5]: Leaving directory `<https://builds.apache.org/job/Mesos-Trunk-Ubuntu-Build-Out-Of-Src-Disable-Java-Disable-Python-Disable-Webui/ws/build/3rdparty/libprocess'>
make[4]: *** [check-am] Error 2
make[4]: Leaving directory `<https://builds.apache.org/job/Mesos-Trunk-Ubuntu-Build-Out-Of-Src-Disable-Java-Disable-Python-Disable-Webui/ws/build/3rdparty/libprocess'>
make[3]: *** [check-recursive] Error 1
make[3]: Leaving directory `<https://builds.apache.org/job/Mesos-Trunk-Ubuntu-Build-Out-Of-Src-Disable-Java-Disable-Python-Disable-Webui/ws/build/3rdparty/libprocess'>
make[2]: *** [check-recursive] Error 1
make[2]: Leaving directory `<https://builds.apache.org/job/Mesos-Trunk-Ubuntu-Build-Out-Of-Src-Disable-Java-Disable-Python-Disable-Webui/ws/build/3rdparty'>
make[1]: *** [check] Error 2
make[1]: Leaving directory `<https://builds.apache.org/job/Mesos-Trunk-Ubuntu-Build-Out-Of-Src-Disable-Java-Disable-Python-Disable-Webui/ws/build/3rdparty'>
make: *** [check-recursive] Error 1
Build step 'Execute shell' marked build as failure

Mime
View raw message