mesos-dev mailing list archives

Site index · List index
Message view « Date » · « Thread »
Top « Date » · « Thread »
From Apache Jenkins Server <jenk...@builds.apache.org>
Subject Build failed in Jenkins: Mesos-Trunk-Ubuntu-Build-Out-Of-Src-Disable-Java-Disable-Python-Disable-Webui #1575
Date Sun, 01 Sep 2013 07:53:22 GMT
See <https://builds.apache.org/job/Mesos-Trunk-Ubuntu-Build-Out-Of-Src-Disable-Java-Disable-Python-Disable-Webui/1575/>

------------------------------------------
[...truncated 1439 lines...]
[ RUN      ] FlagsTest.Flags
[       OK ] FlagsTest.Flags (0 ms)
[ RUN      ] FlagsTest.LoadFromEnvironment
[       OK ] FlagsTest.LoadFromEnvironment (0 ms)
[ RUN      ] FlagsTest.LoadFromCommandLine
[       OK ] FlagsTest.LoadFromCommandLine (0 ms)
[ RUN      ] FlagsTest.DuplicatesFromEnvironment
[       OK ] FlagsTest.DuplicatesFromEnvironment (0 ms)
[ RUN      ] FlagsTest.DuplicatesFromCommandLine
[       OK ] FlagsTest.DuplicatesFromCommandLine (0 ms)
[ RUN      ] FlagsTest.Errors
[       OK ] FlagsTest.Errors (0 ms)
[ RUN      ] FlagsTest.Usage
[       OK ] FlagsTest.Usage (0 ms)
[ RUN      ] FlagsTest.Duration
[       OK ] FlagsTest.Duration (0 ms)
[----------] 10 tests from FlagsTest (0 ms total)

[----------] 1 test from GzipTest
[ RUN      ] GzipTest.CompressDecompressString
[       OK ] GzipTest.CompressDecompressString (200 ms)
[----------] 1 test from GzipTest (200 ms total)

[----------] 1 test from HashsetTest
[ RUN      ] HashsetTest.Insert
[       OK ] HashsetTest.Insert (0 ms)
[----------] 1 test from HashsetTest (0 ms total)

[----------] 2 tests from JsonTest
[ RUN      ] JsonTest.BinaryData
[       OK ] JsonTest.BinaryData (0 ms)
[ RUN      ] JsonTest.NumberFormat
[       OK ] JsonTest.NumberFormat (0 ms)
[----------] 2 tests from JsonTest (0 ms total)

[----------] 5 tests from LinkedHashmapTest
[ RUN      ] LinkedHashmapTest.Put
[       OK ] LinkedHashmapTest.Put (0 ms)
[ RUN      ] LinkedHashmapTest.Contains
[       OK ] LinkedHashmapTest.Contains (0 ms)
[ RUN      ] LinkedHashmapTest.Erase
[       OK ] LinkedHashmapTest.Erase (0 ms)
[ RUN      ] LinkedHashmapTest.Keys
[       OK ] LinkedHashmapTest.Keys (0 ms)
[ RUN      ] LinkedHashmapTest.Values
[       OK ] LinkedHashmapTest.Values (0 ms)
[----------] 5 tests from LinkedHashmapTest (0 ms total)

[----------] 6 tests from MultimapTest/0, where TypeParam = Multimap<std::string, unsigned
short>
[ RUN      ] MultimapTest/0.Put
[       OK ] MultimapTest/0.Put (1 ms)
[ RUN      ] MultimapTest/0.Remove
[       OK ] MultimapTest/0.Remove (0 ms)
[ RUN      ] MultimapTest/0.Size
[       OK ] MultimapTest/0.Size (0 ms)
[ RUN      ] MultimapTest/0.Keys
[       OK ] MultimapTest/0.Keys (0 ms)
[ RUN      ] MultimapTest/0.Iterator
[       OK ] MultimapTest/0.Iterator (0 ms)
[ RUN      ] MultimapTest/0.Foreach
[       OK ] MultimapTest/0.Foreach (0 ms)
[----------] 6 tests from MultimapTest/0 (1 ms total)

[----------] 6 tests from MultimapTest/1, where TypeParam = multihashmap<std::string, unsigned
short>
[ RUN      ] MultimapTest/1.Put
[       OK ] MultimapTest/1.Put (0 ms)
[ RUN      ] MultimapTest/1.Remove
[       OK ] MultimapTest/1.Remove (0 ms)
[ RUN      ] MultimapTest/1.Size
[       OK ] MultimapTest/1.Size (0 ms)
[ RUN      ] MultimapTest/1.Keys
[       OK ] MultimapTest/1.Keys (0 ms)
[ RUN      ] MultimapTest/1.Iterator
[       OK ] MultimapTest/1.Iterator (0 ms)
[ RUN      ] MultimapTest/1.Foreach
[       OK ] MultimapTest/1.Foreach (0 ms)
[----------] 6 tests from MultimapTest/1 (0 ms total)

[----------] 1 test from NoneTest
[ RUN      ] NoneTest.Test
[       OK ] NoneTest.Test (0 ms)
[----------] 1 test from NoneTest (0 ms total)

[----------] 15 tests from OsTest
[ RUN      ] OsTest.rmdir
[       OK ] OsTest.rmdir (0 ms)
[ RUN      ] OsTest.nonblock
[       OK ] OsTest.nonblock (0 ms)
[ RUN      ] OsTest.touch
[       OK ] OsTest.touch (1 ms)
[ RUN      ] OsTest.readWriteString
[       OK ] OsTest.readWriteString (1 ms)
[ RUN      ] OsTest.find
[       OK ] OsTest.find (1 ms)
[ RUN      ] OsTest.uname
[       OK ] OsTest.uname (0 ms)
[ RUN      ] OsTest.sysname
[       OK ] OsTest.sysname (0 ms)
[ RUN      ] OsTest.release
[       OK ] OsTest.release (0 ms)
[ RUN      ] OsTest.sleep
[       OK ] OsTest.sleep (10 ms)
[ RUN      ] OsTest.pids
[       OK ] OsTest.pids (133 ms)
[ RUN      ] OsTest.children
[       OK ] OsTest.children (25 ms)
[ RUN      ] OsTest.process
[       OK ] OsTest.process (0 ms)
[ RUN      ] OsTest.processes
[       OK ] OsTest.processes (9 ms)
[ RUN      ] OsTest.killtree
../../../../3rdparty/libprocess/3rdparty/stout/tests/os_tests.cpp:456: Failure
Value of: trees.get().size()
  Actual: 1
Expected: 2u
Which is: 2
[ 
-+- 10015 
 \-+- 10016 
   \-+- 10017 
     \--- 10018 
]
../../../../3rdparty/libprocess/3rdparty/stout/tests/os_tests.cpp:467: Failure
Value of: tree.contains(greatGrandchild)
  Actual: true
Expected: false
-+- 10015 
 \-+- 10016 
   \-+- 10017 
     \--- 10018 
../../../../3rdparty/libprocess/3rdparty/stout/tests/os_tests.cpp:468: Failure
Value of: tree.contains(greatGreatGrandchild)
  Actual: true
Expected: false
-+- 10015 
 \-+- 10016 
   \-+- 10017 
     \--- 10018 
[  FAILED  ] OsTest.killtree (143 ms)
[ RUN      ] OsTest.pstree
[       OK ] OsTest.pstree (17 ms)
[----------] 15 tests from OsTest (340 ms total)

[----------] 1 test from ProtobufTest
[ RUN      ] ProtobufTest.JSON
[       OK ] ProtobufTest.JSON (1 ms)
[----------] 1 test from ProtobufTest (1 ms total)

[----------] 1 test from OsSendfileTest
[ RUN      ] OsSendfileTest.sendfile
[       OK ] OsSendfileTest.sendfile (0 ms)
[----------] 1 test from OsSendfileTest (0 ms total)

[----------] 1 test from OsSignalsTest
[ RUN      ] OsSignalsTest.suppress
[       OK ] OsSignalsTest.suppress (0 ms)
[----------] 1 test from OsSignalsTest (0 ms total)

[----------] 22 tests from StringsTest
[ RUN      ] StringsTest.Format
[       OK ] StringsTest.Format (0 ms)
[ RUN      ] StringsTest.Remove
[       OK ] StringsTest.Remove (0 ms)
[ RUN      ] StringsTest.Replace
[       OK ] StringsTest.Replace (0 ms)
[ RUN      ] StringsTest.Trim
[       OK ] StringsTest.Trim (0 ms)
[ RUN      ] StringsTest.Tokenize
[       OK ] StringsTest.Tokenize (0 ms)
[ RUN      ] StringsTest.TokenizeStringWithDelimsAtStart
[       OK ] StringsTest.TokenizeStringWithDelimsAtStart (0 ms)
[ RUN      ] StringsTest.TokenizeStringWithDelimsAtEnd
[       OK ] StringsTest.TokenizeStringWithDelimsAtEnd (0 ms)
[ RUN      ] StringsTest.TokenizeStringWithDelimsAtStartAndEnd
[       OK ] StringsTest.TokenizeStringWithDelimsAtStartAndEnd (0 ms)
[ RUN      ] StringsTest.TokenizeWithMultipleDelims
[       OK ] StringsTest.TokenizeWithMultipleDelims (0 ms)
[ RUN      ] StringsTest.TokenizeEmptyString
[       OK ] StringsTest.TokenizeEmptyString (0 ms)
[ RUN      ] StringsTest.TokenizeDelimOnlyString
[       OK ] StringsTest.TokenizeDelimOnlyString (0 ms)
[ RUN      ] StringsTest.TokenizeNullByteDelim
[       OK ] StringsTest.TokenizeNullByteDelim (0 ms)
[ RUN      ] StringsTest.SplitEmptyString
[       OK ] StringsTest.SplitEmptyString (0 ms)
[ RUN      ] StringsTest.SplitDelimOnlyString
[       OK ] StringsTest.SplitDelimOnlyString (0 ms)
[ RUN      ] StringsTest.Split
[       OK ] StringsTest.Split (0 ms)
[ RUN      ] StringsTest.SplitStringWithDelimsAtStart
[       OK ] StringsTest.SplitStringWithDelimsAtStart (0 ms)
[ RUN      ] StringsTest.SplitStringWithDelimsAtEnd
[       OK ] StringsTest.SplitStringWithDelimsAtEnd (0 ms)
[ RUN      ] StringsTest.SplitStringWithDelimsAtStartAndEnd
[       OK ] StringsTest.SplitStringWithDelimsAtStartAndEnd (0 ms)
[ RUN      ] StringsTest.SplitWithMultipleDelims
[       OK ] StringsTest.SplitWithMultipleDelims (0 ms)
[ RUN      ] StringsTest.Pairs
[       OK ] StringsTest.Pairs (0 ms)
[ RUN      ] StringsTest.StartsWith
[       OK ] StringsTest.StartsWith (0 ms)
[ RUN      ] StringsTest.Contains
[       OK ] StringsTest.Contains (0 ms)
[----------] 22 tests from StringsTest (0 ms total)

[----------] 1 test from Thread
[ RUN      ] Thread.local
[       OK ] Thread.local (0 ms)
[----------] 1 test from Thread (0 ms total)

[----------] 1 test from UUIDTest
[ RUN      ] UUIDTest.test
[       OK ] UUIDTest.test (1 ms)
[----------] 1 test from UUIDTest (1 ms total)

[----------] 4 tests from ProcTest
[ RUN      ] ProcTest.pids
[       OK ] ProcTest.pids (1 ms)
[ RUN      ] ProcTest.cpus
[       OK ] ProcTest.cpus (0 ms)
[ RUN      ] ProcTest.SystemStatus
[       OK ] ProcTest.SystemStatus (0 ms)
[ RUN      ] ProcTest.ProcessStatus
[       OK ] ProcTest.ProcessStatus (0 ms)
[----------] 4 tests from ProcTest (1 ms total)

[----------] Global test environment tear-down
[==========] 84 tests from 19 test cases ran. (645 ms total)
[  PASSED  ] 83 tests.
[  FAILED  ] 1 test, listed below:
[  FAILED  ] OsTest.killtree

 1 FAILED TEST
make[7]: *** [check-local] Error 1
make[7]: Leaving directory `/home/hudson/jenkins-slave/workspace/Mesos-Trunk-Ubuntu-Build-Out-Of-Src-Disable-Java-Disable-Python-Disable-Webui/build/3rdparty/libprocess/3rdparty'
make[6]: *** [check-am] Error 2
make[6]: Leaving directory `/home/hudson/jenkins-slave/workspace/Mesos-Trunk-Ubuntu-Build-Out-Of-Src-Disable-Java-Disable-Python-Disable-Webui/build/3rdparty/libprocess/3rdparty'
make[5]: *** [check-recursive] Error 1
make[5]: Leaving directory `/home/hudson/jenkins-slave/workspace/Mesos-Trunk-Ubuntu-Build-Out-Of-Src-Disable-Java-Disable-Python-Disable-Webui/build/3rdparty/libprocess/3rdparty'
make[4]: *** [check] Error 2
make[4]: Leaving directory `/home/hudson/jenkins-slave/workspace/Mesos-Trunk-Ubuntu-Build-Out-Of-Src-Disable-Java-Disable-Python-Disable-Webui/build/3rdparty/libprocess/3rdparty'
make[3]: *** [check-recursive] Error 1
make[3]: Leaving directory `/home/hudson/jenkins-slave/workspace/Mesos-Trunk-Ubuntu-Build-Out-Of-Src-Disable-Java-Disable-Python-Disable-Webui/build/3rdparty/libprocess'
make[2]: *** [check-recursive] Error 1
make[2]: Leaving directory `/home/hudson/jenkins-slave/workspace/Mesos-Trunk-Ubuntu-Build-Out-Of-Src-Disable-Java-Disable-Python-Disable-Webui/build/3rdparty'
make[1]: *** [check] Error 2
make[1]: Leaving directory `/home/hudson/jenkins-slave/workspace/Mesos-Trunk-Ubuntu-Build-Out-Of-Src-Disable-Java-Disable-Python-Disable-Webui/build/3rdparty'
make: *** [check-recursive] Error 1
Build step 'Execute shell' marked build as failure

Mime
View raw message