mesos-dev mailing list archives

Site index · List index
Message view « Date » · « Thread »
Top « Date » · « Thread »
From Apache Jenkins Server <jenk...@builds.apache.org>
Subject Build failed in Jenkins: Mesos-Trunk-Ubuntu-Build-Out-Of-Src-Set-JAVA_HOME #1603
Date Tue, 27 Aug 2013 18:17:04 GMT
See <https://builds.apache.org/job/Mesos-Trunk-Ubuntu-Build-Out-Of-Src-Set-JAVA_HOME/1603/changes>

Changes:

[vinod] Added resource checks to slave recovery tests to ensure resources

------------------------------------------
[...truncated 2652 lines...]
libtool: link: (cd ".libs" && rm -f "libmesos.so" && ln -s "libmesos-0.15.0.so" "libmesos.so")
libtool: link: ( cd ".libs" && rm -f "libmesos.la" && ln -s "../libmesos.la" "libmesos.la" )
g++ -DPACKAGE_NAME=\"mesos\" -DPACKAGE_TARNAME=\"mesos\" -DPACKAGE_VERSION=\"0.15.0\" -DPACKAGE_STRING=\"mesos\ 0.15.0\" -DPACKAGE_BUGREPORT=\"\" -DPACKAGE_URL=\"\" -DPACKAGE=\"mesos\" -DVERSION=\"0.15.0\" -DSTDC_HEADERS=1 -DHAVE_SYS_TYPES_H=1 -DHAVE_SYS_STAT_H=1 -DHAVE_STDLIB_H=1 -DHAVE_STRING_H=1 -DHAVE_MEMORY_H=1 -DHAVE_STRINGS_H=1 -DHAVE_INTTYPES_H=1 -DHAVE_STDINT_H=1 -DHAVE_UNISTD_H=1 -DHAVE_DLFCN_H=1 -DLT_OBJDIR=\".libs/\" -DHAVE_PTHREAD=1 -DMESOS_HAS_JAVA=1 -DHAVE_PYTHON=\"2.7\" -DMESOS_HAS_PYTHON=1 -I. -I../../src   -Wall -Werror -DLIBDIR=\"/usr/local/lib\" -DPKGLIBEXECDIR=\"/usr/local/libexec/mesos\" -DPKGDATADIR=\"/usr/local/share/mesos\" -I../../include -I../../3rdparty/libprocess/include -I../../3rdparty/libprocess/3rdparty/stout/include -I../include -I../3rdparty/libprocess/3rdparty/boost-1.53.0 -I../3rdparty/libprocess/3rdparty/protobuf-2.4.1/src -I../3rdparty/libprocess/3rdparty/glog-0.3.3/src -I../3rdparty/zookeeper-3.3.6/src/c/include -I../3rdparty/zookeeper-3.3.6/src/c/generated  -pthread -g -g2 -O2 -MT local/mesos_local-main.o -MD -MP -MF local/.deps/mesos_local-main.Tpo -c -o local/mesos_local-main.o `test -f 'local/main.cpp' || echo '../../src/'`local/main.cpp
mv -f local/.deps/mesos_local-main.Tpo local/.deps/mesos_local-main.Po
/bin/bash ../libtool --tag=CXX   --mode=link g++ -pthread -g -g2 -O2   -o mesos-local local/mesos_local-main.o libmesos.la -lrt
libtool: link: g++ -pthread -g -g2 -O2 -o .libs/mesos-local local/mesos_local-main.o  ./.libs/libmesos.so -lrt -pthread
g++ -DPACKAGE_NAME=\"mesos\" -DPACKAGE_TARNAME=\"mesos\" -DPACKAGE_VERSION=\"0.15.0\" -DPACKAGE_STRING=\"mesos\ 0.15.0\" -DPACKAGE_BUGREPORT=\"\" -DPACKAGE_URL=\"\" -DPACKAGE=\"mesos\" -DVERSION=\"0.15.0\" -DSTDC_HEADERS=1 -DHAVE_SYS_TYPES_H=1 -DHAVE_SYS_STAT_H=1 -DHAVE_STDLIB_H=1 -DHAVE_STRING_H=1 -DHAVE_MEMORY_H=1 -DHAVE_STRINGS_H=1 -DHAVE_INTTYPES_H=1 -DHAVE_STDINT_H=1 -DHAVE_UNISTD_H=1 -DHAVE_DLFCN_H=1 -DLT_OBJDIR=\".libs/\" -DHAVE_PTHREAD=1 -DMESOS_HAS_JAVA=1 -DHAVE_PYTHON=\"2.7\" -DMESOS_HAS_PYTHON=1 -I. -I../../src   -Wall -Werror -DLIBDIR=\"/usr/local/lib\" -DPKGLIBEXECDIR=\"/usr/local/libexec/mesos\" -DPKGDATADIR=\"/usr/local/share/mesos\" -I../../include -I../../3rdparty/libprocess/include -I../../3rdparty/libprocess/3rdparty/stout/include -I../include -I../3rdparty/libprocess/3rdparty/boost-1.53.0 -I../3rdparty/libprocess/3rdparty/protobuf-2.4.1/src -I../3rdparty/libprocess/3rdparty/glog-0.3.3/src -I../3rdparty/zookeeper-3.3.6/src/c/include -I../3rdparty/zookeeper-3.3.6/src/c/generated  -pthread -g -g2 -O2 -MT log/mesos_log-main.o -MD -MP -MF log/.deps/mesos_log-main.Tpo -c -o log/mesos_log-main.o `test -f 'log/main.cpp' || echo '../../src/'`log/main.cpp
mv -f log/.deps/mesos_log-main.Tpo log/.deps/mesos_log-main.Po
/bin/bash ../libtool --tag=CXX   --mode=link g++ -pthread -g -g2 -O2   -o mesos-log log/mesos_log-main.o libmesos.la -lrt
libtool: link: g++ -pthread -g -g2 -O2 -o .libs/mesos-log log/mesos_log-main.o  ./.libs/libmesos.so -lrt -pthread
g++ -DPACKAGE_NAME=\"mesos\" -DPACKAGE_TARNAME=\"mesos\" -DPACKAGE_VERSION=\"0.15.0\" -DPACKAGE_STRING=\"mesos\ 0.15.0\" -DPACKAGE_BUGREPORT=\"\" -DPACKAGE_URL=\"\" -DPACKAGE=\"mesos\" -DVERSION=\"0.15.0\" -DSTDC_HEADERS=1 -DHAVE_SYS_TYPES_H=1 -DHAVE_SYS_STAT_H=1 -DHAVE_STDLIB_H=1 -DHAVE_STRING_H=1 -DHAVE_MEMORY_H=1 -DHAVE_STRINGS_H=1 -DHAVE_INTTYPES_H=1 -DHAVE_STDINT_H=1 -DHAVE_UNISTD_H=1 -DHAVE_DLFCN_H=1 -DLT_OBJDIR=\".libs/\" -DHAVE_PTHREAD=1 -DMESOS_HAS_JAVA=1 -DHAVE_PYTHON=\"2.7\" -DMESOS_HAS_PYTHON=1 -I. -I../../src   -Wall -Werror -DLIBDIR=\"/usr/local/lib\" -DPKGLIBEXECDIR=\"/usr/local/libexec/mesos\" -DPKGDATADIR=\"/usr/local/share/mesos\" -I../../include -I../../3rdparty/libprocess/include -I../../3rdparty/libprocess/3rdparty/stout/include -I../include -I../3rdparty/libprocess/3rdparty/boost-1.53.0 -I../3rdparty/libprocess/3rdparty/protobuf-2.4.1/src -I../3rdparty/libprocess/3rdparty/glog-0.3.3/src -I../3rdparty/zookeeper-3.3.6/src/c/include -I../3rdparty/zookeeper-3.3.6/src/c/generated  -pthread -g -g2 -O2 -MT mesos/mesos_mesos-main.o -MD -MP -MF mesos/.deps/mesos_mesos-main.Tpo -c -o mesos/mesos_mesos-main.o `test -f 'mesos/main.cpp' || echo '../../src/'`mesos/main.cpp
mv -f mesos/.deps/mesos_mesos-main.Tpo mesos/.deps/mesos_mesos-main.Po
/bin/bash ../libtool --tag=CXX   --mode=link g++ -pthread -g -g2 -O2   -o mesos-mesos mesos/mesos_mesos-main.o libmesos.la -lrt
libtool: link: g++ -pthread -g -g2 -O2 -o .libs/mesos-mesos mesos/mesos_mesos-main.o  ./.libs/libmesos.so -lrt -pthread
g++ -DPACKAGE_NAME=\"mesos\" -DPACKAGE_TARNAME=\"mesos\" -DPACKAGE_VERSION=\"0.15.0\" -DPACKAGE_STRING=\"mesos\ 0.15.0\" -DPACKAGE_BUGREPORT=\"\" -DPACKAGE_URL=\"\" -DPACKAGE=\"mesos\" -DVERSION=\"0.15.0\" -DSTDC_HEADERS=1 -DHAVE_SYS_TYPES_H=1 -DHAVE_SYS_STAT_H=1 -DHAVE_STDLIB_H=1 -DHAVE_STRING_H=1 -DHAVE_MEMORY_H=1 -DHAVE_STRINGS_H=1 -DHAVE_INTTYPES_H=1 -DHAVE_STDINT_H=1 -DHAVE_UNISTD_H=1 -DHAVE_DLFCN_H=1 -DLT_OBJDIR=\".libs/\" -DHAVE_PTHREAD=1 -DMESOS_HAS_JAVA=1 -DHAVE_PYTHON=\"2.7\" -DMESOS_HAS_PYTHON=1 -I. -I../../src   -Wall -Werror -DLIBDIR=\"/usr/local/lib\" -DPKGLIBEXECDIR=\"/usr/local/libexec/mesos\" -DPKGDATADIR=\"/usr/local/share/mesos\" -I../../include -I../../3rdparty/libprocess/include -I../../3rdparty/libprocess/3rdparty/stout/include -I../include -I../3rdparty/libprocess/3rdparty/boost-1.53.0 -I../3rdparty/libprocess/3rdparty/protobuf-2.4.1/src -I../3rdparty/libprocess/3rdparty/glog-0.3.3/src -I../3rdparty/zookeeper-3.3.6/src/c/include -I../3rdparty/zookeeper-3.3.6/src/c/generated  -pthread -g -g2 -O2 -MT launcher/mesos_launcher-main.o -MD -MP -MF launcher/.deps/mesos_launcher-main.Tpo -c -o launcher/mesos_launcher-main.o `test -f 'launcher/main.cpp' || echo '../../src/'`launcher/main.cpp
mv -f launcher/.deps/mesos_launcher-main.Tpo launcher/.deps/mesos_launcher-main.Po
/bin/bash ../libtool --tag=CXX   --mode=link g++ -pthread -g -g2 -O2   -o mesos-launcher launcher/mesos_launcher-main.o libmesos.la -lrt
libtool: link: g++ -pthread -g -g2 -O2 -o .libs/mesos-launcher launcher/mesos_launcher-main.o  ./.libs/libmesos.so -lrt -pthread
g++ -DPACKAGE_NAME=\"mesos\" -DPACKAGE_TARNAME=\"mesos\" -DPACKAGE_VERSION=\"0.15.0\" -DPACKAGE_STRING=\"mesos\ 0.15.0\" -DPACKAGE_BUGREPORT=\"\" -DPACKAGE_URL=\"\" -DPACKAGE=\"mesos\" -DVERSION=\"0.15.0\" -DSTDC_HEADERS=1 -DHAVE_SYS_TYPES_H=1 -DHAVE_SYS_STAT_H=1 -DHAVE_STDLIB_H=1 -DHAVE_STRING_H=1 -DHAVE_MEMORY_H=1 -DHAVE_STRINGS_H=1 -DHAVE_INTTYPES_H=1 -DHAVE_STDINT_H=1 -DHAVE_UNISTD_H=1 -DHAVE_DLFCN_H=1 -DLT_OBJDIR=\".libs/\" -DHAVE_PTHREAD=1 -DMESOS_HAS_JAVA=1 -DHAVE_PYTHON=\"2.7\" -DMESOS_HAS_PYTHON=1 -I. -I../../src   -Wall -Werror -DLIBDIR=\"/usr/local/lib\" -DPKGLIBEXECDIR=\"/usr/local/libexec/mesos\" -DPKGDATADIR=\"/usr/local/share/mesos\" -I../../include -I../../3rdparty/libprocess/include -I../../3rdparty/libprocess/3rdparty/stout/include -I../include -I../3rdparty/libprocess/3rdparty/boost-1.53.0 -I../3rdparty/libprocess/3rdparty/protobuf-2.4.1/src -I../3rdparty/libprocess/3rdparty/glog-0.3.3/src -I../3rdparty/zookeeper-3.3.6/src/c/include -I../3rdparty/zookeeper-3.3.6/src/c/generated  -pthread -g -g2 -O2 -MT launcher/mesos_executor-executor.o -MD -MP -MF launcher/.deps/mesos_executor-executor.Tpo -c -o launcher/mesos_executor-executor.o `test -f 'launcher/executor.cpp' || echo '../../src/'`launcher/executor.cpp
mv -f launcher/.deps/mesos_executor-executor.Tpo launcher/.deps/mesos_executor-executor.Po
/bin/bash ../libtool --tag=CXX   --mode=link g++ -pthread -g -g2 -O2   -o mesos-executor launcher/mesos_executor-executor.o libmesos.la -lrt
libtool: link: g++ -pthread -g -g2 -O2 -o .libs/mesos-executor launcher/mesos_executor-executor.o  ./.libs/libmesos.so -lrt -pthread
g++ -DPACKAGE_NAME=\"mesos\" -DPACKAGE_TARNAME=\"mesos\" -DPACKAGE_VERSION=\"0.15.0\" -DPACKAGE_STRING=\"mesos\ 0.15.0\" -DPACKAGE_BUGREPORT=\"\" -DPACKAGE_URL=\"\" -DPACKAGE=\"mesos\" -DVERSION=\"0.15.0\" -DSTDC_HEADERS=1 -DHAVE_SYS_TYPES_H=1 -DHAVE_SYS_STAT_H=1 -DHAVE_STDLIB_H=1 -DHAVE_STRING_H=1 -DHAVE_MEMORY_H=1 -DHAVE_STRINGS_H=1 -DHAVE_INTTYPES_H=1 -DHAVE_STDINT_H=1 -DHAVE_UNISTD_H=1 -DHAVE_DLFCN_H=1 -DLT_OBJDIR=\".libs/\" -DHAVE_PTHREAD=1 -DMESOS_HAS_JAVA=1 -DHAVE_PYTHON=\"2.7\" -DMESOS_HAS_PYTHON=1 -I. -I../../src   -Wall -Werror -DLIBDIR=\"/usr/local/lib\" -DPKGLIBEXECDIR=\"/usr/local/libexec/mesos\" -DPKGDATADIR=\"/usr/local/share/mesos\" -I../../include -I../../3rdparty/libprocess/include -I../../3rdparty/libprocess/3rdparty/stout/include -I../include -I../3rdparty/libprocess/3rdparty/boost-1.53.0 -I../3rdparty/libprocess/3rdparty/protobuf-2.4.1/src -I../3rdparty/libprocess/3rdparty/glog-0.3.3/src -I../3rdparty/zookeeper-3.3.6/src/c/include -I../3rdparty/zookeeper-3.3.6/src/c/generated  -pthread -g -g2 -O2 -MT master/mesos_master-main.o -MD -MP -MF master/.deps/mesos_master-main.Tpo -c -o master/mesos_master-main.o `test -f 'master/main.cpp' || echo '../../src/'`master/main.cpp
mv -f master/.deps/mesos_master-main.Tpo master/.deps/mesos_master-main.Po
/bin/bash ../libtool --tag=CXX   --mode=link g++ -pthread -g -g2 -O2   -o mesos-master master/mesos_master-main.o libmesos.la -lrt
libtool: link: g++ -pthread -g -g2 -O2 -o .libs/mesos-master master/mesos_master-main.o  ./.libs/libmesos.so -lrt -pthread
g++ -DPACKAGE_NAME=\"mesos\" -DPACKAGE_TARNAME=\"mesos\" -DPACKAGE_VERSION=\"0.15.0\" -DPACKAGE_STRING=\"mesos\ 0.15.0\" -DPACKAGE_BUGREPORT=\"\" -DPACKAGE_URL=\"\" -DPACKAGE=\"mesos\" -DVERSION=\"0.15.0\" -DSTDC_HEADERS=1 -DHAVE_SYS_TYPES_H=1 -DHAVE_SYS_STAT_H=1 -DHAVE_STDLIB_H=1 -DHAVE_STRING_H=1 -DHAVE_MEMORY_H=1 -DHAVE_STRINGS_H=1 -DHAVE_INTTYPES_H=1 -DHAVE_STDINT_H=1 -DHAVE_UNISTD_H=1 -DHAVE_DLFCN_H=1 -DLT_OBJDIR=\".libs/\" -DHAVE_PTHREAD=1 -DMESOS_HAS_JAVA=1 -DHAVE_PYTHON=\"2.7\" -DMESOS_HAS_PYTHON=1 -I. -I../../src   -Wall -Werror -DLIBDIR=\"/usr/local/lib\" -DPKGLIBEXECDIR=\"/usr/local/libexec/mesos\" -DPKGDATADIR=\"/usr/local/share/mesos\" -I../../include -I../../3rdparty/libprocess/include -I../../3rdparty/libprocess/3rdparty/stout/include -I../include -I../3rdparty/libprocess/3rdparty/boost-1.53.0 -I../3rdparty/libprocess/3rdparty/protobuf-2.4.1/src -I../3rdparty/libprocess/3rdparty/glog-0.3.3/src -I../3rdparty/zookeeper-3.3.6/src/c/include -I../3rdparty/zookeeper-3.3.6/src/c/generated  -pthread -g -g2 -O2 -MT slave/mesos_slave-main.o -MD -MP -MF slave/.deps/mesos_slave-main.Tpo -c -o slave/mesos_slave-main.o `test -f 'slave/main.cpp' || echo '../../src/'`slave/main.cpp
mv -f slave/.deps/mesos_slave-main.Tpo slave/.deps/mesos_slave-main.Po
/bin/bash ../libtool --tag=CXX   --mode=link g++ -pthread -g -g2 -O2   -o mesos-slave slave/mesos_slave-main.o libmesos.la -lrt
libtool: link: g++ -pthread -g -g2 -O2 -o .libs/mesos-slave slave/mesos_slave-main.o  ./.libs/libmesos.so -lrt -pthread
Building protobuf Python egg ...
cd ../3rdparty/libprocess/3rdparty/protobuf-2.4.1/python && \
	  PYTHONPATH=/x1/jenkins/jenkins-slave/workspace/Mesos-Trunk-Ubuntu-Build-Out-Of-Src-Set-JAVA_HOME/build/3rdparty/distribute-0.6.26/dist/distribute-0.6.26-py2.7.egg /usr/bin/python setup.py bdist_egg
Generating google/protobuf/descriptor_pb2.py...
Generating google/protobuf/compiler/plugin_pb2.py...
running bdist_egg
running egg_info
creating protobuf.egg-info
writing protobuf.egg-info/PKG-INFO
writing namespace_packages to protobuf.egg-info/namespace_packages.txt
writing top-level names to protobuf.egg-info/top_level.txt
writing dependency_links to protobuf.egg-info/dependency_links.txt
writing manifest file 'protobuf.egg-info/SOURCES.txt'
package init file 'google/protobuf/compiler/__init__.py' not found (or not a regular file)
reading manifest file 'protobuf.egg-info/SOURCES.txt'
writing manifest file 'protobuf.egg-info/SOURCES.txt'
installing library code to build/bdist.linux-x86_64/egg
running install_lib
running build_py
creating build
creating build/lib.linux-x86_64-2.7
creating build/lib.linux-x86_64-2.7/google
creating build/lib.linux-x86_64-2.7/google/protobuf
creating build/lib.linux-x86_64-2.7/google/protobuf/internal
copying google/protobuf/internal/__init__.py -> build/lib.linux-x86_64-2.7/google/protobuf/internal
copying google/protobuf/internal/api_implementation.py -> build/lib.linux-x86_64-2.7/google/protobuf/internal
copying google/protobuf/internal/containers.py -> build/lib.linux-x86_64-2.7/google/protobuf/internal
copying google/protobuf/internal/cpp_message.py -> build/lib.linux-x86_64-2.7/google/protobuf/internal
copying google/protobuf/internal/decoder.py -> build/lib.linux-x86_64-2.7/google/protobuf/internal
copying google/protobuf/internal/encoder.py -> build/lib.linux-x86_64-2.7/google/protobuf/internal
copying google/protobuf/internal/message_listener.py -> build/lib.linux-x86_64-2.7/google/protobuf/internal
copying google/protobuf/internal/python_message.py -> build/lib.linux-x86_64-2.7/google/protobuf/internal
copying google/protobuf/internal/type_checkers.py -> build/lib.linux-x86_64-2.7/google/protobuf/internal
copying google/protobuf/internal/wire_format.py -> build/lib.linux-x86_64-2.7/google/protobuf/internal
copying google/protobuf/__init__.py -> build/lib.linux-x86_64-2.7/google/protobuf
copying google/protobuf/descriptor.py -> build/lib.linux-x86_64-2.7/google/protobuf
copying google/protobuf/descriptor_pb2.py -> build/lib.linux-x86_64-2.7/google/protobuf
creating build/lib.linux-x86_64-2.7/google/protobuf/compiler
copying google/protobuf/compiler/plugin_pb2.py -> build/lib.linux-x86_64-2.7/google/protobuf/compiler
copying google/protobuf/message.py -> build/lib.linux-x86_64-2.7/google/protobuf
copying google/protobuf/reflection.py -> build/lib.linux-x86_64-2.7/google/protobuf
copying google/protobuf/service.py -> build/lib.linux-x86_64-2.7/google/protobuf
copying google/protobuf/service_reflection.py -> build/lib.linux-x86_64-2.7/google/protobuf
copying google/protobuf/text_format.py -> build/lib.linux-x86_64-2.7/google/protobuf
copying google/__init__.py -> build/lib.linux-x86_64-2.7/google
creating build/bdist.linux-x86_64
creating build/bdist.linux-x86_64/egg
creating build/bdist.linux-x86_64/egg/google
creating build/bdist.linux-x86_64/egg/google/protobuf
copying build/lib.linux-x86_64-2.7/google/protobuf/descriptor_pb2.py -> build/bdist.linux-x86_64/egg/google/protobuf
creating build/bdist.linux-x86_64/egg/google/protobuf/internal
copying build/lib.linux-x86_64-2.7/google/protobuf/internal/containers.py -> build/bdist.linux-x86_64/egg/google/protobuf/internal
copying build/lib.linux-x86_64-2.7/google/protobuf/internal/encoder.py -> build/bdist.linux-x86_64/egg/google/protobuf/internal
copying build/lib.linux-x86_64-2.7/google/protobuf/internal/decoder.py -> build/bdist.linux-x86_64/egg/google/protobuf/internal
copying build/lib.linux-x86_64-2.7/google/protobuf/internal/api_implementation.py -> build/bdist.linux-x86_64/egg/google/protobuf/internal
copying build/lib.linux-x86_64-2.7/google/protobuf/internal/type_checkers.py -> build/bdist.linux-x86_64/egg/google/protobuf/internal
copying build/lib.linux-x86_64-2.7/google/protobuf/internal/cpp_message.py -> build/bdist.linux-x86_64/egg/google/protobuf/internal
copying build/lib.linux-x86_64-2.7/google/protobuf/internal/wire_format.py -> build/bdist.linux-x86_64/egg/google/protobuf/internal
copying build/lib.linux-x86_64-2.7/google/protobuf/internal/message_listener.py -> build/bdist.linux-x86_64/egg/google/protobuf/internal
copying build/lib.linux-x86_64-2.7/google/protobuf/internal/__init__.py -> build/bdist.linux-x86_64/egg/google/protobuf/internal
copying build/lib.linux-x86_64-2.7/google/protobuf/internal/python_message.py -> build/bdist.linux-x86_64/egg/google/protobuf/internal
copying build/lib.linux-x86_64-2.7/google/protobuf/descriptor.py -> build/bdist.linux-x86_64/egg/google/protobuf
copying build/lib.linux-x86_64-2.7/google/protobuf/reflection.py -> build/bdist.linux-x86_64/egg/google/protobuf
copying build/lib.linux-x86_64-2.7/google/protobuf/message.py -> build/bdist.linux-x86_64/egg/google/protobuf
copying build/lib.linux-x86_64-2.7/google/protobuf/text_format.py -> build/bdist.linux-x86_64/egg/google/protobuf
creating build/bdist.linux-x86_64/egg/google/protobuf/compiler
copying build/lib.linux-x86_64-2.7/google/protobuf/compiler/plugin_pb2.py -> build/bdist.linux-x86_64/egg/google/protobuf/compiler
copying build/lib.linux-x86_64-2.7/google/protobuf/service.py -> build/bdist.linux-x86_64/egg/google/protobuf
copying build/lib.linux-x86_64-2.7/google/protobuf/service_reflection.py -> build/bdist.linux-x86_64/egg/google/protobuf
copying build/lib.linux-x86_64-2.7/google/protobuf/__init__.py -> build/bdist.linux-x86_64/egg/google/protobuf
copying build/lib.linux-x86_64-2.7/google/__init__.py -> build/bdist.linux-x86_64/egg/google
byte-compiling build/bdist.linux-x86_64/egg/google/protobuf/descriptor_pb2.py to descriptor_pb2.pyc
byte-compiling build/bdist.linux-x86_64/egg/google/protobuf/internal/containers.py to containers.pyc
byte-compiling build/bdist.linux-x86_64/egg/google/protobuf/internal/encoder.py to encoder.pyc
byte-compiling build/bdist.linux-x86_64/egg/google/protobuf/internal/decoder.py to decoder.pyc
byte-compiling build/bdist.linux-x86_64/egg/google/protobuf/internal/api_implementation.py to api_implementation.pyc
byte-compiling build/bdist.linux-x86_64/egg/google/protobuf/internal/type_checkers.py to type_checkers.pyc
byte-compiling build/bdist.linux-x86_64/egg/google/protobuf/internal/cpp_message.py to cpp_message.pyc
byte-compiling build/bdist.linux-x86_64/egg/google/protobuf/internal/wire_format.py to wire_format.pyc
byte-compiling build/bdist.linux-x86_64/egg/google/protobuf/internal/message_listener.py to message_listener.pyc
byte-compiling build/bdist.linux-x86_64/egg/google/protobuf/internal/__init__.py to __init__.pyc
byte-compiling build/bdist.linux-x86_64/egg/google/protobuf/internal/python_message.py to python_message.pyc
byte-compiling build/bdist.linux-x86_64/egg/google/protobuf/descriptor.py to descriptor.pyc
byte-compiling build/bdist.linux-x86_64/egg/google/protobuf/reflection.py to reflection.pyc
byte-compiling build/bdist.linux-x86_64/egg/google/protobuf/message.py to message.pyc
byte-compiling build/bdist.linux-x86_64/egg/google/protobuf/text_format.py to text_format.pyc
byte-compiling build/bdist.linux-x86_64/egg/google/protobuf/compiler/plugin_pb2.py to plugin_pb2.pyc
byte-compiling build/bdist.linux-x86_64/egg/google/protobuf/service.py to service.pyc
byte-compiling build/bdist.linux-x86_64/egg/google/protobuf/service_reflection.py to service_reflection.pyc
byte-compiling build/bdist.linux-x86_64/egg/google/protobuf/__init__.py to __init__.pyc
byte-compiling build/bdist.linux-x86_64/egg/google/__init__.py to __init__.pyc
Creating missing __init__.py for google.protobuf.compiler
byte-compiling build/bdist.linux-x86_64/egg/google/protobuf/compiler/__init__.py to __init__.pyc
creating build/bdist.linux-x86_64/egg/EGG-INFO
copying protobuf.egg-info/PKG-INFO -> build/bdist.linux-x86_64/egg/EGG-INFO
copying protobuf.egg-info/SOURCES.txt -> build/bdist.linux-x86_64/egg/EGG-INFO
copying protobuf.egg-info/dependency_links.txt -> build/bdist.linux-x86_64/egg/EGG-INFO
copying protobuf.egg-info/namespace_packages.txt -> build/bdist.linux-x86_64/egg/EGG-INFO
copying protobuf.egg-info/top_level.txt -> build/bdist.linux-x86_64/egg/EGG-INFO
zip_safe flag not set; analyzing archive contents...
creating dist
creating 'dist/protobuf-2.4.1-py2.7.egg' and adding 'build/bdist.linux-x86_64/egg' to it
removing 'build/bdist.linux-x86_64/egg' (and everything under it)
Building Mesos Python egg ...
WARNING: '.' not a valid package name; please use only.-separated package names in setup.py
running bdist_egg
running egg_info
creating src/mesos.egg-info
writing requirements to src/mesos.egg-info/requires.txt
writing src/mesos.egg-info/PKG-INFO
writing top-level names to src/mesos.egg-info/top_level.txt
writing dependency_links to src/mesos.egg-info/dependency_links.txt
writing manifest file 'src/mesos.egg-info/SOURCES.txt'
package init file 'src/__init__.py' not found (or not a regular file)
reading manifest file 'src/mesos.egg-info/SOURCES.txt'
writing manifest file 'src/mesos.egg-info/SOURCES.txt'
installing library code to build/bdist.linux-x86_64/egg
running install_lib
running build_py
creating build
creating build/lib.linux-x86_64-2.7
copying src/mesos.py -> build/lib.linux-x86_64-2.7
copying src/mesos_pb2.py -> build/lib.linux-x86_64-2.7
running build_ext
building '_mesos' extension
creating build/temp.linux-x86_64-2.7
creating build/temp.linux-x86_64-2.7/native
gcc -pthread -fno-strict-aliasing -DNDEBUG -g -fwrapv -O2 -Wall -Wstrict-prototypes -fPIC -I/x1/jenkins/jenkins-slave/workspace/Mesos-Trunk-Ubuntu-Build-Out-Of-Src-Set-JAVA_HOME/build/../include -I/x1/jenkins/jenkins-slave/workspace/Mesos-Trunk-Ubuntu-Build-Out-Of-Src-Set-JAVA_HOME/build/include -I/x1/jenkins/jenkins-slave/workspace/Mesos-Trunk-Ubuntu-Build-Out-Of-Src-Set-JAVA_HOME/build/src -I/x1/jenkins/jenkins-slave/workspace/Mesos-Trunk-Ubuntu-Build-Out-Of-Src-Set-JAVA_HOME/build/src/python/native -I/x1/jenkins/jenkins-slave/workspace/Mesos-Trunk-Ubuntu-Build-Out-Of-Src-Set-JAVA_HOME/build/3rdparty/libprocess/3rdparty/protobuf-2.4.1/src -I/usr/include/python2.7 -c native/proxy_executor.cpp -o build/temp.linux-x86_64-2.7/native/proxy_executor.o
cc1plus: warning: command line option '-Wstrict-prototypes' is valid for Ada/C/ObjC but not for C++ [enabled by default]
gcc -pthread -fno-strict-aliasing -DNDEBUG -g -fwrapv -O2 -Wall -Wstrict-prototypes -fPIC -I/x1/jenkins/jenkins-slave/workspace/Mesos-Trunk-Ubuntu-Build-Out-Of-Src-Set-JAVA_HOME/build/../include -I/x1/jenkins/jenkins-slave/workspace/Mesos-Trunk-Ubuntu-Build-Out-Of-Src-Set-JAVA_HOME/build/include -I/x1/jenkins/jenkins-slave/workspace/Mesos-Trunk-Ubuntu-Build-Out-Of-Src-Set-JAVA_HOME/build/src -I/x1/jenkins/jenkins-slave/workspace/Mesos-Trunk-Ubuntu-Build-Out-Of-Src-Set-JAVA_HOME/build/src/python/native -I/x1/jenkins/jenkins-slave/workspace/Mesos-Trunk-Ubuntu-Build-Out-Of-Src-Set-JAVA_HOME/build/3rdparty/libprocess/3rdparty/protobuf-2.4.1/src -I/usr/include/python2.7 -c native/mesos_executor_driver_impl.cpp -o build/temp.linux-x86_64-2.7/native/mesos_executor_driver_impl.o
cc1plus: warning: command line option '-Wstrict-prototypes' is valid for Ada/C/ObjC but not for C++ [enabled by default]
gcc -pthread -fno-strict-aliasing -DNDEBUG -g -fwrapv -O2 -Wall -Wstrict-prototypes -fPIC -I/x1/jenkins/jenkins-slave/workspace/Mesos-Trunk-Ubuntu-Build-Out-Of-Src-Set-JAVA_HOME/build/../include -I/x1/jenkins/jenkins-slave/workspace/Mesos-Trunk-Ubuntu-Build-Out-Of-Src-Set-JAVA_HOME/build/include -I/x1/jenkins/jenkins-slave/workspace/Mesos-Trunk-Ubuntu-Build-Out-Of-Src-Set-JAVA_HOME/build/src -I/x1/jenkins/jenkins-slave/workspace/Mesos-Trunk-Ubuntu-Build-Out-Of-Src-Set-JAVA_HOME/build/src/python/native -I/x1/jenkins/jenkins-slave/workspace/Mesos-Trunk-Ubuntu-Build-Out-Of-Src-Set-JAVA_HOME/build/3rdparty/libprocess/3rdparty/protobuf-2.4.1/src -I/usr/include/python2.7 -c native/module.cpp -o build/temp.linux-x86_64-2.7/native/module.o
cc1plus: warning: command line option '-Wstrict-prototypes' is valid for Ada/C/ObjC but not for C++ [enabled by default]
gcc -pthread -fno-strict-aliasing -DNDEBUG -g -fwrapv -O2 -Wall -Wstrict-prototypes -fPIC -I/x1/jenkins/jenkins-slave/workspace/Mesos-Trunk-Ubuntu-Build-Out-Of-Src-Set-JAVA_HOME/build/../include -I/x1/jenkins/jenkins-slave/workspace/Mesos-Trunk-Ubuntu-Build-Out-Of-Src-Set-JAVA_HOME/build/include -I/x1/jenkins/jenkins-slave/workspace/Mesos-Trunk-Ubuntu-Build-Out-Of-Src-Set-JAVA_HOME/build/src -I/x1/jenkins/jenkins-slave/workspace/Mesos-Trunk-Ubuntu-Build-Out-Of-Src-Set-JAVA_HOME/build/src/python/native -I/x1/jenkins/jenkins-slave/workspace/Mesos-Trunk-Ubuntu-Build-Out-Of-Src-Set-JAVA_HOME/build/3rdparty/libprocess/3rdparty/protobuf-2.4.1/src -I/usr/include/python2.7 -c native/proxy_scheduler.cpp -o build/temp.linux-x86_64-2.7/native/proxy_scheduler.o
cc1plus: warning: command line option '-Wstrict-prototypes' is valid for Ada/C/ObjC but not for C++ [enabled by default]
gcc -pthread -fno-strict-aliasing -DNDEBUG -g -fwrapv -O2 -Wall -Wstrict-prototypes -fPIC -I/x1/jenkins/jenkins-slave/workspace/Mesos-Trunk-Ubuntu-Build-Out-Of-Src-Set-JAVA_HOME/build/../include -I/x1/jenkins/jenkins-slave/workspace/Mesos-Trunk-Ubuntu-Build-Out-Of-Src-Set-JAVA_HOME/build/include -I/x1/jenkins/jenkins-slave/workspace/Mesos-Trunk-Ubuntu-Build-Out-Of-Src-Set-JAVA_HOME/build/src -I/x1/jenkins/jenkins-slave/workspace/Mesos-Trunk-Ubuntu-Build-Out-Of-Src-Set-JAVA_HOME/build/src/python/native -I/x1/jenkins/jenkins-slave/workspace/Mesos-Trunk-Ubuntu-Build-Out-Of-Src-Set-JAVA_HOME/build/3rdparty/libprocess/3rdparty/protobuf-2.4.1/src -I/usr/include/python2.7 -c native/mesos_scheduler_driver_impl.cpp -o build/temp.linux-x86_64-2.7/native/mesos_scheduler_driver_impl.o
cc1plus: warning: command line option '-Wstrict-prototypes' is valid for Ada/C/ObjC but not for C++ [enabled by default]
g++ -pthread -shared -Wl,-O1 -Wl,-Bsymbolic-functions -Wl,-Bsymbolic-functions -Wl,-z,relro build/temp.linux-x86_64-2.7/native/proxy_executor.o build/temp.linux-x86_64-2.7/native/mesos_executor_driver_impl.o build/temp.linux-x86_64-2.7/native/module.o build/temp.linux-x86_64-2.7/native/proxy_scheduler.o build/temp.linux-x86_64-2.7/native/mesos_scheduler_driver_impl.o /x1/jenkins/jenkins-slave/workspace/Mesos-Trunk-Ubuntu-Build-Out-Of-Src-Set-JAVA_HOME/build/src/.libs/libmesos_no_3rdparty.a /x1/jenkins/jenkins-slave/workspace/Mesos-Trunk-Ubuntu-Build-Out-Of-Src-Set-JAVA_HOME/build/3rdparty/libprocess/3rdparty/protobuf-2.4.1/src/.libs/libprotobuf.a /x1/jenkins/jenkins-slave/workspace/Mesos-Trunk-Ubuntu-Build-Out-Of-Src-Set-JAVA_HOME/build/3rdparty/leveldb/libleveldb.a /x1/jenkins/jenkins-slave/workspace/Mesos-Trunk-Ubuntu-Build-Out-Of-Src-Set-JAVA_HOME/build/3rdparty/zookeeper-3.3.6/src/c/.libs/libzookeeper_mt.a /x1/jenkins/jenkins-slave/workspace/Mesos-Trunk-Ubuntu-Build-Out-Of-Src-Set-JAVA_HOME/build/3rdparty/libprocess/.libs/libprocess.a /x1/jenkins/jenkins-slave/workspace/Mesos-Trunk-Ubuntu-Build-Out-Of-Src-Set-JAVA_HOME/build/3rdparty/libprocess/3rdparty/glog-0.3.3/.libs/libglog.a /x1/jenkins/jenkins-slave/workspace/Mesos-Trunk-Ubuntu-Build-Out-Of-Src-Set-JAVA_HOME/build/3rdparty/libprocess/3rdparty/libev-4.15/.libs/libev.a -o build/lib.linux-x86_64-2.7/_mesos.so -lrt
creating build/bdist.linux-x86_64
creating build/bdist.linux-x86_64/egg
copying build/lib.linux-x86_64-2.7/mesos.py -> build/bdist.linux-x86_64/egg
copying build/lib.linux-x86_64-2.7/_mesos.so -> build/bdist.linux-x86_64/egg
copying build/lib.linux-x86_64-2.7/mesos_pb2.py -> build/bdist.linux-x86_64/egg
byte-compiling build/bdist.linux-x86_64/egg/mesos.py to mesos.pyc
byte-compiling build/bdist.linux-x86_64/egg/mesos_pb2.py to mesos_pb2.pyc
creating stub loader for _mesos.so
byte-compiling build/bdist.linux-x86_64/egg/_mesos.py to _mesos.pyc
creating build/bdist.linux-x86_64/egg/EGG-INFO
copying src/mesos.egg-info/PKG-INFO -> build/bdist.linux-x86_64/egg/EGG-INFO
copying src/mesos.egg-info/SOURCES.txt -> build/bdist.linux-x86_64/egg/EGG-INFO
copying src/mesos.egg-info/dependency_links.txt -> build/bdist.linux-x86_64/egg/EGG-INFO
copying src/mesos.egg-info/requires.txt -> build/bdist.linux-x86_64/egg/EGG-INFO
copying src/mesos.egg-info/top_level.txt -> build/bdist.linux-x86_64/egg/EGG-INFO
writing build/bdist.linux-x86_64/egg/EGG-INFO/native_libs.txt
zip_safe flag not set; analyzing archive contents...
creating dist
creating 'dist/mesos-0.15.0-py2.7-linux-x86_64.egg' and adding 'build/bdist.linux-x86_64/egg' to it
removing 'build/bdist.linux-x86_64/egg' (and everything under it)
make  test-framework test-executor long-lived-framework long-lived-executor no-executor-framework balloon-framework balloon-executor mesos-tests  examples/python/test_framework.py examples/python/test-framework examples/python/test_executor.py examples/python/test-executor \
	  tests/balloon_framework_test.sh tests/test_framework_test.sh tests/no_executor_framework_test.sh tests/java_exception_test.sh tests/java_framework_test.sh tests/python_framework_test.sh
make[3]: Entering directory `/x1/jenkins/jenkins-slave/workspace/Mesos-Trunk-Ubuntu-Build-Out-Of-Src-Set-JAVA_HOME/build/src'
g++ -DPACKAGE_NAME=\"mesos\" -DPACKAGE_TARNAME=\"mesos\" -DPACKAGE_VERSION=\"0.15.0\" -DPACKAGE_STRING=\"mesos\ 0.15.0\" -DPACKAGE_BUGREPORT=\"\" -DPACKAGE_URL=\"\" -DPACKAGE=\"mesos\" -DVERSION=\"0.15.0\" -DSTDC_HEADERS=1 -DHAVE_SYS_TYPES_H=1 -DHAVE_SYS_STAT_H=1 -DHAVE_STDLIB_H=1 -DHAVE_STRING_H=1 -DHAVE_MEMORY_H=1 -DHAVE_STRINGS_H=1 -DHAVE_INTTYPES_H=1 -DHAVE_STDINT_H=1 -DHAVE_UNISTD_H=1 -DHAVE_DLFCN_H=1 -DLT_OBJDIR=\".libs/\" -DHAVE_PTHREAD=1 -DMESOS_HAS_JAVA=1 -DHAVE_PYTHON=\"2.7\" -DMESOS_HAS_PYTHON=1 -I. -I../../src   -Wall -Werror -DLIBDIR=\"/usr/local/lib\" -DPKGLIBEXECDIR=\"/usr/local/libexec/mesos\" -DPKGDATADIR=\"/usr/local/share/mesos\" -I../../include -I../../3rdparty/libprocess/include -I../../3rdparty/libprocess/3rdparty/stout/include -I../include -I../3rdparty/libprocess/3rdparty/boost-1.53.0 -I../3rdparty/libprocess/3rdparty/protobuf-2.4.1/src -I../3rdparty/libprocess/3rdparty/glog-0.3.3/src -I../3rdparty/zookeeper-3.3.6/src/c/include -I../3rdparty/zookeeper-3.3.6/src/c/generated  -pthread -g -g2 -O2 -MT examples/test_framework-test_framework.o -MD -MP -MF examples/.deps/test_framework-test_framework.Tpo -c -o examples/test_framework-test_framework.o `test -f 'examples/test_framework.cpp' || echo '../../src/'`examples/test_framework.cpp
mv -f examples/.deps/test_framework-test_framework.Tpo examples/.deps/test_framework-test_framework.Po
/bin/bash ../libtool --tag=CXX   --mode=link g++ -pthread -g -g2 -O2   -o test-framework examples/test_framework-test_framework.o libmesos.la -lrt
libtool: link: g++ -pthread -g -g2 -O2 -o .libs/test-framework examples/test_framework-test_framework.o  ./.libs/libmesos.so -lrt -pthread
g++ -DPACKAGE_NAME=\"mesos\" -DPACKAGE_TARNAME=\"mesos\" -DPACKAGE_VERSION=\"0.15.0\" -DPACKAGE_STRING=\"mesos\ 0.15.0\" -DPACKAGE_BUGREPORT=\"\" -DPACKAGE_URL=\"\" -DPACKAGE=\"mesos\" -DVERSION=\"0.15.0\" -DSTDC_HEADERS=1 -DHAVE_SYS_TYPES_H=1 -DHAVE_SYS_STAT_H=1 -DHAVE_STDLIB_H=1 -DHAVE_STRING_H=1 -DHAVE_MEMORY_H=1 -DHAVE_STRINGS_H=1 -DHAVE_INTTYPES_H=1 -DHAVE_STDINT_H=1 -DHAVE_UNISTD_H=1 -DHAVE_DLFCN_H=1 -DLT_OBJDIR=\".libs/\" -DHAVE_PTHREAD=1 -DMESOS_HAS_JAVA=1 -DHAVE_PYTHON=\"2.7\" -DMESOS_HAS_PYTHON=1 -I. -I../../src   -Wall -Werror -DLIBDIR=\"/usr/local/lib\" -DPKGLIBEXECDIR=\"/usr/local/libexec/mesos\" -DPKGDATADIR=\"/usr/local/share/mesos\" -I../../include -I../../3rdparty/libprocess/include -I../../3rdparty/libprocess/3rdparty/stout/include -I../include -I../3rdparty/libprocess/3rdparty/boost-1.53.0 -I../3rdparty/libprocess/3rdparty/protobuf-2.4.1/src -I../3rdparty/libprocess/3rdparty/glog-0.3.3/src -I../3rdparty/zookeeper-3.3.6/src/c/include -I../3rdparty/zookeeper-3.3.6/src/c/generated  -pthread -g -g2 -O2 -MT examples/test_executor-test_executor.o -MD -MP -MF examples/.deps/test_executor-test_executor.Tpo -c -o examples/test_executor-test_executor.o `test -f 'examples/test_executor.cpp' || echo '../../src/'`examples/test_executor.cpp
mv -f examples/.deps/test_executor-test_executor.Tpo examples/.deps/test_executor-test_executor.Po
/bin/bash ../libtool --tag=CXX   --mode=link g++ -pthread -g -g2 -O2   -o test-executor examples/test_executor-test_executor.o libmesos.la -lrt
libtool: link: g++ -pthread -g -g2 -O2 -o .libs/test-executor examples/test_executor-test_executor.o  ./.libs/libmesos.so -lrt -pthread
g++ -DPACKAGE_NAME=\"mesos\" -DPACKAGE_TARNAME=\"mesos\" -DPACKAGE_VERSION=\"0.15.0\" -DPACKAGE_STRING=\"mesos\ 0.15.0\" -DPACKAGE_BUGREPORT=\"\" -DPACKAGE_URL=\"\" -DPACKAGE=\"mesos\" -DVERSION=\"0.15.0\" -DSTDC_HEADERS=1 -DHAVE_SYS_TYPES_H=1 -DHAVE_SYS_STAT_H=1 -DHAVE_STDLIB_H=1 -DHAVE_STRING_H=1 -DHAVE_MEMORY_H=1 -DHAVE_STRINGS_H=1 -DHAVE_INTTYPES_H=1 -DHAVE_STDINT_H=1 -DHAVE_UNISTD_H=1 -DHAVE_DLFCN_H=1 -DLT_OBJDIR=\".libs/\" -DHAVE_PTHREAD=1 -DMESOS_HAS_JAVA=1 -DHAVE_PYTHON=\"2.7\" -DMESOS_HAS_PYTHON=1 -I. -I../../src   -Wall -Werror -DLIBDIR=\"/usr/local/lib\" -DPKGLIBEXECDIR=\"/usr/local/libexec/mesos\" -DPKGDATADIR=\"/usr/local/share/mesos\" -I../../include -I../../3rdparty/libprocess/include -I../../3rdparty/libprocess/3rdparty/stout/include -I../include -I../3rdparty/libprocess/3rdparty/boost-1.53.0 -I../3rdparty/libprocess/3rdparty/protobuf-2.4.1/src -I../3rdparty/libprocess/3rdparty/glog-0.3.3/src -I../3rdparty/zookeeper-3.3.6/src/c/include -I../3rdparty/zookeeper-3.3.6/src/c/generated  -pthread -g -g2 -O2 -MT examples/long_lived_framework-long_lived_framework.o -MD -MP -MF examples/.deps/long_lived_framework-long_lived_framework.Tpo -c -o examples/long_lived_framework-long_lived_framework.o `test -f 'examples/long_lived_framework.cpp' || echo '../../src/'`examples/long_lived_framework.cpp
mv -f examples/.deps/long_lived_framework-long_lived_framework.Tpo examples/.deps/long_lived_framework-long_lived_framework.Po
/bin/bash ../libtool --tag=CXX   --mode=link g++ -pthread -g -g2 -O2   -o long-lived-framework examples/long_lived_framework-long_lived_framework.o libmesos.la -lrt
libtool: link: g++ -pthread -g -g2 -O2 -o .libs/long-lived-framework examples/long_lived_framework-long_lived_framework.o  ./.libs/libmesos.so -lrt -pthread
g++ -DPACKAGE_NAME=\"mesos\" -DPACKAGE_TARNAME=\"mesos\" -DPACKAGE_VERSION=\"0.15.0\" -DPACKAGE_STRING=\"mesos\ 0.15.0\" -DPACKAGE_BUGREPORT=\"\" -DPACKAGE_URL=\"\" -DPACKAGE=\"mesos\" -DVERSION=\"0.15.0\" -DSTDC_HEADERS=1 -DHAVE_SYS_TYPES_H=1 -DHAVE_SYS_STAT_H=1 -DHAVE_STDLIB_H=1 -DHAVE_STRING_H=1 -DHAVE_MEMORY_H=1 -DHAVE_STRINGS_H=1 -DHAVE_INTTYPES_H=1 -DHAVE_STDINT_H=1 -DHAVE_UNISTD_H=1 -DHAVE_DLFCN_H=1 -DLT_OBJDIR=\".libs/\" -DHAVE_PTHREAD=1 -DMESOS_HAS_JAVA=1 -DHAVE_PYTHON=\"2.7\" -DMESOS_HAS_PYTHON=1 -I. -I../../src   -Wall -Werror -DLIBDIR=\"/usr/local/lib\" -DPKGLIBEXECDIR=\"/usr/local/libexec/mesos\" -DPKGDATADIR=\"/usr/local/share/mesos\" -I../../include -I../../3rdparty/libprocess/include -I../../3rdparty/libprocess/3rdparty/stout/include -I../include -I../3rdparty/libprocess/3rdparty/boost-1.53.0 -I../3rdparty/libprocess/3rdparty/protobuf-2.4.1/src -I../3rdparty/libprocess/3rdparty/glog-0.3.3/src -I../3rdparty/zookeeper-3.3.6/src/c/include -I../3rdparty/zookeeper-3.3.6/src/c/generated  -pthread -g -g2 -O2 -MT examples/long_lived_executor-long_lived_executor.o -MD -MP -MF examples/.deps/long_lived_executor-long_lived_executor.Tpo -c -o examples/long_lived_executor-long_lived_executor.o `test -f 'examples/long_lived_executor.cpp' || echo '../../src/'`examples/long_lived_executor.cpp
mv -f examples/.deps/long_lived_executor-long_lived_executor.Tpo examples/.deps/long_lived_executor-long_lived_executor.Po
/bin/bash ../libtool --tag=CXX   --mode=link g++ -pthread -g -g2 -O2   -o long-lived-executor examples/long_lived_executor-long_lived_executor.o libmesos.la -lrt
libtool: link: g++ -pthread -g -g2 -O2 -o .libs/long-lived-executor examples/long_lived_executor-long_lived_executor.o  ./.libs/libmesos.so -lrt -pthread
g++ -DPACKAGE_NAME=\"mesos\" -DPACKAGE_TARNAME=\"mesos\" -DPACKAGE_VERSION=\"0.15.0\" -DPACKAGE_STRING=\"mesos\ 0.15.0\" -DPACKAGE_BUGREPORT=\"\" -DPACKAGE_URL=\"\" -DPACKAGE=\"mesos\" -DVERSION=\"0.15.0\" -DSTDC_HEADERS=1 -DHAVE_SYS_TYPES_H=1 -DHAVE_SYS_STAT_H=1 -DHAVE_STDLIB_H=1 -DHAVE_STRING_H=1 -DHAVE_MEMORY_H=1 -DHAVE_STRINGS_H=1 -DHAVE_INTTYPES_H=1 -DHAVE_STDINT_H=1 -DHAVE_UNISTD_H=1 -DHAVE_DLFCN_H=1 -DLT_OBJDIR=\".libs/\" -DHAVE_PTHREAD=1 -DMESOS_HAS_JAVA=1 -DHAVE_PYTHON=\"2.7\" -DMESOS_HAS_PYTHON=1 -I. -I../../src   -Wall -Werror -DLIBDIR=\"/usr/local/lib\" -DPKGLIBEXECDIR=\"/usr/local/libexec/mesos\" -DPKGDATADIR=\"/usr/local/share/mesos\" -I../../include -I../../3rdparty/libprocess/include -I../../3rdparty/libprocess/3rdparty/stout/include -I../include -I../3rdparty/libprocess/3rdparty/boost-1.53.0 -I../3rdparty/libprocess/3rdparty/protobuf-2.4.1/src -I../3rdparty/libprocess/3rdparty/glog-0.3.3/src -I../3rdparty/zookeeper-3.3.6/src/c/include -I../3rdparty/zookeeper-3.3.6/src/c/generated  -pthread -g -g2 -O2 -MT examples/no_executor_framework-no_executor_framework.o -MD -MP -MF examples/.deps/no_executor_framework-no_executor_framework.Tpo -c -o examples/no_executor_framework-no_executor_framework.o `test -f 'examples/no_executor_framework.cpp' || echo '../../src/'`examples/no_executor_framework.cpp
mv -f examples/.deps/no_executor_framework-no_executor_framework.Tpo examples/.deps/no_executor_framework-no_executor_framework.Po
/bin/bash ../libtool --tag=CXX   --mode=link g++ -pthread -g -g2 -O2   -o no-executor-framework examples/no_executor_framework-no_executor_framework.o libmesos.la -lrt
libtool: link: g++ -pthread -g -g2 -O2 -o .libs/no-executor-framework examples/no_executor_framework-no_executor_framework.o  ./.libs/libmesos.so -lrt -pthread
g++ -DPACKAGE_NAME=\"mesos\" -DPACKAGE_TARNAME=\"mesos\" -DPACKAGE_VERSION=\"0.15.0\" -DPACKAGE_STRING=\"mesos\ 0.15.0\" -DPACKAGE_BUGREPORT=\"\" -DPACKAGE_URL=\"\" -DPACKAGE=\"mesos\" -DVERSION=\"0.15.0\" -DSTDC_HEADERS=1 -DHAVE_SYS_TYPES_H=1 -DHAVE_SYS_STAT_H=1 -DHAVE_STDLIB_H=1 -DHAVE_STRING_H=1 -DHAVE_MEMORY_H=1 -DHAVE_STRINGS_H=1 -DHAVE_INTTYPES_H=1 -DHAVE_STDINT_H=1 -DHAVE_UNISTD_H=1 -DHAVE_DLFCN_H=1 -DLT_OBJDIR=\".libs/\" -DHAVE_PTHREAD=1 -DMESOS_HAS_JAVA=1 -DHAVE_PYTHON=\"2.7\" -DMESOS_HAS_PYTHON=1 -I. -I../../src   -Wall -Werror -DLIBDIR=\"/usr/local/lib\" -DPKGLIBEXECDIR=\"/usr/local/libexec/mesos\" -DPKGDATADIR=\"/usr/local/share/mesos\" -I../../include -I../../3rdparty/libprocess/include -I../../3rdparty/libprocess/3rdparty/stout/include -I../include -I../3rdparty/libprocess/3rdparty/boost-1.53.0 -I../3rdparty/libprocess/3rdparty/protobuf-2.4.1/src -I../3rdparty/libprocess/3rdparty/glog-0.3.3/src -I../3rdparty/zookeeper-3.3.6/src/c/include -I../3rdparty/zookeeper-3.3.6/src/c/generated  -pthread -g -g2 -O2 -MT examples/balloon_framework-balloon_framework.o -MD -MP -MF examples/.deps/balloon_framework-balloon_framework.Tpo -c -o examples/balloon_framework-balloon_framework.o `test -f 'examples/balloon_framework.cpp' || echo '../../src/'`examples/balloon_framework.cpp
mv -f examples/.deps/balloon_framework-balloon_framework.Tpo examples/.deps/balloon_framework-balloon_framework.Po
/bin/bash ../libtool --tag=CXX   --mode=link g++ -pthread -g -g2 -O2   -o balloon-framework examples/balloon_framework-balloon_framework.o libmesos.la -lrt
libtool: link: g++ -pthread -g -g2 -O2 -o .libs/balloon-framework examples/balloon_framework-balloon_framework.o  ./.libs/libmesos.so -lrt -pthread
g++ -DPACKAGE_NAME=\"mesos\" -DPACKAGE_TARNAME=\"mesos\" -DPACKAGE_VERSION=\"0.15.0\" -DPACKAGE_STRING=\"mesos\ 0.15.0\" -DPACKAGE_BUGREPORT=\"\" -DPACKAGE_URL=\"\" -DPACKAGE=\"mesos\" -DVERSION=\"0.15.0\" -DSTDC_HEADERS=1 -DHAVE_SYS_TYPES_H=1 -DHAVE_SYS_STAT_H=1 -DHAVE_STDLIB_H=1 -DHAVE_STRING_H=1 -DHAVE_MEMORY_H=1 -DHAVE_STRINGS_H=1 -DHAVE_INTTYPES_H=1 -DHAVE_STDINT_H=1 -DHAVE_UNISTD_H=1 -DHAVE_DLFCN_H=1 -DLT_OBJDIR=\".libs/\" -DHAVE_PTHREAD=1 -DMESOS_HAS_JAVA=1 -DHAVE_PYTHON=\"2.7\" -DMESOS_HAS_PYTHON=1 -I. -I../../src   -Wall -Werror -DLIBDIR=\"/usr/local/lib\" -DPKGLIBEXECDIR=\"/usr/local/libexec/mesos\" -DPKGDATADIR=\"/usr/local/share/mesos\" -I../../include -I../../3rdparty/libprocess/include -I../../3rdparty/libprocess/3rdparty/stout/include -I../include -I../3rdparty/libprocess/3rdparty/boost-1.53.0 -I../3rdparty/libprocess/3rdparty/protobuf-2.4.1/src -I../3rdparty/libprocess/3rdparty/glog-0.3.3/src -I../3rdparty/zookeeper-3.3.6/src/c/include -I../3rdparty/zookeeper-3.3.6/src/c/generated  -pthread -g -g2 -O2 -MT examples/balloon_executor-balloon_executor.o -MD -MP -MF examples/.deps/balloon_executor-balloon_executor.Tpo -c -o examples/balloon_executor-balloon_executor.o `test -f 'examples/balloon_executor.cpp' || echo '../../src/'`examples/balloon_executor.cpp
mv -f examples/.deps/balloon_executor-balloon_executor.Tpo examples/.deps/balloon_executor-balloon_executor.Po
/bin/bash ../libtool --tag=CXX   --mode=link g++ -pthread -g -g2 -O2   -o balloon-executor examples/balloon_executor-balloon_executor.o libmesos.la -lrt
libtool: link: g++ -pthread -g -g2 -O2 -o .libs/balloon-executor examples/balloon_executor-balloon_executor.o  ./.libs/libmesos.so -lrt -pthread
g++ -DPACKAGE_NAME=\"mesos\" -DPACKAGE_TARNAME=\"mesos\" -DPACKAGE_VERSION=\"0.15.0\" -DPACKAGE_STRING=\"mesos\ 0.15.0\" -DPACKAGE_BUGREPORT=\"\" -DPACKAGE_URL=\"\" -DPACKAGE=\"mesos\" -DVERSION=\"0.15.0\" -DSTDC_HEADERS=1 -DHAVE_SYS_TYPES_H=1 -DHAVE_SYS_STAT_H=1 -DHAVE_STDLIB_H=1 -DHAVE_STRING_H=1 -DHAVE_MEMORY_H=1 -DHAVE_STRINGS_H=1 -DHAVE_INTTYPES_H=1 -DHAVE_STDINT_H=1 -DHAVE_UNISTD_H=1 -DHAVE_DLFCN_H=1 -DLT_OBJDIR=\".libs/\" -DHAVE_PTHREAD=1 -DMESOS_HAS_JAVA=1 -DHAVE_PYTHON=\"2.7\" -DMESOS_HAS_PYTHON=1 -I. -I../../src   -Wall -Werror -DLIBDIR=\"/usr/local/lib\" -DPKGLIBEXECDIR=\"/usr/local/libexec/mesos\" -DPKGDATADIR=\"/usr/local/share/mesos\" -I../../include -I../../3rdparty/libprocess/include -I../../3rdparty/libprocess/3rdparty/stout/include -I../include -I../3rdparty/libprocess/3rdparty/boost-1.53.0 -I../3rdparty/libprocess/3rdparty/protobuf-2.4.1/src -I../3rdparty/libprocess/3rdparty/glog-0.3.3/src -I../3rdparty/zookeeper-3.3.6/src/c/include -I../3rdparty/zookeeper-3.3.6/src/c/generated -DSOURCE_DIR=\"/x1/jenkins/jenkins-slave/workspace/Mesos-Trunk-Ubuntu-Build-Out-Of-Src-Set-JAVA_HOME/build/..\" -DBUILD_DIR=\"/x1/jenkins/jenkins-slave/workspace/Mesos-Trunk-Ubuntu-Build-Out-Of-Src-Set-JAVA_HOME/build\" -I../3rdparty/libprocess/3rdparty/gmock-1.6.0/gtest/include -I../3rdparty/libprocess/3rdparty/gmock-1.6.0/include -I/home/jenkins/tools/java/jdk1.6.0_20-64/include -I/home/jenkins/tools/java/jdk1.6.0_20-64/include/linux -DZOOKEEPER_VERSION=\"3.3.6\"  -pthread -g -g2 -O2 -MT tests/mesos_tests-main.o -MD -MP -MF tests/.deps/mesos_tests-main.Tpo -c -o tests/mesos_tests-main.o `test -f 'tests/main.cpp' || echo '../../src/'`tests/main.cpp
mv -f tests/.deps/mesos_tests-main.Tpo tests/.deps/mesos_tests-main.Po
g++ -DPACKAGE_NAME=\"mesos\" -DPACKAGE_TARNAME=\"mesos\" -DPACKAGE_VERSION=\"0.15.0\" -DPACKAGE_STRING=\"mesos\ 0.15.0\" -DPACKAGE_BUGREPORT=\"\" -DPACKAGE_URL=\"\" -DPACKAGE=\"mesos\" -DVERSION=\"0.15.0\" -DSTDC_HEADERS=1 -DHAVE_SYS_TYPES_H=1 -DHAVE_SYS_STAT_H=1 -DHAVE_STDLIB_H=1 -DHAVE_STRING_H=1 -DHAVE_MEMORY_H=1 -DHAVE_STRINGS_H=1 -DHAVE_INTTYPES_H=1 -DHAVE_STDINT_H=1 -DHAVE_UNISTD_H=1 -DHAVE_DLFCN_H=1 -DLT_OBJDIR=\".libs/\" -DHAVE_PTHREAD=1 -DMESOS_HAS_JAVA=1 -DHAVE_PYTHON=\"2.7\" -DMESOS_HAS_PYTHON=1 -I. -I../../src   -Wall -Werror -DLIBDIR=\"/usr/local/lib\" -DPKGLIBEXECDIR=\"/usr/local/libexec/mesos\" -DPKGDATADIR=\"/usr/local/share/mesos\" -I../../include -I../../3rdparty/libprocess/include -I../../3rdparty/libprocess/3rdparty/stout/include -I../include -I../3rdparty/libprocess/3rdparty/boost-1.53.0 -I../3rdparty/libprocess/3rdparty/protobuf-2.4.1/src -I../3rdparty/libprocess/3rdparty/glog-0.3.3/src -I../3rdparty/zookeeper-3.3.6/src/c/include -I../3rdparty/zookeeper-3.3.6/src/c/generated -DSOURCE_DIR=\"/x1/jenkins/jenkins-slave/workspace/Mesos-Trunk-Ubuntu-Build-Out-Of-Src-Set-JAVA_HOME/build/..\" -DBUILD_DIR=\"/x1/jenkins/jenkins-slave/workspace/Mesos-Trunk-Ubuntu-Build-Out-Of-Src-Set-JAVA_HOME/build\" -I../3rdparty/libprocess/3rdparty/gmock-1.6.0/gtest/include -I../3rdparty/libprocess/3rdparty/gmock-1.6.0/include -I/home/jenkins/tools/java/jdk1.6.0_20-64/include -I/home/jenkins/tools/java/jdk1.6.0_20-64/include/linux -DZOOKEEPER_VERSION=\"3.3.6\"  -pthread -g -g2 -O2 -MT tests/mesos_tests-utils.o -MD -MP -MF tests/.deps/mesos_tests-utils.Tpo -c -o tests/mesos_tests-utils.o `test -f 'tests/utils.cpp' || echo '../../src/'`tests/utils.cpp
mv -f tests/.deps/mesos_tests-utils.Tpo tests/.deps/mesos_tests-utils.Po
g++ -DPACKAGE_NAME=\"mesos\" -DPACKAGE_TARNAME=\"mesos\" -DPACKAGE_VERSION=\"0.15.0\" -DPACKAGE_STRING=\"mesos\ 0.15.0\" -DPACKAGE_BUGREPORT=\"\" -DPACKAGE_URL=\"\" -DPACKAGE=\"mesos\" -DVERSION=\"0.15.0\" -DSTDC_HEADERS=1 -DHAVE_SYS_TYPES_H=1 -DHAVE_SYS_STAT_H=1 -DHAVE_STDLIB_H=1 -DHAVE_STRING_H=1 -DHAVE_MEMORY_H=1 -DHAVE_STRINGS_H=1 -DHAVE_INTTYPES_H=1 -DHAVE_STDINT_H=1 -DHAVE_UNISTD_H=1 -DHAVE_DLFCN_H=1 -DLT_OBJDIR=\".libs/\" -DHAVE_PTHREAD=1 -DMESOS_HAS_JAVA=1 -DHAVE_PYTHON=\"2.7\" -DMESOS_HAS_PYTHON=1 -I. -I../../src   -Wall -Werror -DLIBDIR=\"/usr/local/lib\" -DPKGLIBEXECDIR=\"/usr/local/libexec/mesos\" -DPKGDATADIR=\"/usr/local/share/mesos\" -I../../include -I../../3rdparty/libprocess/include -I../../3rdparty/libprocess/3rdparty/stout/include -I../include -I../3rdparty/libprocess/3rdparty/boost-1.53.0 -I../3rdparty/libprocess/3rdparty/protobuf-2.4.1/src -I../3rdparty/libprocess/3rdparty/glog-0.3.3/src -I../3rdparty/zookeeper-3.3.6/src/c/include -I../3rdparty/zookeeper-3.3.6/src/c/generated -DSOURCE_DIR=\"/x1/jenkins/jenkins-slave/workspace/Mesos-Trunk-Ubuntu-Build-Out-Of-Src-Set-JAVA_HOME/build/..\" -DBUILD_DIR=\"/x1/jenkins/jenkins-slave/workspace/Mesos-Trunk-Ubuntu-Build-Out-Of-Src-Set-JAVA_HOME/build\" -I../3rdparty/libprocess/3rdparty/gmock-1.6.0/gtest/include -I../3rdparty/libprocess/3rdparty/gmock-1.6.0/include -I/home/jenkins/tools/java/jdk1.6.0_20-64/include -I/home/jenkins/tools/java/jdk1.6.0_20-64/include/linux -DZOOKEEPER_VERSION=\"3.3.6\"  -pthread -g -g2 -O2 -MT tests/mesos_tests-environment.o -MD -MP -MF tests/.deps/mesos_tests-environment.Tpo -c -o tests/mesos_tests-environment.o `test -f 'tests/environment.cpp' || echo '../../src/'`tests/environment.cpp
mv -f tests/.deps/mesos_tests-environment.Tpo tests/.deps/mesos_tests-environment.Po
g++ -DPACKAGE_NAME=\"mesos\" -DPACKAGE_TARNAME=\"mesos\" -DPACKAGE_VERSION=\"0.15.0\" -DPACKAGE_STRING=\"mesos\ 0.15.0\" -DPACKAGE_BUGREPORT=\"\" -DPACKAGE_URL=\"\" -DPACKAGE=\"mesos\" -DVERSION=\"0.15.0\" -DSTDC_HEADERS=1 -DHAVE_SYS_TYPES_H=1 -DHAVE_SYS_STAT_H=1 -DHAVE_STDLIB_H=1 -DHAVE_STRING_H=1 -DHAVE_MEMORY_H=1 -DHAVE_STRINGS_H=1 -DHAVE_INTTYPES_H=1 -DHAVE_STDINT_H=1 -DHAVE_UNISTD_H=1 -DHAVE_DLFCN_H=1 -DLT_OBJDIR=\".libs/\" -DHAVE_PTHREAD=1 -DMESOS_HAS_JAVA=1 -DHAVE_PYTHON=\"2.7\" -DMESOS_HAS_PYTHON=1 -I. -I../../src   -Wall -Werror -DLIBDIR=\"/usr/local/lib\" -DPKGLIBEXECDIR=\"/usr/local/libexec/mesos\" -DPKGDATADIR=\"/usr/local/share/mesos\" -I../../include -I../../3rdparty/libprocess/include -I../../3rdparty/libprocess/3rdparty/stout/include -I../include -I../3rdparty/libprocess/3rdparty/boost-1.53.0 -I../3rdparty/libprocess/3rdparty/protobuf-2.4.1/src -I../3rdparty/libprocess/3rdparty/glog-0.3.3/src -I../3rdparty/zookeeper-3.3.6/src/c/include -I../3rdparty/zookeeper-3.3.6/src/c/generated -DSOURCE_DIR=\"/x1/jenkins/jenkins-slave/workspace/Mesos-Trunk-Ubuntu-Build-Out-Of-Src-Set-JAVA_HOME/build/..\" -DBUILD_DIR=\"/x1/jenkins/jenkins-slave/workspace/Mesos-Trunk-Ubuntu-Build-Out-Of-Src-Set-JAVA_HOME/build\" -I../3rdparty/libprocess/3rdparty/gmock-1.6.0/gtest/include -I../3rdparty/libprocess/3rdparty/gmock-1.6.0/include -I/home/jenkins/tools/java/jdk1.6.0_20-64/include -I/home/jenkins/tools/java/jdk1.6.0_20-64/include/linux -DZOOKEEPER_VERSION=\"3.3.6\"  -pthread -g -g2 -O2 -MT tests/mesos_tests-flags.o -MD -MP -MF tests/.deps/mesos_tests-flags.Tpo -c -o tests/mesos_tests-flags.o `test -f 'tests/flags.cpp' || echo '../../src/'`tests/flags.cpp
mv -f tests/.deps/mesos_tests-flags.Tpo tests/.deps/mesos_tests-flags.Po
g++ -DPACKAGE_NAME=\"mesos\" -DPACKAGE_TARNAME=\"mesos\" -DPACKAGE_VERSION=\"0.15.0\" -DPACKAGE_STRING=\"mesos\ 0.15.0\" -DPACKAGE_BUGREPORT=\"\" -DPACKAGE_URL=\"\" -DPACKAGE=\"mesos\" -DVERSION=\"0.15.0\" -DSTDC_HEADERS=1 -DHAVE_SYS_TYPES_H=1 -DHAVE_SYS_STAT_H=1 -DHAVE_STDLIB_H=1 -DHAVE_STRING_H=1 -DHAVE_MEMORY_H=1 -DHAVE_STRINGS_H=1 -DHAVE_INTTYPES_H=1 -DHAVE_STDINT_H=1 -DHAVE_UNISTD_H=1 -DHAVE_DLFCN_H=1 -DLT_OBJDIR=\".libs/\" -DHAVE_PTHREAD=1 -DMESOS_HAS_JAVA=1 -DHAVE_PYTHON=\"2.7\" -DMESOS_HAS_PYTHON=1 -I. -I../../src   -Wall -Werror -DLIBDIR=\"/usr/local/lib\" -DPKGLIBEXECDIR=\"/usr/local/libexec/mesos\" -DPKGDATADIR=\"/usr/local/share/mesos\" -I../../include -I../../3rdparty/libprocess/include -I../../3rdparty/libprocess/3rdparty/stout/include -I../include -I../3rdparty/libprocess/3rdparty/boost-1.53.0 -I../3rdparty/libprocess/3rdparty/protobuf-2.4.1/src -I../3rdparty/libprocess/3rdparty/glog-0.3.3/src -I../3rdparty/zookeeper-3.3.6/src/c/include -I../3rdparty/zookeeper-3.3.6/src/c/generated -DSOURCE_DIR=\"/x1/jenkins/jenkins-slave/workspace/Mesos-Trunk-Ubuntu-Build-Out-Of-Src-Set-JAVA_HOME/build/..\" -DBUILD_DIR=\"/x1/jenkins/jenkins-slave/workspace/Mesos-Trunk-Ubuntu-Build-Out-Of-Src-Set-JAVA_HOME/build\" -I../3rdparty/libprocess/3rdparty/gmock-1.6.0/gtest/include -I../3rdparty/libprocess/3rdparty/gmock-1.6.0/include -I/home/jenkins/tools/java/jdk1.6.0_20-64/include -I/home/jenkins/tools/java/jdk1.6.0_20-64/include/linux -DZOOKEEPER_VERSION=\"3.3.6\"  -pthread -g -g2 -O2 -MT tests/mesos_tests-mesos.o -MD -MP -MF tests/.deps/mesos_tests-mesos.Tpo -c -o tests/mesos_tests-mesos.o `test -f 'tests/mesos.cpp' || echo '../../src/'`tests/mesos.cpp
mv -f tests/.deps/mesos_tests-mesos.Tpo tests/.deps/mesos_tests-mesos.Po
g++ -DPACKAGE_NAME=\"mesos\" -DPACKAGE_TARNAME=\"mesos\" -DPACKAGE_VERSION=\"0.15.0\" -DPACKAGE_STRING=\"mesos\ 0.15.0\" -DPACKAGE_BUGREPORT=\"\" -DPACKAGE_URL=\"\" -DPACKAGE=\"mesos\" -DVERSION=\"0.15.0\" -DSTDC_HEADERS=1 -DHAVE_SYS_TYPES_H=1 -DHAVE_SYS_STAT_H=1 -DHAVE_STDLIB_H=1 -DHAVE_STRING_H=1 -DHAVE_MEMORY_H=1 -DHAVE_STRINGS_H=1 -DHAVE_INTTYPES_H=1 -DHAVE_STDINT_H=1 -DHAVE_UNISTD_H=1 -DHAVE_DLFCN_H=1 -DLT_OBJDIR=\".libs/\" -DHAVE_PTHREAD=1 -DMESOS_HAS_JAVA=1 -DHAVE_PYTHON=\"2.7\" -DMESOS_HAS_PYTHON=1 -I. -I../../src   -Wall -Werror -DLIBDIR=\"/usr/local/lib\" -DPKGLIBEXECDIR=\"/usr/local/libexec/mesos\" -DPKGDATADIR=\"/usr/local/share/mesos\" -I../../include -I../../3rdparty/libprocess/include -I../../3rdparty/libprocess/3rdparty/stout/include -I../include -I../3rdparty/libprocess/3rdparty/boost-1.53.0 -I../3rdparty/libprocess/3rdparty/protobuf-2.4.1/src -I../3rdparty/libprocess/3rdparty/glog-0.3.3/src -I../3rdparty/zookeeper-3.3.6/src/c/include -I../3rdparty/zookeeper-3.3.6/src/c/generated -DSOURCE_DIR=\"/x1/jenkins/jenkins-slave/workspace/Mesos-Trunk-Ubuntu-Build-Out-Of-Src-Set-JAVA_HOME/build/..\" -DBUILD_DIR=\"/x1/jenkins/jenkins-slave/workspace/Mesos-Trunk-Ubuntu-Build-Out-Of-Src-Set-JAVA_HOME/build\" -I../3rdparty/libprocess/3rdparty/gmock-1.6.0/gtest/include -I../3rdparty/libprocess/3rdparty/gmock-1.6.0/include -I/home/jenkins/tools/java/jdk1.6.0_20-64/include -I/home/jenkins/tools/java/jdk1.6.0_20-64/include/linux -DZOOKEEPER_VERSION=\"3.3.6\"  -pthread -g -g2 -O2 -MT tests/mesos_tests-master_tests.o -MD -MP -MF tests/.deps/mesos_tests-master_tests.Tpo -c -o tests/mesos_tests-master_tests.o `test -f 'tests/master_tests.cpp' || echo '../../src/'`tests/master_tests.cpp
mv -f tests/.deps/mesos_tests-master_tests.Tpo tests/.deps/mesos_tests-master_tests.Po
g++ -DPACKAGE_NAME=\"mesos\" -DPACKAGE_TARNAME=\"mesos\" -DPACKAGE_VERSION=\"0.15.0\" -DPACKAGE_STRING=\"mesos\ 0.15.0\" -DPACKAGE_BUGREPORT=\"\" -DPACKAGE_URL=\"\" -DPACKAGE=\"mesos\" -DVERSION=\"0.15.0\" -DSTDC_HEADERS=1 -DHAVE_SYS_TYPES_H=1 -DHAVE_SYS_STAT_H=1 -DHAVE_STDLIB_H=1 -DHAVE_STRING_H=1 -DHAVE_MEMORY_H=1 -DHAVE_STRINGS_H=1 -DHAVE_INTTYPES_H=1 -DHAVE_STDINT_H=1 -DHAVE_UNISTD_H=1 -DHAVE_DLFCN_H=1 -DLT_OBJDIR=\".libs/\" -DHAVE_PTHREAD=1 -DMESOS_HAS_JAVA=1 -DHAVE_PYTHON=\"2.7\" -DMESOS_HAS_PYTHON=1 -I. -I../../src   -Wall -Werror -DLIBDIR=\"/usr/local/lib\" -DPKGLIBEXECDIR=\"/usr/local/libexec/mesos\" -DPKGDATADIR=\"/usr/local/share/mesos\" -I../../include -I../../3rdparty/libprocess/include -I../../3rdparty/libprocess/3rdparty/stout/include -I../include -I../3rdparty/libprocess/3rdparty/boost-1.53.0 -I../3rdparty/libprocess/3rdparty/protobuf-2.4.1/src -I../3rdparty/libprocess/3rdparty/glog-0.3.3/src -I../3rdparty/zookeeper-3.3.6/src/c/include -I../3rdparty/zookeeper-3.3.6/src/c/generated -DSOURCE_DIR=\"/x1/jenkins/jenkins-slave/workspace/Mesos-Trunk-Ubuntu-Build-Out-Of-Src-Set-JAVA_HOME/build/..\" -DBUILD_DIR=\"/x1/jenkins/jenkins-slave/workspace/Mesos-Trunk-Ubuntu-Build-Out-Of-Src-Set-JAVA_HOME/build\" -I../3rdparty/libprocess/3rdparty/gmock-1.6.0/gtest/include -I../3rdparty/libprocess/3rdparty/gmock-1.6.0/include -I/home/jenkins/tools/java/jdk1.6.0_20-64/include -I/home/jenkins/tools/java/jdk1.6.0_20-64/include/linux -DZOOKEEPER_VERSION=\"3.3.6\"  -pthread -g -g2 -O2 -MT tests/mesos_tests-state_tests.o -MD -MP -MF tests/.deps/mesos_tests-state_tests.Tpo -c -o tests/mesos_tests-state_tests.o `test -f 'tests/state_tests.cpp' || echo '../../src/'`tests/state_tests.cpp
mv -f tests/.deps/mesos_tests-state_tests.Tpo tests/.deps/mesos_tests-state_tests.Po
g++ -DPACKAGE_NAME=\"mesos\" -DPACKAGE_TARNAME=\"mesos\" -DPACKAGE_VERSION=\"0.15.0\" -DPACKAGE_STRING=\"mesos\ 0.15.0\" -DPACKAGE_BUGREPORT=\"\" -DPACKAGE_URL=\"\" -DPACKAGE=\"mesos\" -DVERSION=\"0.15.0\" -DSTDC_HEADERS=1 -DHAVE_SYS_TYPES_H=1 -DHAVE_SYS_STAT_H=1 -DHAVE_STDLIB_H=1 -DHAVE_STRING_H=1 -DHAVE_MEMORY_H=1 -DHAVE_STRINGS_H=1 -DHAVE_INTTYPES_H=1 -DHAVE_STDINT_H=1 -DHAVE_UNISTD_H=1 -DHAVE_DLFCN_H=1 -DLT_OBJDIR=\".libs/\" -DHAVE_PTHREAD=1 -DMESOS_HAS_JAVA=1 -DHAVE_PYTHON=\"2.7\" -DMESOS_HAS_PYTHON=1 -I. -I../../src   -Wall -Werror -DLIBDIR=\"/usr/local/lib\" -DPKGLIBEXECDIR=\"/usr/local/libexec/mesos\" -DPKGDATADIR=\"/usr/local/share/mesos\" -I../../include -I../../3rdparty/libprocess/include -I../../3rdparty/libprocess/3rdparty/stout/include -I../include -I../3rdparty/libprocess/3rdparty/boost-1.53.0 -I../3rdparty/libprocess/3rdparty/protobuf-2.4.1/src -I../3rdparty/libprocess/3rdparty/glog-0.3.3/src -I../3rdparty/zookeeper-3.3.6/src/c/include -I../3rdparty/zookeeper-3.3.6/src/c/generated -DSOURCE_DIR=\"/x1/jenkins/jenkins-slave/workspace/Mesos-Trunk-Ubuntu-Build-Out-Of-Src-Set-JAVA_HOME/build/..\" -DBUILD_DIR=\"/x1/jenkins/jenkins-slave/workspace/Mesos-Trunk-Ubuntu-Build-Out-Of-Src-Set-JAVA_HOME/build\" -I../3rdparty/libprocess/3rdparty/gmock-1.6.0/gtest/include -I../3rdparty/libprocess/3rdparty/gmock-1.6.0/include -I/home/jenkins/tools/java/jdk1.6.0_20-64/include -I/home/jenkins/tools/java/jdk1.6.0_20-64/include/linux -DZOOKEEPER_VERSION=\"3.3.6\"  -pthread -g -g2 -O2 -MT tests/mesos_tests-paths_tests.o -MD -MP -MF tests/.deps/mesos_tests-paths_tests.Tpo -c -o tests/mesos_tests-paths_tests.o `test -f 'tests/paths_tests.cpp' || echo '../../src/'`tests/paths_tests.cpp
mv -f tests/.deps/mesos_tests-paths_tests.Tpo tests/.deps/mesos_tests-paths_tests.Po
g++ -DPACKAGE_NAME=\"mesos\" -DPACKAGE_TARNAME=\"mesos\" -DPACKAGE_VERSION=\"0.15.0\" -DPACKAGE_STRING=\"mesos\ 0.15.0\" -DPACKAGE_BUGREPORT=\"\" -DPACKAGE_URL=\"\" -DPACKAGE=\"mesos\" -DVERSION=\"0.15.0\" -DSTDC_HEADERS=1 -DHAVE_SYS_TYPES_H=1 -DHAVE_SYS_STAT_H=1 -DHAVE_STDLIB_H=1 -DHAVE_STRING_H=1 -DHAVE_MEMORY_H=1 -DHAVE_STRINGS_H=1 -DHAVE_INTTYPES_H=1 -DHAVE_STDINT_H=1 -DHAVE_UNISTD_H=1 -DHAVE_DLFCN_H=1 -DLT_OBJDIR=\".libs/\" -DHAVE_PTHREAD=1 -DMESOS_HAS_JAVA=1 -DHAVE_PYTHON=\"2.7\" -DMESOS_HAS_PYTHON=1 -I. -I../../src   -Wall -Werror -DLIBDIR=\"/usr/local/lib\" -DPKGLIBEXECDIR=\"/usr/local/libexec/mesos\" -DPKGDATADIR=\"/usr/local/share/mesos\" -I../../include -I../../3rdparty/libprocess/include -I../../3rdparty/libprocess/3rdparty/stout/include -I../include -I../3rdparty/libprocess/3rdparty/boost-1.53.0 -I../3rdparty/libprocess/3rdparty/protobuf-2.4.1/src -I../3rdparty/libprocess/3rdparty/glog-0.3.3/src -I../3rdparty/zookeeper-3.3.6/src/c/include -I../3rdparty/zookeeper-3.3.6/src/c/generated -DSOURCE_DIR=\"/x1/jenkins/jenkins-slave/workspace/Mesos-Trunk-Ubuntu-Build-Out-Of-Src-Set-JAVA_HOME/build/..\" -DBUILD_DIR=\"/x1/jenkins/jenkins-slave/workspace/Mesos-Trunk-Ubuntu-Build-Out-Of-Src-Set-JAVA_HOME/build\" -I../3rdparty/libprocess/3rdparty/gmock-1.6.0/gtest/include -I../3rdparty/libprocess/3rdparty/gmock-1.6.0/include -I/home/jenkins/tools/java/jdk1.6.0_20-64/include -I/home/jenkins/tools/java/jdk1.6.0_20-64/include/linux -DZOOKEEPER_VERSION=\"3.3.6\"  -pthread -g -g2 -O2 -MT tests/mesos_tests-reaper_tests.o -MD -MP -MF tests/.deps/mesos_tests-reaper_tests.Tpo -c -o tests/mesos_tests-reaper_tests.o `test -f 'tests/reaper_tests.cpp' || echo '../../src/'`tests/reaper_tests.cpp
mv -f tests/.deps/mesos_tests-reaper_tests.Tpo tests/.deps/mesos_tests-reaper_tests.Po
g++ -DPACKAGE_NAME=\"mesos\" -DPACKAGE_TARNAME=\"mesos\" -DPACKAGE_VERSION=\"0.15.0\" -DPACKAGE_STRING=\"mesos\ 0.15.0\" -DPACKAGE_BUGREPORT=\"\" -DPACKAGE_URL=\"\" -DPACKAGE=\"mesos\" -DVERSION=\"0.15.0\" -DSTDC_HEADERS=1 -DHAVE_SYS_TYPES_H=1 -DHAVE_SYS_STAT_H=1 -DHAVE_STDLIB_H=1 -DHAVE_STRING_H=1 -DHAVE_MEMORY_H=1 -DHAVE_STRINGS_H=1 -DHAVE_INTTYPES_H=1 -DHAVE_STDINT_H=1 -DHAVE_UNISTD_H=1 -DHAVE_DLFCN_H=1 -DLT_OBJDIR=\".libs/\" -DHAVE_PTHREAD=1 -DMESOS_HAS_JAVA=1 -DHAVE_PYTHON=\"2.7\" -DMESOS_HAS_PYTHON=1 -I. -I../../src   -Wall -Werror -DLIBDIR=\"/usr/local/lib\" -DPKGLIBEXECDIR=\"/usr/local/libexec/mesos\" -DPKGDATADIR=\"/usr/local/share/mesos\" -I../../include -I../../3rdparty/libprocess/include -I../../3rdparty/libprocess/3rdparty/stout/include -I../include -I../3rdparty/libprocess/3rdparty/boost-1.53.0 -I../3rdparty/libprocess/3rdparty/protobuf-2.4.1/src -I../3rdparty/libprocess/3rdparty/glog-0.3.3/src -I../3rdparty/zookeeper-3.3.6/src/c/include -I../3rdparty/zookeeper-3.3.6/src/c/generated -DSOURCE_DIR=\"/x1/jenkins/jenkins-slave/workspace/Mesos-Trunk-Ubuntu-Build-Out-Of-Src-Set-JAVA_HOME/build/..\" -DBUILD_DIR=\"/x1/jenkins/jenkins-slave/workspace/Mesos-Trunk-Ubuntu-Build-Out-Of-Src-Set-JAVA_HOME/build\" -I../3rdparty/libprocess/3rdparty/gmock-1.6.0/gtest/include -I../3rdparty/libprocess/3rdparty/gmock-1.6.0/include -I/home/jenkins/tools/java/jdk1.6.0_20-64/include -I/home/jenkins/tools/java/jdk1.6.0_20-64/include/linux -DZOOKEEPER_VERSION=\"3.3.6\"  -pthread -g -g2 -O2 -MT tests/mesos_tests-slave_recovery_tests.o -MD -MP -MF tests/.deps/mesos_tests-slave_recovery_tests.Tpo -c -o tests/mesos_tests-slave_recovery_tests.o `test -f 'tests/slave_recovery_tests.cpp' || echo '../../src/'`tests/slave_recovery_tests.cpp
../../src/tests/slave_recovery_tests.cpp: In member function 'virtual void SlaveRecoveryTest_KillTask_Test<gtest_TypeParam_>::TestBody()':
../../src/tests/slave_recovery_tests.cpp:1289:26: error: redeclaration of 'process::Future<std::vector<mesos::Offer> > offers2'
../../src/tests/slave_recovery_tests.cpp:1265:26: error: 'process::Future<std::vector<mesos::Offer> > offers2' previously declared here
make[3]: *** [tests/mesos_tests-slave_recovery_tests.o] Error 1
make[3]: Leaving directory `/x1/jenkins/jenkins-slave/workspace/Mesos-Trunk-Ubuntu-Build-Out-Of-Src-Set-JAVA_HOME/build/src'
make[2]: *** [check-am] Error 2
make[2]: Leaving directory `/x1/jenkins/jenkins-slave/workspace/Mesos-Trunk-Ubuntu-Build-Out-Of-Src-Set-JAVA_HOME/build/src'
make[1]: *** [check] Error 2
make[1]: Leaving directory `/x1/jenkins/jenkins-slave/workspace/Mesos-Trunk-Ubuntu-Build-Out-Of-Src-Set-JAVA_HOME/build/src'
make: *** [check-recursive] Error 1
Build step 'Execute shell' marked build as failure

Mime
View raw message