mesos-dev mailing list archives

Site index · List index
Message view « Date » · « Thread »
Top « Date » · « Thread »
From Apache Jenkins Server <jenk...@builds.apache.org>
Subject Build failed in Jenkins: Mesos-Trunk-Ubuntu-Build-Out-Of-Src-Disable-Java-Disable-Python-Disable-Webui #246
Date Thu, 15 Nov 2012 01:20:26 GMT
See <https://builds.apache.org/job/Mesos-Trunk-Ubuntu-Build-Out-Of-Src-Disable-Java-Disable-Python-Disable-Webui/246/changes>

Changes:

[benh] Updated version to 0.12.0.

[benh] Added an EXIT function to stout.

From: Ben Mahler <benjamin.mahler@gmail.com>
Review: https://reviews.apache.org/r/7781

------------------------------------------
[...truncated 2887 lines...]
We cannot run any cgroups tests that require
a hierarchy with subsystems 'cpu'
because we failed to find an existing hierarchy
or create a new one. You can either remove all existing
hierarchies, or disable this test case
(i.e., --gtest_filter=-CgroupsAnyHierarchyTest.*).
-------------------------------------------------------------
../../src/tests/cgroups_tests.cpp:184: Failure
cgroups: No such file or directory
[  FAILED  ] CgroupsAnyHierarchyTest.ROOT_CGROUPS_GetCgroups (0 ms)
[ RUN      ] CgroupsAnyHierarchyTest.ROOT_CGROUPS_NestedCgroups
../../src/tests/cgroups_tests.cpp:151: Failure
cgroups::createHierarchy(HIERARCHY, subsystems): Failed to mount cpu at /tmp/mesos_cgroups_testing_hierarchy:
Operation not permitted
-------------------------------------------------------------
We cannot run any cgroups tests that require
a hierarchy with subsystems 'cpu'
because we failed to find an existing hierarchy
or create a new one. You can either remove all existing
hierarchies, or disable this test case
(i.e., --gtest_filter=-CgroupsAnyHierarchyTest.*).
-------------------------------------------------------------
../../src/tests/cgroups_tests.cpp:184: Failure
cgroups: No such file or directory
[  FAILED  ] CgroupsAnyHierarchyTest.ROOT_CGROUPS_NestedCgroups (0 ms)
[ RUN      ] CgroupsAnyHierarchyTest.ROOT_CGROUPS_ReadControl
../../src/tests/cgroups_tests.cpp:151: Failure
cgroups::createHierarchy(HIERARCHY, subsystems): Failed to mount cpu at /tmp/mesos_cgroups_testing_hierarchy:
Operation not permitted
-------------------------------------------------------------
We cannot run any cgroups tests that require
a hierarchy with subsystems 'cpu'
because we failed to find an existing hierarchy
or create a new one. You can either remove all existing
hierarchies, or disable this test case
(i.e., --gtest_filter=-CgroupsAnyHierarchyTest.*).
-------------------------------------------------------------
../../src/tests/cgroups_tests.cpp:184: Failure
cgroups: No such file or directory
[  FAILED  ] CgroupsAnyHierarchyTest.ROOT_CGROUPS_ReadControl (1 ms)
[ RUN      ] CgroupsAnyHierarchyTest.ROOT_CGROUPS_WriteControl
../../src/tests/cgroups_tests.cpp:151: Failure
cgroups::createHierarchy(HIERARCHY, subsystems): Failed to mount cpu at /tmp/mesos_cgroups_testing_hierarchy:
Operation not permitted
-------------------------------------------------------------
We cannot run any cgroups tests that require
a hierarchy with subsystems 'cpu'
because we failed to find an existing hierarchy
or create a new one. You can either remove all existing
hierarchies, or disable this test case
(i.e., --gtest_filter=-CgroupsAnyHierarchyTest.*).
-------------------------------------------------------------
../../src/tests/cgroups_tests.cpp:184: Failure
cgroups: No such file or directory
[  FAILED  ] CgroupsAnyHierarchyTest.ROOT_CGROUPS_WriteControl (0 ms)
[ RUN      ] CgroupsAnyHierarchyTest.ROOT_CGROUPS_GetTasks
../../src/tests/cgroups_tests.cpp:151: Failure
cgroups::createHierarchy(HIERARCHY, subsystems): Failed to mount cpu at /tmp/mesos_cgroups_testing_hierarchy:
Operation not permitted
-------------------------------------------------------------
We cannot run any cgroups tests that require
a hierarchy with subsystems 'cpu'
because we failed to find an existing hierarchy
or create a new one. You can either remove all existing
hierarchies, or disable this test case
(i.e., --gtest_filter=-CgroupsAnyHierarchyTest.*).
-------------------------------------------------------------
../../src/tests/cgroups_tests.cpp:184: Failure
cgroups: No such file or directory
[  FAILED  ] CgroupsAnyHierarchyTest.ROOT_CGROUPS_GetTasks (1 ms)
[----------] 8 tests from CgroupsAnyHierarchyTest (26 ms total)

[----------] 5 tests from CgroupsAnyHierarchyWithCpuMemoryTest
[ RUN      ] CgroupsAnyHierarchyWithCpuMemoryTest.ROOT_CGROUPS_Busy
../../src/tests/cgroups_tests.cpp:151: Failure
cgroups::createHierarchy(HIERARCHY, subsystems): Failed to mount cpu,memory at /tmp/mesos_cgroups_testing_hierarchy:
Operation not permitted
-------------------------------------------------------------
We cannot run any cgroups tests that require
a hierarchy with subsystems 'cpu,memory'
because we failed to find an existing hierarchy
or create a new one. You can either remove all existing
hierarchies, or disable this test case
(i.e., --gtest_filter=-CgroupsAnyHierarchyWithCpuMemoryTest.*).
-------------------------------------------------------------
../../src/tests/cgroups_tests.cpp:184: Failure
cgroups: No such file or directory
[  FAILED  ] CgroupsAnyHierarchyWithCpuMemoryTest.ROOT_CGROUPS_Busy (0 ms)
[ RUN      ] CgroupsAnyHierarchyWithCpuMemoryTest.ROOT_CGROUPS_SubsystemsHierarchy
../../src/tests/cgroups_tests.cpp:151: Failure
cgroups::createHierarchy(HIERARCHY, subsystems): Failed to mount cpu,memory at /tmp/mesos_cgroups_testing_hierarchy:
Operation not permitted
-------------------------------------------------------------
We cannot run any cgroups tests that require
a hierarchy with subsystems 'cpu,memory'
because we failed to find an existing hierarchy
or create a new one. You can either remove all existing
hierarchies, or disable this test case
(i.e., --gtest_filter=-CgroupsAnyHierarchyWithCpuMemoryTest.*).
-------------------------------------------------------------
../../src/tests/cgroups_tests.cpp:184: Failure
cgroups: No such file or directory
[  FAILED  ] CgroupsAnyHierarchyWithCpuMemoryTest.ROOT_CGROUPS_SubsystemsHierarchy (0 ms)
[ RUN      ] CgroupsAnyHierarchyWithCpuMemoryTest.ROOT_CGROUPS_CheckHierarchySubsystems
../../src/tests/cgroups_tests.cpp:151: Failure
cgroups::createHierarchy(HIERARCHY, subsystems): Failed to mount cpu,memory at /tmp/mesos_cgroups_testing_hierarchy:
Operation not permitted
-------------------------------------------------------------
We cannot run any cgroups tests that require
a hierarchy with subsystems 'cpu,memory'
because we failed to find an existing hierarchy
or create a new one. You can either remove all existing
hierarchies, or disable this test case
(i.e., --gtest_filter=-CgroupsAnyHierarchyWithCpuMemoryTest.*).
-------------------------------------------------------------
../../src/tests/cgroups_tests.cpp:184: Failure
cgroups: No such file or directory
[  FAILED  ] CgroupsAnyHierarchyWithCpuMemoryTest.ROOT_CGROUPS_CheckHierarchySubsystems (1
ms)
[ RUN      ] CgroupsAnyHierarchyWithCpuMemoryTest.ROOT_CGROUPS_CreateRemoveCgroup
../../src/tests/cgroups_tests.cpp:151: Failure
cgroups::createHierarchy(HIERARCHY, subsystems): Failed to mount cpu,memory at /tmp/mesos_cgroups_testing_hierarchy:
Operation not permitted
-------------------------------------------------------------
We cannot run any cgroups tests that require
a hierarchy with subsystems 'cpu,memory'
because we failed to find an existing hierarchy
or create a new one. You can either remove all existing
hierarchies, or disable this test case
(i.e., --gtest_filter=-CgroupsAnyHierarchyWithCpuMemoryTest.*).
-------------------------------------------------------------
../../src/tests/cgroups_tests.cpp:184: Failure
cgroups: No such file or directory
[  FAILED  ] CgroupsAnyHierarchyWithCpuMemoryTest.ROOT_CGROUPS_CreateRemoveCgroup (0 ms)
[ RUN      ] CgroupsAnyHierarchyWithCpuMemoryTest.ROOT_CGROUPS_ListenEvent
../../src/tests/cgroups_tests.cpp:151: Failure
cgroups::createHierarchy(HIERARCHY, subsystems): Failed to mount cpu,memory at /tmp/mesos_cgroups_testing_hierarchy:
Operation not permitted
-------------------------------------------------------------
We cannot run any cgroups tests that require
a hierarchy with subsystems 'cpu,memory'
because we failed to find an existing hierarchy
or create a new one. You can either remove all existing
hierarchies, or disable this test case
(i.e., --gtest_filter=-CgroupsAnyHierarchyWithCpuMemoryTest.*).
-------------------------------------------------------------
../../src/tests/cgroups_tests.cpp:184: Failure
cgroups: No such file or directory
[  FAILED  ] CgroupsAnyHierarchyWithCpuMemoryTest.ROOT_CGROUPS_ListenEvent (0 ms)
[----------] 5 tests from CgroupsAnyHierarchyWithCpuMemoryTest (1 ms total)

[----------] 1 test from CgroupsNoHierarchyTest
[ RUN      ] CgroupsNoHierarchyTest.ROOT_CGROUPS_CreateRemoveHierarchy
../../src/tests/cgroups_tests.cpp:288: Failure
cgroups::createHierarchy(HIERARCHY, "cpu,memory"): Failed to mount cpu,memory at /tmp/mesos_cgroups_testing_hierarchy:
Operation not permitted
[  FAILED  ] CgroupsNoHierarchyTest.ROOT_CGROUPS_CreateRemoveHierarchy (0 ms)
[----------] 1 test from CgroupsNoHierarchyTest (0 ms total)

[----------] 3 tests from CgroupsAnyHierarchyWithCpuMemoryFreezerTest
[ RUN      ] CgroupsAnyHierarchyWithCpuMemoryFreezerTest.ROOT_CGROUPS_Freezer
../../src/tests/cgroups_tests.cpp:151: Failure
cgroups::createHierarchy(HIERARCHY, subsystems): Failed to mount cpu,memory,freezer at /tmp/mesos_cgroups_testing_hierarchy:
Operation not permitted
-------------------------------------------------------------
We cannot run any cgroups tests that require
a hierarchy with subsystems 'cpu,memory,freezer'
because we failed to find an existing hierarchy
or create a new one. You can either remove all existing
hierarchies, or disable this test case
(i.e., --gtest_filter=-CgroupsAnyHierarchyWithCpuMemoryFreezerTest.*).
-------------------------------------------------------------
../../src/tests/cgroups_tests.cpp:184: Failure
cgroups: No such file or directory
[  FAILED  ] CgroupsAnyHierarchyWithCpuMemoryFreezerTest.ROOT_CGROUPS_Freezer (0 ms)
[ RUN      ] CgroupsAnyHierarchyWithCpuMemoryFreezerTest.ROOT_CGROUPS_KillTasks
../../src/tests/cgroups_tests.cpp:151: Failure
cgroups::createHierarchy(HIERARCHY, subsystems): Failed to mount cpu,memory,freezer at /tmp/mesos_cgroups_testing_hierarchy:
Operation not permitted
-------------------------------------------------------------
We cannot run any cgroups tests that require
a hierarchy with subsystems 'cpu,memory,freezer'
because we failed to find an existing hierarchy
or create a new one. You can either remove all existing
hierarchies, or disable this test case
(i.e., --gtest_filter=-CgroupsAnyHierarchyWithCpuMemoryFreezerTest.*).
-------------------------------------------------------------
../../src/tests/cgroups_tests.cpp:184: Failure
cgroups: No such file or directory
[  FAILED  ] CgroupsAnyHierarchyWithCpuMemoryFreezerTest.ROOT_CGROUPS_KillTasks (1 ms)
[ RUN      ] CgroupsAnyHierarchyWithCpuMemoryFreezerTest.ROOT_CGROUPS_DestroyCgroup
../../src/tests/cgroups_tests.cpp:151: Failure
cgroups::createHierarchy(HIERARCHY, subsystems): Failed to mount cpu,memory,freezer at /tmp/mesos_cgroups_testing_hierarchy:
Operation not permitted
-------------------------------------------------------------
We cannot run any cgroups tests that require
a hierarchy with subsystems 'cpu,memory,freezer'
because we failed to find an existing hierarchy
or create a new one. You can either remove all existing
hierarchies, or disable this test case
(i.e., --gtest_filter=-CgroupsAnyHierarchyWithCpuMemoryFreezerTest.*).
-------------------------------------------------------------
../../src/tests/cgroups_tests.cpp:184: Failure
cgroups: No such file or directory
[  FAILED  ] CgroupsAnyHierarchyWithCpuMemoryFreezerTest.ROOT_CGROUPS_DestroyCgroup (0 ms)
[----------] 3 tests from CgroupsAnyHierarchyWithCpuMemoryFreezerTest (1 ms total)

[----------] 3 tests from FsTest
[ RUN      ] FsTest.MountTableRead
[       OK ] FsTest.MountTableRead (0 ms)
[ RUN      ] FsTest.MountTableHasOption
[       OK ] FsTest.MountTableHasOption (0 ms)
[ RUN      ] FsTest.FileSystemTableRead
[       OK ] FsTest.FileSystemTableRead (21 ms)
[----------] 3 tests from FsTest (21 ms total)

[----------] 3 tests from ProcTest
[ RUN      ] ProcTest.Pids
[       OK ] ProcTest.Pids (1 ms)
[ RUN      ] ProcTest.SystemStatistics
[       OK ] ProcTest.SystemStatistics (0 ms)
[ RUN      ] ProcTest.ProcessStatistics
[       OK ] ProcTest.ProcessStatistics (1 ms)
[----------] 3 tests from ProcTest (2 ms total)

[----------] Global test environment tear-down
[==========] 204 tests from 40 test cases ran. (64520 ms total)
[  PASSED  ] 186 tests.
[  FAILED  ] 18 tests, listed below:
[  FAILED  ] CgroupsIsolationTest.ROOT_CGROUPS_BalloonFramework
[  FAILED  ] CgroupsAnyHierarchyTest.ROOT_CGROUPS_Enabled
[  FAILED  ] CgroupsAnyHierarchyTest.ROOT_CGROUPS_Subsystems
[  FAILED  ] CgroupsAnyHierarchyTest.ROOT_CGROUPS_CheckHierarchy
[  FAILED  ] CgroupsAnyHierarchyTest.ROOT_CGROUPS_GetCgroups
[  FAILED  ] CgroupsAnyHierarchyTest.ROOT_CGROUPS_NestedCgroups
[  FAILED  ] CgroupsAnyHierarchyTest.ROOT_CGROUPS_ReadControl
[  FAILED  ] CgroupsAnyHierarchyTest.ROOT_CGROUPS_WriteControl
[  FAILED  ] CgroupsAnyHierarchyTest.ROOT_CGROUPS_GetTasks
[  FAILED  ] CgroupsAnyHierarchyWithCpuMemoryTest.ROOT_CGROUPS_Busy
[  FAILED  ] CgroupsAnyHierarchyWithCpuMemoryTest.ROOT_CGROUPS_SubsystemsHierarchy
[  FAILED  ] CgroupsAnyHierarchyWithCpuMemoryTest.ROOT_CGROUPS_CheckHierarchySubsystems
[  FAILED  ] CgroupsAnyHierarchyWithCpuMemoryTest.ROOT_CGROUPS_CreateRemoveCgroup
[  FAILED  ] CgroupsAnyHierarchyWithCpuMemoryTest.ROOT_CGROUPS_ListenEvent
[  FAILED  ] CgroupsNoHierarchyTest.ROOT_CGROUPS_CreateRemoveHierarchy
[  FAILED  ] CgroupsAnyHierarchyWithCpuMemoryFreezerTest.ROOT_CGROUPS_Freezer
[  FAILED  ] CgroupsAnyHierarchyWithCpuMemoryFreezerTest.ROOT_CGROUPS_KillTasks
[  FAILED  ] CgroupsAnyHierarchyWithCpuMemoryFreezerTest.ROOT_CGROUPS_DestroyCgroup

18 FAILED TESTS
  YOU HAVE 1 DISABLED TEST

FAIL: mesos-tests
==================
1 of 1 test failed
==================
make[3]: *** [check-TESTS] Error 1
make[3]: Leaving directory `<https://builds.apache.org/job/Mesos-Trunk-Ubuntu-Build-Out-Of-Src-Disable-Java-Disable-Python-Disable-Webui/ws/build/src'>
make[2]: *** [check-am] Error 2
make[2]: Leaving directory `<https://builds.apache.org/job/Mesos-Trunk-Ubuntu-Build-Out-Of-Src-Disable-Java-Disable-Python-Disable-Webui/ws/build/src'>
make[1]: *** [check] Error 2
make[1]: Leaving directory `<https://builds.apache.org/job/Mesos-Trunk-Ubuntu-Build-Out-Of-Src-Disable-Java-Disable-Python-Disable-Webui/ws/build/src'>
make: *** [check-recursive] Error 1
Build step 'Execute shell' marked build as failure

Mime
View raw message