mesos-dev mailing list archives

Site index · List index
Message view « Date » · « Thread »
Top « Date » · « Thread »
From Apache Jenkins Server <jenk...@builds.apache.org>
Subject Build failed in Jenkins: Mesos-Trunk-Ubuntu-Build-Out-Of-Src-Set-JAVA_HOME #281
Date Thu, 15 Nov 2012 01:14:35 GMT
See <https://builds.apache.org/job/Mesos-Trunk-Ubuntu-Build-Out-Of-Src-Set-JAVA_HOME/281/changes>

Changes:

[benh] Updated version to 0.12.0.

[benh] Added an EXIT function to stout.

From: Ben Mahler <benjamin.mahler@gmail.com>
Review: https://reviews.apache.org/r/7781

------------------------------------------
[...truncated 3406 lines...]
[       OK ] CoordinatorTest.ElectNoQuorum (179 ms)
[ RUN      ] CoordinatorTest.AppendNoQuorum
[       OK ] CoordinatorTest.AppendNoQuorum (315 ms)
[ RUN      ] CoordinatorTest.Failover
[       OK ] CoordinatorTest.Failover (409 ms)
[ RUN      ] CoordinatorTest.Demoted
[       OK ] CoordinatorTest.Demoted (446 ms)
[ RUN      ] CoordinatorTest.Fill
[       OK ] CoordinatorTest.Fill (645 ms)
[ RUN      ] CoordinatorTest.NotLearnedFill
[       OK ] CoordinatorTest.NotLearnedFill (509 ms)
[ RUN      ] CoordinatorTest.MultipleAppends
[       OK ] CoordinatorTest.MultipleAppends (656 ms)
[ RUN      ] CoordinatorTest.MultipleAppendsNotLearnedFill
[       OK ] CoordinatorTest.MultipleAppendsNotLearnedFill (1259 ms)
[ RUN      ] CoordinatorTest.Truncate
[       OK ] CoordinatorTest.Truncate (639 ms)
[ RUN      ] CoordinatorTest.TruncateNotLearnedFill
[       OK ] CoordinatorTest.TruncateNotLearnedFill (1075 ms)
[ RUN      ] CoordinatorTest.TruncateLearnedFill
E1115 01:14:27.207368  7208 replica.cpp:733] Error getting log record at 0: Attempted to read
truncated position
E1115 01:14:27.279374  7205 replica.cpp:733] Error getting log record at 1: Attempted to read
truncated position
E1115 01:14:27.301782  7209 replica.cpp:733] Error getting log record at 2: Attempted to read
truncated position
E1115 01:14:27.329661  7203 replica.cpp:733] Error getting log record at 3: Attempted to read
truncated position
E1115 01:14:27.365536  7204 replica.cpp:733] Error getting log record at 4: Attempted to read
truncated position
E1115 01:14:27.397411  7207 replica.cpp:733] Error getting log record at 5: Attempted to read
truncated position
E1115 01:14:27.425294  7205 replica.cpp:733] Error getting log record at 6: Attempted to read
truncated position
[       OK ] CoordinatorTest.TruncateLearnedFill (1149 ms)
[ RUN      ] CoordinatorTest.RacingElect
[       OK ] CoordinatorTest.RacingElect (0 ms)
[ RUN      ] CoordinatorTest.FillNoQuorum
[       OK ] CoordinatorTest.FillNoQuorum (0 ms)
[ RUN      ] CoordinatorTest.FillInconsistent
[       OK ] CoordinatorTest.FillInconsistent (0 ms)
[ RUN      ] CoordinatorTest.LearnedOnOneReplica_NotLearnedOnAnother
[       OK ] CoordinatorTest.LearnedOnOneReplica_NotLearnedOnAnother (0 ms)
[ RUN      ] CoordinatorTest.LearnedOnOneReplica_NotLearnedOnAnother_AnotherFailsAndRecovers
[       OK ] CoordinatorTest.LearnedOnOneReplica_NotLearnedOnAnother_AnotherFailsAndRecovers
(0 ms)
[----------] 19 tests from CoordinatorTest (8379 ms total)

[----------] 2 tests from LogTest
[ RUN      ] LogTest.WriteRead
[       OK ] LogTest.WriteRead (411 ms)
[ RUN      ] LogTest.Position
[       OK ] LogTest.Position (323 ms)
[----------] 2 tests from LogTest (734 ms total)

[----------] 5 tests from FlagsTest
[ RUN      ] FlagsTest.Load
[       OK ] FlagsTest.Load (0 ms)
[ RUN      ] FlagsTest.Add
[       OK ] FlagsTest.Add (0 ms)
[ RUN      ] FlagsTest.Flags
[       OK ] FlagsTest.Flags (1 ms)
[ RUN      ] FlagsTest.Configurator
[       OK ] FlagsTest.Configurator (0 ms)
[ RUN      ] FlagsTest.Duration
[       OK ] FlagsTest.Duration (0 ms)
[----------] 5 tests from FlagsTest (1 ms total)

[----------] 6 tests from FilesTest
[ RUN      ] FilesTest.AttachTest
E1115 01:14:28.294360  7209 files.cpp:116] Error attaching path 'missing': No such file or
directory
E1115 01:14:28.294986  7209 files.cpp:116] Error attaching path '$@': No such file or directory
[       OK ] FilesTest.AttachTest (2 ms)
[ RUN      ] FilesTest.DetachTest
[       OK ] FilesTest.DetachTest (0 ms)
[ RUN      ] FilesTest.ReadTest
[       OK ] FilesTest.ReadTest (127 ms)
[ RUN      ] FilesTest.ResolveTest
[       OK ] FilesTest.ResolveTest (376 ms)
[ RUN      ] FilesTest.BrowseTest
[       OK ] FilesTest.BrowseTest (12 ms)
[ RUN      ] FilesTest.DownloadTest
[       OK ] FilesTest.DownloadTest (5 ms)
[----------] 6 tests from FilesTest (522 ms total)

[----------] 10 tests from FaultToleranceTest
[ RUN      ] FaultToleranceTest.SlaveLost
[       OK ] FaultToleranceTest.SlaveLost (5 ms)
[ RUN      ] FaultToleranceTest.SlavePartitioned
[       OK ] FaultToleranceTest.SlavePartitioned (9 ms)
[ RUN      ] FaultToleranceTest.SchedulerFailover
[       OK ] FaultToleranceTest.SchedulerFailover (5 ms)
[ RUN      ] FaultToleranceTest.FrameworkReliableRegistration
[       OK ] FaultToleranceTest.FrameworkReliableRegistration (5 ms)
[ RUN      ] FaultToleranceTest.FrameworkReregister
[       OK ] FaultToleranceTest.FrameworkReregister (5 ms)
[ RUN      ] FaultToleranceTest.SchedulerFailoverStatusUpdate
[       OK ] FaultToleranceTest.SchedulerFailoverStatusUpdate (11 ms)
[ RUN      ] FaultToleranceTest.SchedulerFailoverFrameworkMessage
[       OK ] FaultToleranceTest.SchedulerFailoverFrameworkMessage (9 ms)
[ RUN      ] FaultToleranceTest.SchedulerExit
[       OK ] FaultToleranceTest.SchedulerExit (10 ms)
[ RUN      ] FaultToleranceTest.SlaveReliableRegistration
[       OK ] FaultToleranceTest.SlaveReliableRegistration (6 ms)
[ RUN      ] FaultToleranceTest.SlaveReregister
[       OK ] FaultToleranceTest.SlaveReregister (6 ms)
[----------] 10 tests from FaultToleranceTest (71 ms total)

[----------] 8 tests from ResourceOffersTest
[ RUN      ] ResourceOffersTest.ResourceOfferWithMultipleSlaves
[       OK ] ResourceOffersTest.ResourceOfferWithMultipleSlaves (37 ms)
[ RUN      ] ResourceOffersTest.TaskUsesNoResources
[       OK ] ResourceOffersTest.TaskUsesNoResources (6 ms)
[ RUN      ] ResourceOffersTest.TaskUsesInvalidResources
[       OK ] ResourceOffersTest.TaskUsesInvalidResources (6 ms)
[ RUN      ] ResourceOffersTest.TaskUsesMoreResourcesThanOffered
[       OK ] ResourceOffersTest.TaskUsesMoreResourcesThanOffered (6 ms)
[ RUN      ] ResourceOffersTest.ResourcesGetReofferedWhenUnused
[       OK ] ResourceOffersTest.ResourcesGetReofferedWhenUnused (5 ms)
[ RUN      ] ResourceOffersTest.ResourcesGetReofferedAfterTaskInfoError
[       OK ] ResourceOffersTest.ResourcesGetReofferedAfterTaskInfoError (7 ms)
[ RUN      ] ResourceOffersTest.Request
[       OK ] ResourceOffersTest.Request (5 ms)
[ RUN      ] ResourceOffersTest.TasksExecutorInfoDiffers
[       OK ] ResourceOffersTest.TasksExecutorInfoDiffers (7 ms)
[----------] 8 tests from ResourceOffersTest (79 ms total)

[----------] 3 tests from GarbageCollectorTest
[ RUN      ] GarbageCollectorTest.Restart
[       OK ] GarbageCollectorTest.Restart (1089 ms)
[ RUN      ] GarbageCollectorTest.ExitedExecutor
[       OK ] GarbageCollectorTest.ExitedExecutor (1019 ms)
[ RUN      ] GarbageCollectorTest.DiskUsage
[       OK ] GarbageCollectorTest.DiskUsage (1019 ms)
[----------] 3 tests from GarbageCollectorTest (3127 ms total)

[----------] 5 tests from SlaveStateFixture
[ RUN      ] SlaveStateFixture.CreateExecutorDirectory
[       OK ] SlaveStateFixture.CreateExecutorDirectory (1 ms)
[ RUN      ] SlaveStateFixture.format
[       OK ] SlaveStateFixture.format (1 ms)
[ RUN      ] SlaveStateFixture.parse
[       OK ] SlaveStateFixture.parse (2 ms)
[ RUN      ] SlaveStateFixture.CheckpointSlaveID
[       OK ] SlaveStateFixture.CheckpointSlaveID (1 ms)
[ RUN      ] SlaveStateFixture.CheckpointFrameworkPID
[       OK ] SlaveStateFixture.CheckpointFrameworkPID (1 ms)
[----------] 5 tests from SlaveStateFixture (6 ms total)

[----------] 4 tests from LevelDBStateTest
[ RUN      ] LevelDBStateTest.GetSetGet
[       OK ] LevelDBStateTest.GetSetGet (163 ms)
[ RUN      ] LevelDBStateTest.GetSetSetGet
[       OK ] LevelDBStateTest.GetSetSetGet (159 ms)
[ RUN      ] LevelDBStateTest.GetGetSetSetGet
[       OK ] LevelDBStateTest.GetGetSetSetGet (126 ms)
[ RUN      ] LevelDBStateTest.Names
[       OK ] LevelDBStateTest.Names (125 ms)
[----------] 4 tests from LevelDBStateTest (573 ms total)

[----------] 4 tests from ZooKeeperStateTest
[ RUN      ] ZooKeeperStateTest.GetSetGet
[       OK ] ZooKeeperStateTest.GetSetGet (147 ms)
[ RUN      ] ZooKeeperStateTest.GetSetSetGet
[       OK ] ZooKeeperStateTest.GetSetSetGet (102 ms)
[ RUN      ] ZooKeeperStateTest.GetGetSetSetGet
[       OK ] ZooKeeperStateTest.GetGetSetSetGet (89 ms)
[ RUN      ] ZooKeeperStateTest.Names
[       OK ] ZooKeeperStateTest.Names (86 ms)
[----------] 4 tests from ZooKeeperStateTest (424 ms total)

[----------] 10 tests from MasterTest
[ RUN      ] MasterTest.TaskRunning
[       OK ] MasterTest.TaskRunning (12 ms)
[ RUN      ] MasterTest.ShutdownFrameworkWhileTaskRunning
[       OK ] MasterTest.ShutdownFrameworkWhileTaskRunning (7 ms)
[ RUN      ] MasterTest.KillTask
[       OK ] MasterTest.KillTask (9 ms)
[ RUN      ] MasterTest.StatusUpdateAck
[       OK ] MasterTest.StatusUpdateAck (8 ms)
[ RUN      ] MasterTest.RecoverResources
[       OK ] MasterTest.RecoverResources (2018 ms)
[ RUN      ] MasterTest.FrameworkMessage
[       OK ] MasterTest.FrameworkMessage (8 ms)
[ RUN      ] MasterTest.MultipleExecutors
[       OK ] MasterTest.MultipleExecutors (10 ms)
[ RUN      ] MasterTest.MasterInfo
[       OK ] MasterTest.MasterInfo (2 ms)
[ RUN      ] MasterTest.MasterInfoOnReElection
[       OK ] MasterTest.MasterInfoOnReElection (6 ms)
[ RUN      ] MasterTest.MasterLost
[       OK ] MasterTest.MasterLost (5 ms)
[----------] 10 tests from MasterTest (2085 ms total)

[----------] 1 test from WhitelistFixture
[ RUN      ] WhitelistFixture.WhitelistSlave
[       OK ] WhitelistFixture.WhitelistSlave (6 ms)
[----------] 1 test from WhitelistFixture (6 ms total)

[----------] 5 tests from FrameworksManagerTestFixture
[ RUN      ] FrameworksManagerTestFixture.AddFramework
[       OK ] FrameworksManagerTestFixture.AddFramework (3 ms)
[ RUN      ] FrameworksManagerTestFixture.RemoveFramework
[       OK ] FrameworksManagerTestFixture.RemoveFramework (3 ms)
[ RUN      ] FrameworksManagerTestFixture.ResurrectFramework
[       OK ] FrameworksManagerTestFixture.ResurrectFramework (2 ms)
[ RUN      ] FrameworksManagerTestFixture.ResurrectExpiringFramework
[       OK ] FrameworksManagerTestFixture.ResurrectExpiringFramework (2 ms)
[ RUN      ] FrameworksManagerTestFixture.ResurrectInterspersedExpiringFrameworks
[       OK ] FrameworksManagerTestFixture.ResurrectInterspersedExpiringFrameworks (2 ms)
[----------] 5 tests from FrameworksManagerTestFixture (12 ms total)

[----------] 1 test from FrameworksManagerTest
[ RUN      ] FrameworksManagerTest.CacheFailure
E1115 01:14:35.199982  7207 frameworks_manager.cpp:215] Error getting framework info from
underlying storage: Fake Caching Error.
E1115 01:14:35.200917  7208 frameworks_manager.cpp:215] Error getting framework info from
underlying storage: Fake Caching Error.
[       OK ] FrameworksManagerTest.CacheFailure (2 ms)
[----------] 1 test from FrameworksManagerTest (2 ms total)

[----------] Global test environment tear-down
[==========] 226 tests from 43 test cases ran. (85547 ms total)
[  PASSED  ] 208 tests.
[  FAILED  ] 18 tests, listed below:
[  FAILED  ] CgroupsAnyHierarchyTest.ROOT_CGROUPS_Enabled
[  FAILED  ] CgroupsAnyHierarchyTest.ROOT_CGROUPS_Subsystems
[  FAILED  ] CgroupsAnyHierarchyTest.ROOT_CGROUPS_CheckHierarchy
[  FAILED  ] CgroupsAnyHierarchyTest.ROOT_CGROUPS_GetCgroups
[  FAILED  ] CgroupsAnyHierarchyTest.ROOT_CGROUPS_NestedCgroups
[  FAILED  ] CgroupsAnyHierarchyTest.ROOT_CGROUPS_ReadControl
[  FAILED  ] CgroupsAnyHierarchyTest.ROOT_CGROUPS_WriteControl
[  FAILED  ] CgroupsAnyHierarchyTest.ROOT_CGROUPS_GetTasks
[  FAILED  ] CgroupsAnyHierarchyWithCpuMemoryTest.ROOT_CGROUPS_Busy
[  FAILED  ] CgroupsAnyHierarchyWithCpuMemoryTest.ROOT_CGROUPS_SubsystemsHierarchy
[  FAILED  ] CgroupsAnyHierarchyWithCpuMemoryTest.ROOT_CGROUPS_CheckHierarchySubsystems
[  FAILED  ] CgroupsAnyHierarchyWithCpuMemoryTest.ROOT_CGROUPS_CreateRemoveCgroup
[  FAILED  ] CgroupsAnyHierarchyWithCpuMemoryTest.ROOT_CGROUPS_ListenEvent
[  FAILED  ] CgroupsNoHierarchyTest.ROOT_CGROUPS_CreateRemoveHierarchy
[  FAILED  ] CgroupsAnyHierarchyWithCpuMemoryFreezerTest.ROOT_CGROUPS_Freezer
[  FAILED  ] CgroupsAnyHierarchyWithCpuMemoryFreezerTest.ROOT_CGROUPS_KillTasks
[  FAILED  ] CgroupsAnyHierarchyWithCpuMemoryFreezerTest.ROOT_CGROUPS_DestroyCgroup
[  FAILED  ] CgroupsIsolationTest.ROOT_CGROUPS_BalloonFramework

18 FAILED TESTS
  YOU HAVE 1 DISABLED TEST

FAIL: mesos-tests
==================
1 of 1 test failed
==================
make[3]: *** [check-TESTS] Error 1
make[3]: Leaving directory `<https://builds.apache.org/job/Mesos-Trunk-Ubuntu-Build-Out-Of-Src-Set-JAVA_HOME/ws/build/src'>
make[2]: *** [check-am] Error 2
make[2]: Leaving directory `<https://builds.apache.org/job/Mesos-Trunk-Ubuntu-Build-Out-Of-Src-Set-JAVA_HOME/ws/build/src'>
make[1]: *** [check] Error 2
make[1]: Leaving directory `<https://builds.apache.org/job/Mesos-Trunk-Ubuntu-Build-Out-Of-Src-Set-JAVA_HOME/ws/build/src'>
make: *** [check-recursive] Error 1
Build step 'Execute shell' marked build as failure

Mime
View raw message