mesos-dev mailing list archives

Site index · List index
Message view « Date » · « Thread »
Top « Date » · « Thread »
From Apache Jenkins Server <jenk...@builds.apache.org>
Subject Build failed in Jenkins: Mesos-Trunk-Ubuntu-Build-Out-Of-Src-Set-JAVA_HOME #244
Date Mon, 10 Sep 2012 01:49:24 GMT
See <https://builds.apache.org/job/Mesos-Trunk-Ubuntu-Build-Out-Of-Src-Set-JAVA_HOME/244/changes>

Changes:

[benh] Added explicit 'using' for process::wait ambiguity on Linux.

------------------------------------------
[...truncated 649 lines...]
creating libglog.la
(cd .libs && rm -f libglog.la && ln -s ../libglog.la libglog.la)
g++ -DHAVE_CONFIG_H -I. -I./src  -I./src  -pthread    -Wall -Wwrite-strings -Woverloaded-virtual
-Wno-sign-compare  -DNO_FRAME_POINTER -g -O2 -MT logging_unittest-logging_unittest.o -MD -MP
-MF .deps/logging_unittest-logging_unittest.Tpo -c -o logging_unittest-logging_unittest.o
`test -f 'src/logging_unittest.cc' || echo './'`src/logging_unittest.cc
mv -f .deps/logging_unittest-logging_unittest.Tpo .deps/logging_unittest-logging_unittest.Po
/bin/bash ./libtool --tag=CXX   --mode=link g++ -pthread    -Wall -Wwrite-strings -Woverloaded-virtual
-Wno-sign-compare  -DNO_FRAME_POINTER -g -O2 -pthread  -o logging_unittest  logging_unittest-logging_unittest.o
 libglog.la       -lpthread 
g++ -pthread -Wall -Wwrite-strings -Woverloaded-virtual -Wno-sign-compare -DNO_FRAME_POINTER
-g -O2 -pthread -o logging_unittest logging_unittest-logging_unittest.o  ./.libs/libglog.a
-lpthread  
g++ -DHAVE_CONFIG_H -I. -I./src  -I./src  -pthread    -Wall -Wwrite-strings -Woverloaded-virtual
-Wno-sign-compare  -DNO_FRAME_POINTER -g -O2 -MT demangle_unittest-demangle_unittest.o -MD
-MP -MF .deps/demangle_unittest-demangle_unittest.Tpo -c -o demangle_unittest-demangle_unittest.o
`test -f 'src/demangle_unittest.cc' || echo './'`src/demangle_unittest.cc
mv -f .deps/demangle_unittest-demangle_unittest.Tpo .deps/demangle_unittest-demangle_unittest.Po
/bin/bash ./libtool --tag=CXX   --mode=link g++ -pthread    -Wall -Wwrite-strings -Woverloaded-virtual
-Wno-sign-compare  -DNO_FRAME_POINTER -g -O2 -pthread  -o demangle_unittest  demangle_unittest-demangle_unittest.o
 libglog.la       -lpthread 
g++ -pthread -Wall -Wwrite-strings -Woverloaded-virtual -Wno-sign-compare -DNO_FRAME_POINTER
-g -O2 -pthread -o demangle_unittest demangle_unittest-demangle_unittest.o  ./.libs/libglog.a
-lpthread  
g++ -DHAVE_CONFIG_H -I. -I./src  -I./src  -pthread    -Wall -Wwrite-strings -Woverloaded-virtual
-Wno-sign-compare  -DNO_FRAME_POINTER -g -O2 -MT stacktrace_unittest-stacktrace_unittest.o
-MD -MP -MF .deps/stacktrace_unittest-stacktrace_unittest.Tpo -c -o stacktrace_unittest-stacktrace_unittest.o
`test -f 'src/stacktrace_unittest.cc' || echo './'`src/stacktrace_unittest.cc
mv -f .deps/stacktrace_unittest-stacktrace_unittest.Tpo .deps/stacktrace_unittest-stacktrace_unittest.Po
/bin/bash ./libtool --tag=CXX   --mode=link g++ -pthread    -Wall -Wwrite-strings -Woverloaded-virtual
-Wno-sign-compare  -DNO_FRAME_POINTER -g -O2 -pthread  -o stacktrace_unittest  stacktrace_unittest-stacktrace_unittest.o
 libglog.la    -lpthread 
g++ -pthread -Wall -Wwrite-strings -Woverloaded-virtual -Wno-sign-compare -DNO_FRAME_POINTER
-g -O2 -pthread -o stacktrace_unittest stacktrace_unittest-stacktrace_unittest.o  ./.libs/libglog.a
-lpthread  
g++ -DHAVE_CONFIG_H -I. -I./src  -I./src  -pthread    -Wall -Wwrite-strings -Woverloaded-virtual
-Wno-sign-compare  -DNO_FRAME_POINTER -g -O2 -MT symbolize_unittest-symbolize_unittest.o -MD
-MP -MF .deps/symbolize_unittest-symbolize_unittest.Tpo -c -o symbolize_unittest-symbolize_unittest.o
`test -f 'src/symbolize_unittest.cc' || echo './'`src/symbolize_unittest.cc
mv -f .deps/symbolize_unittest-symbolize_unittest.Tpo .deps/symbolize_unittest-symbolize_unittest.Po
/bin/bash ./libtool --tag=CXX   --mode=link g++ -pthread    -Wall -Wwrite-strings -Woverloaded-virtual
-Wno-sign-compare  -DNO_FRAME_POINTER -g -O2 -pthread  -o symbolize_unittest  symbolize_unittest-symbolize_unittest.o
 libglog.la       -lpthread 
g++ -pthread -Wall -Wwrite-strings -Woverloaded-virtual -Wno-sign-compare -DNO_FRAME_POINTER
-g -O2 -pthread -o symbolize_unittest symbolize_unittest-symbolize_unittest.o  ./.libs/libglog.a
-lpthread  
g++ -DHAVE_CONFIG_H -I. -I./src  -I./src  -pthread    -Wall -Wwrite-strings -Woverloaded-virtual
-Wno-sign-compare  -DNO_FRAME_POINTER -g -O2 -MT stl_logging_unittest-stl_logging_unittest.o
-MD -MP -MF .deps/stl_logging_unittest-stl_logging_unittest.Tpo -c -o stl_logging_unittest-stl_logging_unittest.o
`test -f 'src/stl_logging_unittest.cc' || echo './'`src/stl_logging_unittest.cc
mv -f .deps/stl_logging_unittest-stl_logging_unittest.Tpo .deps/stl_logging_unittest-stl_logging_unittest.Po
/bin/bash ./libtool --tag=CXX   --mode=link g++ -pthread    -Wall -Wwrite-strings -Woverloaded-virtual
-Wno-sign-compare  -DNO_FRAME_POINTER -g -O2 -pthread  -o stl_logging_unittest  stl_logging_unittest-stl_logging_unittest.o
 libglog.la       -lpthread 
g++ -pthread -Wall -Wwrite-strings -Woverloaded-virtual -Wno-sign-compare -DNO_FRAME_POINTER
-g -O2 -pthread -o stl_logging_unittest stl_logging_unittest-stl_logging_unittest.o  ./.libs/libglog.a
-lpthread  
g++ -DHAVE_CONFIG_H -I. -I./src  -I./src  -pthread    -Wall -Wwrite-strings -Woverloaded-virtual
-Wno-sign-compare  -DNO_FRAME_POINTER -g -O2 -MT utilities_unittest-utilities_unittest.o -MD
-MP -MF .deps/utilities_unittest-utilities_unittest.Tpo -c -o utilities_unittest-utilities_unittest.o
`test -f 'src/utilities_unittest.cc' || echo './'`src/utilities_unittest.cc
mv -f .deps/utilities_unittest-utilities_unittest.Tpo .deps/utilities_unittest-utilities_unittest.Po
/bin/bash ./libtool --tag=CXX   --mode=link g++ -pthread    -Wall -Wwrite-strings -Woverloaded-virtual
-Wno-sign-compare  -DNO_FRAME_POINTER -g -O2 -pthread  -o utilities_unittest  utilities_unittest-utilities_unittest.o
 libglog.la       -lpthread 
g++ -pthread -Wall -Wwrite-strings -Woverloaded-virtual -Wno-sign-compare -DNO_FRAME_POINTER
-g -O2 -pthread -o utilities_unittest utilities_unittest-utilities_unittest.o  ./.libs/libglog.a
-lpthread  
g++ -DHAVE_CONFIG_H -I. -I./src  -I./src  -pthread    -Wall -Wwrite-strings -Woverloaded-virtual
-Wno-sign-compare  -DNO_FRAME_POINTER -g -O2 -MT logging_striptest0-logging_striptest_main.o
-MD -MP -MF .deps/logging_striptest0-logging_striptest_main.Tpo -c -o logging_striptest0-logging_striptest_main.o
`test -f 'src/logging_striptest_main.cc' || echo './'`src/logging_striptest_main.cc
mv -f .deps/logging_striptest0-logging_striptest_main.Tpo .deps/logging_striptest0-logging_striptest_main.Po
/bin/bash ./libtool --tag=CXX   --mode=link g++ -pthread    -Wall -Wwrite-strings -Woverloaded-virtual
-Wno-sign-compare  -DNO_FRAME_POINTER -g -O2 -pthread  -o logging_striptest0  logging_striptest0-logging_striptest_main.o
 libglog.la    -lpthread 
g++ -pthread -Wall -Wwrite-strings -Woverloaded-virtual -Wno-sign-compare -DNO_FRAME_POINTER
-g -O2 -pthread -o logging_striptest0 logging_striptest0-logging_striptest_main.o  ./.libs/libglog.a
-lpthread  
g++ -DHAVE_CONFIG_H -I. -I./src  -I./src  -pthread    -Wall -Wwrite-strings -Woverloaded-virtual
-Wno-sign-compare  -DNO_FRAME_POINTER -g -O2 -MT logging_striptest2-logging_striptest2.o -MD
-MP -MF .deps/logging_striptest2-logging_striptest2.Tpo -c -o logging_striptest2-logging_striptest2.o
`test -f 'src/logging_striptest2.cc' || echo './'`src/logging_striptest2.cc
mv -f .deps/logging_striptest2-logging_striptest2.Tpo .deps/logging_striptest2-logging_striptest2.Po
/bin/bash ./libtool --tag=CXX   --mode=link g++ -pthread    -Wall -Wwrite-strings -Woverloaded-virtual
-Wno-sign-compare  -DNO_FRAME_POINTER -g -O2 -pthread  -o logging_striptest2  logging_striptest2-logging_striptest2.o
 libglog.la    -lpthread 
g++ -pthread -Wall -Wwrite-strings -Woverloaded-virtual -Wno-sign-compare -DNO_FRAME_POINTER
-g -O2 -pthread -o logging_striptest2 logging_striptest2-logging_striptest2.o  ./.libs/libglog.a
-lpthread  
g++ -DHAVE_CONFIG_H -I. -I./src  -I./src  -pthread    -Wall -Wwrite-strings -Woverloaded-virtual
-Wno-sign-compare  -DNO_FRAME_POINTER -g -O2 -MT logging_striptest10-logging_striptest10.o
-MD -MP -MF .deps/logging_striptest10-logging_striptest10.Tpo -c -o logging_striptest10-logging_striptest10.o
`test -f 'src/logging_striptest10.cc' || echo './'`src/logging_striptest10.cc
mv -f .deps/logging_striptest10-logging_striptest10.Tpo .deps/logging_striptest10-logging_striptest10.Po
/bin/bash ./libtool --tag=CXX   --mode=link g++ -pthread    -Wall -Wwrite-strings -Woverloaded-virtual
-Wno-sign-compare  -DNO_FRAME_POINTER -g -O2 -pthread  -o logging_striptest10  logging_striptest10-logging_striptest10.o
 libglog.la    -lpthread 
g++ -pthread -Wall -Wwrite-strings -Woverloaded-virtual -Wno-sign-compare -DNO_FRAME_POINTER
-g -O2 -pthread -o logging_striptest10 logging_striptest10-logging_striptest10.o  ./.libs/libglog.a
-lpthread  
g++ -DHAVE_CONFIG_H -I. -I./src  -I./src  -pthread    -Wall -Wwrite-strings -Woverloaded-virtual
-Wno-sign-compare  -DNO_FRAME_POINTER -g -O2 -MT signalhandler_unittest-signalhandler_unittest.o
-MD -MP -MF .deps/signalhandler_unittest-signalhandler_unittest.Tpo -c -o signalhandler_unittest-signalhandler_unittest.o
`test -f 'src/signalhandler_unittest.cc' || echo './'`src/signalhandler_unittest.cc
src/signalhandler_unittest.cc: In function 'void WriteToStdout(const char*, int)':
src/signalhandler_unittest.cc:61: warning: ignoring return value of 'ssize_t write(int, const
void*, size_t)', declared with attribute warn_unused_result
mv -f .deps/signalhandler_unittest-signalhandler_unittest.Tpo .deps/signalhandler_unittest-signalhandler_unittest.Po
/bin/bash ./libtool --tag=CXX   --mode=link g++ -pthread    -Wall -Wwrite-strings -Woverloaded-virtual
-Wno-sign-compare  -DNO_FRAME_POINTER -g -O2 -pthread  -o signalhandler_unittest  signalhandler_unittest-signalhandler_unittest.o
 libglog.la       -lpthread 
g++ -pthread -Wall -Wwrite-strings -Woverloaded-virtual -Wno-sign-compare -DNO_FRAME_POINTER
-g -O2 -pthread -o signalhandler_unittest signalhandler_unittest-signalhandler_unittest.o
 ./.libs/libglog.a -lpthread  
make[6]: Leaving directory `<https://builds.apache.org/job/Mesos-Trunk-Ubuntu-Build-Out-Of-Src-Set-JAVA_HOME/ws/build/third_party/libprocess/third_party/glog-0.3.1'>
gzip -d -c ../../../../third_party/libprocess/third_party/libev-3.8.tar.gz | tar xf -
test ! -e ../../../../third_party/libprocess/third_party/libev-3.8.patch || patch -d libev-3.8
-p1 <../../../../third_party/libprocess/third_party/libev-3.8.patch
patching file ev.c
touch libev-3.8-stamp
cd libev-3.8 && ./configure '--disable-option-checking' '--prefix=/usr/local' 'JAVA_HOME=/home/jenkins/tools/java/jdk1.6.0_20-64'
'--enable-shared=no' '--with-pic' '--cache-file=/dev/null' '--srcdir=../../../third_party/libprocess'
--enable-shared=no --with-pic --srcdir=. && \
          make 
checking for a BSD-compatible install... /usr/bin/install -c
checking whether build environment is sane... yes
checking for a thread-safe mkdir -p... /bin/mkdir -p
checking for gawk... no
checking for mawk... mawk
checking whether make sets $(MAKE)... yes
checking whether to enable maintainer-specific portions of Makefiles... no
checking for a BSD-compatible install... /usr/bin/install -c
checking build system type... x86_64-unknown-linux-gnu
checking host system type... x86_64-unknown-linux-gnu
checking for style of include used by make... GNU
checking for gcc... gcc
checking for C compiler default output file name... a.out
checking whether the C compiler works... yes
checking whether we are cross compiling... no
checking for suffix of executables... 
checking for suffix of object files... o
checking whether we are using the GNU C compiler... yes
checking whether gcc accepts -g... yes
checking for gcc option to accept ISO C89... none needed
checking dependency style of gcc... none
checking for a sed that does not truncate output... /bin/sed
checking for grep that handles long lines and -e... /bin/grep
checking for egrep... /bin/grep -E
checking for ld used by gcc... /usr/bin/ld
checking if the linker (/usr/bin/ld) is GNU ld... yes
checking for /usr/bin/ld option to reload object files... -r
checking for BSD-compatible nm... /usr/bin/nm -B
checking whether ln -s works... yes
checking how to recognize dependent libraries... pass_all
checking how to run the C preprocessor... gcc -E
checking for ANSI C header files... yes
checking for sys/types.h... yes
checking for sys/stat.h... yes
checking for stdlib.h... yes
checking for string.h... yes
checking for memory.h... yes
checking for strings.h... yes
checking for inttypes.h... yes
checking for stdint.h... yes
checking for unistd.h... yes
checking dlfcn.h usability... yes
checking dlfcn.h presence... yes
checking for dlfcn.h... yes
checking for g++... g++
checking whether we are using the GNU C++ compiler... yes
checking whether g++ accepts -g... yes
checking dependency style of g++... none
checking how to run the C++ preprocessor... g++ -E
checking for g77... no
checking for xlf... no
checking for f77... no
checking for frt... no
checking for pgf77... no
checking for cf77... no
checking for fort77... no
checking for fl32... no
checking for af77... no
checking for xlf90... no
checking for f90... no
checking for pgf90... no
checking for pghpf... no
checking for epcf90... no
checking for gfortran... no
checking for g95... no
checking for xlf95... no
checking for f95... no
checking for fort... no
checking for ifort... no
checking for ifc... no
checking for efc... no
checking for pgf95... no
checking for lf95... no
checking for ftn... no
checking whether we are using the GNU Fortran 77 compiler... no
checking whether  accepts -g... no
checking the maximum length of command line arguments... 3458764513820540925
checking command to parse /usr/bin/nm -B output from gcc object... ok
checking for objdir... .libs
checking for ar... ar
checking for ranlib... ranlib
checking for strip... strip
checking if gcc supports -fno-rtti -fno-exceptions... no
checking for gcc option to produce PIC... -fPIC
checking if gcc PIC flag -fPIC works... yes
checking if gcc static flag -static works... yes
checking if gcc supports -c -o file.o... yes
checking whether the gcc linker (/usr/bin/ld -m elf_x86_64) supports shared libraries... yes
checking dynamic linker characteristics... GNU/Linux ld.so
checking how to hardcode library paths into programs... immediate
checking whether stripping libraries is possible... yes
checking if libtool supports shared libraries... yes
checking whether to build shared libraries... no
checking whether to build static libraries... yes
configure: creating libtool
appending configuration tag "CXX" to libtool
checking for ld used by g++... /usr/bin/ld -m elf_x86_64
checking if the linker (/usr/bin/ld -m elf_x86_64) is GNU ld... yes
checking whether the g++ linker (/usr/bin/ld -m elf_x86_64) supports shared libraries... yes
checking for g++ option to produce PIC... -fPIC
checking if g++ PIC flag -fPIC works... yes
checking if g++ static flag -static works... yes
checking if g++ supports -c -o file.o... yes
checking whether the g++ linker (/usr/bin/ld -m elf_x86_64) supports shared libraries... yes
checking dynamic linker characteristics... GNU/Linux ld.so
(cached) (cached) checking how to hardcode library paths into programs... immediate
appending configuration tag "F77" to libtool
checking sys/inotify.h usability... yes
checking sys/inotify.h presence... yes
checking for sys/inotify.h... yes
checking sys/epoll.h usability... yes
checking sys/epoll.h presence... yes
checking for sys/epoll.h... yes
checking sys/event.h usability... no
checking sys/event.h presence... no
checking for sys/event.h... no
checking sys/queue.h usability... yes
checking sys/queue.h presence... yes
checking for sys/queue.h... yes
checking port.h usability... no
checking port.h presence... no
checking for port.h... no
checking poll.h usability... yes
checking poll.h presence... yes
checking for poll.h... yes
checking sys/select.h usability... yes
checking sys/select.h presence... yes
checking for sys/select.h... yes
checking sys/eventfd.h usability... yes
checking sys/eventfd.h presence... yes
checking for sys/eventfd.h... yes
checking sys/signalfd.h usability... yes
checking sys/signalfd.h presence... yes
checking for sys/signalfd.h... yes
checking for inotify_init... yes
checking for epoll_ctl... yes
checking for kqueue... no
checking for port_create... no
checking for poll... yes
checking for select... yes
checking for eventfd... yes
checking for signalfd... yes
checking for clock_gettime... no
checking for clock_gettime syscall... yes
checking for nanosleep... yes
checking for ceil in -lm... yes
configure: creating ./config.status
config.status: creating Makefile
config.status: creating config.h
config.status: executing depfiles commands
make[6]: Entering directory `<https://builds.apache.org/job/Mesos-Trunk-Ubuntu-Build-Out-Of-Src-Set-JAVA_HOME/ws/build/third_party/libprocess/third_party/libev-3.8'>
make  all-am
make[7]: Entering directory `<https://builds.apache.org/job/Mesos-Trunk-Ubuntu-Build-Out-Of-Src-Set-JAVA_HOME/ws/build/third_party/libprocess/third_party/libev-3.8'>
/bin/bash ./libtool --tag=CC   --mode=compile gcc -DHAVE_CONFIG_H -I.     -g -O2 -O3 -c -o
ev.lo ev.c
 gcc -DHAVE_CONFIG_H -I. -g -O2 -O3 -c ev.c  -fPIC -DPIC -o ev.o
ev.c: In function 'evpipe_write':
ev.c:1205: warning: ignoring return value of 'write', declared with attribute warn_unused_result
ev.c:1209: warning: ignoring return value of 'write', declared with attribute warn_unused_result
ev.c: In function 'pipecb':
ev.c:1226: warning: ignoring return value of 'read', declared with attribute warn_unused_result
ev.c:1232: warning: ignoring return value of 'read', declared with attribute warn_unused_result
/bin/bash ./libtool --tag=CC   --mode=compile gcc -DHAVE_CONFIG_H -I.     -g -O2 -O3 -c -o
event.lo event.c
 gcc -DHAVE_CONFIG_H -I. -g -O2 -O3 -c event.c  -fPIC -DPIC -o event.o
/bin/bash ./libtool --tag=CC   --mode=link gcc  -g -O2 -O3 -version-info 3:0  -o libev.la
-rpath /usr/local/lib ev.lo event.lo  -lm 
mkdir .libs
ar cru .libs/libev.a  ev.o event.o
ranlib .libs/libev.a
creating libev.la
(cd .libs && rm -f libev.la && ln -s ../libev.la libev.la)
make[7]: Leaving directory `<https://builds.apache.org/job/Mesos-Trunk-Ubuntu-Build-Out-Of-Src-Set-JAVA_HOME/ws/build/third_party/libprocess/third_party/libev-3.8'>
make[6]: Leaving directory `<https://builds.apache.org/job/Mesos-Trunk-Ubuntu-Build-Out-Of-Src-Set-JAVA_HOME/ws/build/third_party/libprocess/third_party/libev-3.8'>
make[5]: Leaving directory `<https://builds.apache.org/job/Mesos-Trunk-Ubuntu-Build-Out-Of-Src-Set-JAVA_HOME/ws/build/third_party/libprocess/third_party'>
make[4]: Leaving directory `<https://builds.apache.org/job/Mesos-Trunk-Ubuntu-Build-Out-Of-Src-Set-JAVA_HOME/ws/build/third_party/libprocess/third_party'>
Making all in .
make[4]: Entering directory `<https://builds.apache.org/job/Mesos-Trunk-Ubuntu-Build-Out-Of-Src-Set-JAVA_HOME/ws/build/third_party/libprocess'>
/bin/bash ./libtool  --tag=CXX   --mode=compile g++ -DPACKAGE_NAME=\"libprocess\" -DPACKAGE_TARNAME=\"libprocess\"
-DPACKAGE_VERSION=\"0.0.1\" -DPACKAGE_STRING=\"libprocess\ 0.0.1\" -DPACKAGE_BUGREPORT=\"\"
-DPACKAGE_URL=\"\" -DPACKAGE=\"libprocess\" -DVERSION=\"0.0.1\" -DSTDC_HEADERS=1 -DHAVE_SYS_TYPES_H=1
-DHAVE_SYS_STAT_H=1 -DHAVE_STDLIB_H=1 -DHAVE_STRING_H=1 -DHAVE_MEMORY_H=1 -DHAVE_STRINGS_H=1
-DHAVE_INTTYPES_H=1 -DHAVE_STDINT_H=1 -DHAVE_UNISTD_H=1 -DHAVE_DLFCN_H=1 -DLT_OBJDIR=\".libs/\"
-DHAVE_PTHREAD=1 -I. -I../../../third_party/libprocess  -I../../../third_party/libprocess/include
-Ithird_party/boost-1.51.0 -Ithird_party/glog-0.3.1/src -Ithird_party/ry-http-parser-1c3624a
-Ithird_party/libev-3.8     -MT libprocess_la-process.lo -MD -MP -MF .deps/libprocess_la-process.Tpo
-c -o libprocess_la-process.lo `test -f 'src/process.cpp' || echo '../../../third_party/libprocess/'`src/process.cpp
libtool: compile:  g++ -DPACKAGE_NAME=\"libprocess\" -DPACKAGE_TARNAME=\"libprocess\" -DPACKAGE_VERSION=\"0.0.1\"
"-DPACKAGE_STRING=\"libprocess 0.0.1\"" -DPACKAGE_BUGREPORT=\"\" -DPACKAGE_URL=\"\" -DPACKAGE=\"libprocess\"
-DVERSION=\"0.0.1\" -DSTDC_HEADERS=1 -DHAVE_SYS_TYPES_H=1 -DHAVE_SYS_STAT_H=1 -DHAVE_STDLIB_H=1
-DHAVE_STRING_H=1 -DHAVE_MEMORY_H=1 -DHAVE_STRINGS_H=1 -DHAVE_INTTYPES_H=1 -DHAVE_STDINT_H=1
-DHAVE_UNISTD_H=1 -DHAVE_DLFCN_H=1 -DLT_OBJDIR=\".libs/\" -DHAVE_PTHREAD=1 -I. -I../../../third_party/libprocess
-I../../../third_party/libprocess/include -Ithird_party/boost-1.51.0 -Ithird_party/glog-0.3.1/src
-Ithird_party/ry-http-parser-1c3624a -Ithird_party/libev-3.8 -MT libprocess_la-process.lo
-MD -MP -MF .deps/libprocess_la-process.Tpo -c ../../../third_party/libprocess/src/process.cpp
 -fPIC -DPIC -o libprocess_la-process.o
In file included from ../../../third_party/libprocess/include/process/dispatch.hpp:7,
                 from ../../../third_party/libprocess/include/process/defer.hpp:7,
                 from ../../../third_party/libprocess/src/process.cpp:48:
/usr/include/bits/waitstatus.h: In function 'bool process::wait(const process::ProcessBase&,
const Duration&)':
/usr/include/bits/waitstatus.h:68: error: 'union wait' is not a function,
../../../third_party/libprocess/include/process/process.hpp:302: error:   conflict with 'bool
process::wait(const process::UPID&, const Duration&)'
../../../third_party/libprocess/include/process/process.hpp:336: error:   in call to 'wait'
/usr/include/bits/waitstatus.h: In function 'bool process::wait(const process::ProcessBase*,
const Duration&)':
/usr/include/bits/waitstatus.h:68: error: 'union wait' is not a function,
../../../third_party/libprocess/include/process/process.hpp:302: error:   conflict with 'bool
process::wait(const process::UPID&, const Duration&)'
../../../third_party/libprocess/include/process/process.hpp:342: error:   in call to 'wait'
make[4]: *** [libprocess_la-process.lo] Error 1
make[4]: Leaving directory `<https://builds.apache.org/job/Mesos-Trunk-Ubuntu-Build-Out-Of-Src-Set-JAVA_HOME/ws/build/third_party/libprocess'>
make[3]: *** [all-recursive] Error 1
make[3]: Leaving directory `<https://builds.apache.org/job/Mesos-Trunk-Ubuntu-Build-Out-Of-Src-Set-JAVA_HOME/ws/build/third_party/libprocess'>
make[2]: *** [all-recursive] Error 1
make[2]: Leaving directory `<https://builds.apache.org/job/Mesos-Trunk-Ubuntu-Build-Out-Of-Src-Set-JAVA_HOME/ws/build/third_party'>
make[1]: *** [all] Error 2
make[1]: Leaving directory `<https://builds.apache.org/job/Mesos-Trunk-Ubuntu-Build-Out-Of-Src-Set-JAVA_HOME/ws/build/third_party'>
make: *** [all-recursive] Error 1
Build step 'Execute shell' marked build as failure

Mime
View raw message