mesos-dev mailing list archives

Site index · List index
Message view « Date » · « Thread »
Top « Date » · « Thread »
From Apache Jenkins Server <jenk...@builds.apache.org>
Subject Build failed in Jenkins: Mesos-Trunk-Ubuntu-Build-Out-Of-Src-Set-JAVA_HOME #196
Date Wed, 11 Jul 2012 07:21:13 GMT
See <https://builds.apache.org/job/Mesos-Trunk-Ubuntu-Build-Out-Of-Src-Set-JAVA_HOME/196/>

------------------------------------------
[...truncated 3542 lines...]

[----------] 23 tests from ResourcesTest
[ RUN      ] ResourcesTest.Parsing
[       OK ] ResourcesTest.Parsing (0 ms)
[ RUN      ] ResourcesTest.Printing
[       OK ] ResourcesTest.Printing (0 ms)
[ RUN      ] ResourcesTest.InitializedIsEmpty
[       OK ] ResourcesTest.InitializedIsEmpty (0 ms)
[ RUN      ] ResourcesTest.BadResourcesNotAllocatable
[       OK ] ResourcesTest.BadResourcesNotAllocatable (0 ms)
[ RUN      ] ResourcesTest.ScalarEquals
[       OK ] ResourcesTest.ScalarEquals (0 ms)
[ RUN      ] ResourcesTest.ScalarSubset
[       OK ] ResourcesTest.ScalarSubset (0 ms)
[ RUN      ] ResourcesTest.ScalarAddition
[       OK ] ResourcesTest.ScalarAddition (0 ms)
[ RUN      ] ResourcesTest.ScalarSubtraction
[       OK ] ResourcesTest.ScalarSubtraction (0 ms)
[ RUN      ] ResourcesTest.RangesEquals
[       OK ] ResourcesTest.RangesEquals (0 ms)
[ RUN      ] ResourcesTest.RangesSubset
[       OK ] ResourcesTest.RangesSubset (0 ms)
[ RUN      ] ResourcesTest.RangesAddition
[       OK ] ResourcesTest.RangesAddition (0 ms)
[ RUN      ] ResourcesTest.RangesAddition2
[       OK ] ResourcesTest.RangesAddition2 (0 ms)
[ RUN      ] ResourcesTest.RangesSubtraction
[       OK ] ResourcesTest.RangesSubtraction (0 ms)
[ RUN      ] ResourcesTest.RangesSubtraction1
[       OK ] ResourcesTest.RangesSubtraction1 (0 ms)
[ RUN      ] ResourcesTest.RangesSubtraction2
[       OK ] ResourcesTest.RangesSubtraction2 (0 ms)
[ RUN      ] ResourcesTest.RangesSubtraction3
[       OK ] ResourcesTest.RangesSubtraction3 (1 ms)
[ RUN      ] ResourcesTest.RangesSubtraction4
[       OK ] ResourcesTest.RangesSubtraction4 (0 ms)
[ RUN      ] ResourcesTest.RangesSubtraction5
[       OK ] ResourcesTest.RangesSubtraction5 (0 ms)
[ RUN      ] ResourcesTest.SetEquals
[       OK ] ResourcesTest.SetEquals (0 ms)
[ RUN      ] ResourcesTest.SetSubset
[       OK ] ResourcesTest.SetSubset (0 ms)
[ RUN      ] ResourcesTest.SetAddition
[       OK ] ResourcesTest.SetAddition (0 ms)
[ RUN      ] ResourcesTest.SetSubtraction
[       OK ] ResourcesTest.SetSubtraction (0 ms)
[ RUN      ] ResourcesTest.EmptyUnequal
[       OK ] ResourcesTest.EmptyUnequal (0 ms)
[----------] 23 tests from ResourcesTest (1 ms total)

[----------] 3 tests from ReplicaTest
[ RUN      ] ReplicaTest.Promise
[       OK ] ReplicaTest.Promise (6 ms)
[ RUN      ] ReplicaTest.Append
[       OK ] ReplicaTest.Append (5 ms)
[ RUN      ] ReplicaTest.Recover
[       OK ] ReplicaTest.Recover (7 ms)
[----------] 3 tests from ReplicaTest (18 ms total)

[----------] 17 tests from CoordinatorTest
[ RUN      ] CoordinatorTest.Elect
[       OK ] CoordinatorTest.Elect (11 ms)
[ RUN      ] CoordinatorTest.AppendRead
[       OK ] CoordinatorTest.AppendRead (13 ms)
[ RUN      ] CoordinatorTest.AppendReadError
[       OK ] CoordinatorTest.AppendReadError (12 ms)
[ RUN      ] CoordinatorTest.Failover
[       OK ] CoordinatorTest.Failover (17 ms)
[ RUN      ] CoordinatorTest.Demoted
[       OK ] CoordinatorTest.Demoted (20 ms)
[ RUN      ] CoordinatorTest.Fill
[       OK ] CoordinatorTest.Fill (23 ms)
[ RUN      ] CoordinatorTest.NotLearnedFill
[       OK ] CoordinatorTest.NotLearnedFill (34 ms)
[ RUN      ] CoordinatorTest.MultipleAppends
[       OK ] CoordinatorTest.MultipleAppends (51 ms)
[ RUN      ] CoordinatorTest.MultipleAppendsNotLearnedFill
[       OK ] CoordinatorTest.MultipleAppendsNotLearnedFill (112 ms)
[ RUN      ] CoordinatorTest.Truncate
[       OK ] CoordinatorTest.Truncate (57 ms)
[ RUN      ] CoordinatorTest.TruncateNotLearnedFill
[       OK ] CoordinatorTest.TruncateNotLearnedFill (122 ms)
[ RUN      ] CoordinatorTest.TruncateLearnedFill
E0711 07:21:12.942894 14244 replica.cpp:736] Error getting log record at 0: Attempted to read
truncated position
E0711 07:21:12.944833 14240 replica.cpp:736] Error getting log record at 1: Attempted to read
truncated position
E0711 07:21:12.947613 14253 replica.cpp:736] Error getting log record at 2: Attempted to read
truncated position
E0711 07:21:12.950031 14252 replica.cpp:736] Error getting log record at 3: Attempted to read
truncated position
E0711 07:21:12.952589 14252 replica.cpp:736] Error getting log record at 4: Attempted to read
truncated position
E0711 07:21:12.955338 14254 replica.cpp:736] Error getting log record at 5: Attempted to read
truncated position
E0711 07:21:12.958086 14251 replica.cpp:736] Error getting log record at 6: Attempted to read
truncated position
[       OK ] CoordinatorTest.TruncateLearnedFill (83 ms)
[ RUN      ] CoordinatorTest.RacingElect
[       OK ] CoordinatorTest.RacingElect (0 ms)
[ RUN      ] CoordinatorTest.FillNoQuorum
[       OK ] CoordinatorTest.FillNoQuorum (0 ms)
[ RUN      ] CoordinatorTest.FillInconsistent
[       OK ] CoordinatorTest.FillInconsistent (0 ms)
[ RUN      ] CoordinatorTest.LearnedOnOneReplica_NotLearnedOnAnother
[       OK ] CoordinatorTest.LearnedOnOneReplica_NotLearnedOnAnother (0 ms)
[ RUN      ] CoordinatorTest.LearnedOnOneReplica_NotLearnedOnAnother_AnotherFailsAndRecovers
[       OK ] CoordinatorTest.LearnedOnOneReplica_NotLearnedOnAnother_AnotherFailsAndRecovers
(0 ms)
[----------] 17 tests from CoordinatorTest (555 ms total)

[----------] 2 tests from LogTest
[ RUN      ] LogTest.WriteRead
[       OK ] LogTest.WriteRead (34 ms)
[ RUN      ] LogTest.Position
[       OK ] LogTest.Position (18 ms)
[----------] 2 tests from LogTest (52 ms total)

[----------] 10 tests from FaultToleranceTest
[ RUN      ] FaultToleranceTest.SlaveLost
[       OK ] FaultToleranceTest.SlaveLost (3 ms)
[ RUN      ] FaultToleranceTest.SlavePartitioned
[       OK ] FaultToleranceTest.SlavePartitioned (10 ms)
[ RUN      ] FaultToleranceTest.SchedulerFailover
[       OK ] FaultToleranceTest.SchedulerFailover (5 ms)
[ RUN      ] FaultToleranceTest.FrameworkReliableRegistration
[       OK ] FaultToleranceTest.FrameworkReliableRegistration (6 ms)
[ RUN      ] FaultToleranceTest.FrameworkReregister
[       OK ] FaultToleranceTest.FrameworkReregister (5 ms)
[ RUN      ] FaultToleranceTest.SchedulerFailoverStatusUpdate
[       OK ] FaultToleranceTest.SchedulerFailoverStatusUpdate (10 ms)
[ RUN      ] FaultToleranceTest.SchedulerFailoverFrameworkMessage
[       OK ] FaultToleranceTest.SchedulerFailoverFrameworkMessage (8 ms)
[ RUN      ] FaultToleranceTest.SchedulerExit
[       OK ] FaultToleranceTest.SchedulerExit (10 ms)
[ RUN      ] FaultToleranceTest.SlaveReliableRegistration
[       OK ] FaultToleranceTest.SlaveReliableRegistration (3 ms)
[ RUN      ] FaultToleranceTest.SlaveReregister
[       OK ] FaultToleranceTest.SlaveReregister (3 ms)
[----------] 10 tests from FaultToleranceTest (63 ms total)

[----------] 8 tests from ResourceOffersTest
[ RUN      ] ResourceOffersTest.ResourceOfferWithMultipleSlaves
[       OK ] ResourceOffersTest.ResourceOfferWithMultipleSlaves (21 ms)
[ RUN      ] ResourceOffersTest.TaskUsesNoResources
[       OK ] ResourceOffersTest.TaskUsesNoResources (6 ms)
[ RUN      ] ResourceOffersTest.TaskUsesInvalidResources
[       OK ] ResourceOffersTest.TaskUsesInvalidResources (4 ms)
[ RUN      ] ResourceOffersTest.TaskUsesMoreResourcesThanOffered
[       OK ] ResourceOffersTest.TaskUsesMoreResourcesThanOffered (4 ms)
[ RUN      ] ResourceOffersTest.ResourcesGetReofferedWhenUnused
[       OK ] ResourceOffersTest.ResourcesGetReofferedWhenUnused (5 ms)
[ RUN      ] ResourceOffersTest.ResourcesGetReofferedAfterTaskInfoError
[       OK ] ResourceOffersTest.ResourcesGetReofferedAfterTaskInfoError (6 ms)
[ RUN      ] ResourceOffersTest.Request
[       OK ] ResourceOffersTest.Request (5 ms)
[ RUN      ] ResourceOffersTest.TasksExecutorInfoDiffers
[       OK ] ResourceOffersTest.TasksExecutorInfoDiffers (8 ms)
[----------] 8 tests from ResourceOffersTest (59 ms total)

[----------] 2 tests from SlaveTest
[ RUN      ] SlaveTest.GarbageCollectSlaveDirs
[       OK ] SlaveTest.GarbageCollectSlaveDirs (41 ms)
[ RUN      ] SlaveTest.GarbageCollectExecutorDir
../../src/tests/slave_tests.cpp:346: Failure
Value of: utils::os::exists(executorDir)
  Actual: true
Expected: false

GMOCK WARNING:
Uninteresting mock function call - returning directly.
    Function call: slaveLost(0x2b988c0ee810, @0x2b98900b8610 201207110721-453759884-39797-14149-0)
Stack trace:
[  FAILED  ] SlaveTest.GarbageCollectExecutorDir (24 ms)
[----------] 2 tests from SlaveTest (65 ms total)

[----------] 3 tests from LevelDBStateTest
[ RUN      ] LevelDBStateTest.GetSetGet
[       OK ] LevelDBStateTest.GetSetGet (6 ms)
[ RUN      ] LevelDBStateTest.GetSetSetGet
[       OK ] LevelDBStateTest.GetSetSetGet (7 ms)
[ RUN      ] LevelDBStateTest.GetGetSetSetGet
[       OK ] LevelDBStateTest.GetGetSetSetGet (11 ms)
[----------] 3 tests from LevelDBStateTest (25 ms total)

[----------] 3 tests from ZooKeeperStateTest
[ RUN      ] ZooKeeperStateTest.GetSetGet
[       OK ] ZooKeeperStateTest.GetSetGet (20 ms)
[ RUN      ] ZooKeeperStateTest.GetSetSetGet
[       OK ] ZooKeeperStateTest.GetSetSetGet (23 ms)
[ RUN      ] ZooKeeperStateTest.GetGetSetSetGet
[       OK ] ZooKeeperStateTest.GetGetSetSetGet (35 ms)
[----------] 3 tests from ZooKeeperStateTest (78 ms total)

[----------] 7 tests from MasterTest
[ RUN      ] MasterTest.TaskRunning
[       OK ] MasterTest.TaskRunning (12 ms)
[ RUN      ] MasterTest.KillTask
[       OK ] MasterTest.KillTask (11 ms)
[ RUN      ] MasterTest.FrameworkMessage
[       OK ] MasterTest.FrameworkMessage (10 ms)
[ RUN      ] MasterTest.MultipleExecutors
[       OK ] MasterTest.MultipleExecutors (13 ms)
[ RUN      ] MasterTest.MasterInfo
[       OK ] MasterTest.MasterInfo (2 ms)
[ RUN      ] MasterTest.MasterInfoOnReElection
[       OK ] MasterTest.MasterInfoOnReElection (3 ms)
[ RUN      ] MasterTest.MasterLost
[       OK ] MasterTest.MasterLost (2 ms)
[----------] 7 tests from MasterTest (53 ms total)

[----------] 1 test from WhitelistFixture
[ RUN      ] WhitelistFixture.WhitelistSlave
[       OK ] WhitelistFixture.WhitelistSlave (3 ms)
[----------] 1 test from WhitelistFixture (3 ms total)

[----------] 5 tests from FrameworksManagerTestFixture
[ RUN      ] FrameworksManagerTestFixture.AddFramework
[       OK ] FrameworksManagerTestFixture.AddFramework (2 ms)
[ RUN      ] FrameworksManagerTestFixture.RemoveFramework
[       OK ] FrameworksManagerTestFixture.RemoveFramework (3 ms)
[ RUN      ] FrameworksManagerTestFixture.ResurrectFramework
[       OK ] FrameworksManagerTestFixture.ResurrectFramework (2 ms)
[ RUN      ] FrameworksManagerTestFixture.ResurrectExpiringFramework
[       OK ] FrameworksManagerTestFixture.ResurrectExpiringFramework (3 ms)
[ RUN      ] FrameworksManagerTestFixture.ResurrectInterspersedExpiringFrameworks
[       OK ] FrameworksManagerTestFixture.ResurrectInterspersedExpiringFrameworks (3 ms)
[----------] 5 tests from FrameworksManagerTestFixture (13 ms total)

[----------] 1 test from FrameworksManagerTest
[ RUN      ] FrameworksManagerTest.CacheFailure
E0711 07:21:13.389710 14255 frameworks_manager.cpp:213] Error getting framework info from
underlying storage: Fake Caching Error.
E0711 07:21:13.390769 14237 frameworks_manager.cpp:213] Error getting framework info from
underlying storage: Fake Caching Error.
[       OK ] FrameworksManagerTest.CacheFailure (3 ms)
[----------] 1 test from FrameworksManagerTest (3 ms total)

[----------] Global test environment tear-down
[==========] 181 tests from 36 test cases ran. (35661 ms total)
[  PASSED  ] 180 tests.
[  FAILED  ] 1 test, listed below:
[  FAILED  ] SlaveTest.GarbageCollectExecutorDir

 1 FAILED TEST
  YOU HAVE 6 DISABLED TESTS

FAIL: mesos-tests
==================
1 of 1 test failed
==================
make[3]: *** [check-TESTS] Error 1
make[3]: Leaving directory `/x1/jenkins/jenkins-slave/workspace/Mesos-Trunk-Ubuntu-Build-Out-Of-Src-Set-JAVA_HOME/build/src'
make[2]: *** [check-am] Error 2
make[2]: Leaving directory `/x1/jenkins/jenkins-slave/workspace/Mesos-Trunk-Ubuntu-Build-Out-Of-Src-Set-JAVA_HOME/build/src'
make[1]: *** [check] Error 2
make[1]: Leaving directory `/x1/jenkins/jenkins-slave/workspace/Mesos-Trunk-Ubuntu-Build-Out-Of-Src-Set-JAVA_HOME/build/src'
make: *** [check-recursive] Error 1
Build step 'Execute shell' marked build as failure

Mime
View raw message