mesos-dev mailing list archives

Site index · List index
Message view « Date » · « Thread »
Top « Date » · « Thread »
From Apache Jenkins Server <jenk...@builds.apache.org>
Subject Build failed in Jenkins: Mesos-Trunk-Ubuntu-Build-In-Src-Set-JAVA_HOME #126
Date Mon, 14 May 2012 18:18:52 GMT
See <https://builds.apache.org/job/Mesos-Trunk-Ubuntu-Build-In-Src-Set-JAVA_HOME/126/changes>

Changes:

[benh] Minor code cleanup (https://reviews.apache.org/r/4979).

------------------------------------------
[...truncated 3291 lines...]
[       OK ] StringsTest.SplitWithMultipleDelims (0 ms)
[ RUN      ] StringsTest.Pairs
[       OK ] StringsTest.Pairs (0 ms)
[----------] 11 tests from StringsTest (0 ms total)

[----------] 8 tests from ConfiguratorTest
[ RUN      ] ConfiguratorTest.Environment
[       OK ] ConfiguratorTest.Environment (0 ms)
[ RUN      ] ConfiguratorTest.DefaultOptions
[       OK ] ConfiguratorTest.DefaultOptions (0 ms)
[ RUN      ] ConfiguratorTest.CommandLine
[       OK ] ConfiguratorTest.CommandLine (1 ms)
[ RUN      ] ConfiguratorTest.ConfigFileWithConfDir
[       OK ] ConfiguratorTest.ConfigFileWithConfDir (12 ms)
[ RUN      ] ConfiguratorTest.CommandLineConfFlag
[       OK ] ConfiguratorTest.CommandLineConfFlag (12 ms)
[ RUN      ] ConfiguratorTest.LoadingPriorities
[       OK ] ConfiguratorTest.LoadingPriorities (13 ms)
[ RUN      ] ConfiguratorTest.ConfigFileSpacesIgnored
[       OK ] ConfiguratorTest.ConfigFileSpacesIgnored (12 ms)
[ RUN      ] ConfiguratorTest.MalformedConfigFile
[       OK ] ConfiguratorTest.MalformedConfigFile (13 ms)
[----------] 8 tests from ConfiguratorTest (63 ms total)

[----------] 5 tests from SampleFrameworks
[ RUN      ] SampleFrameworks.CppFramework
[       OK ] SampleFrameworks.CppFramework (5376 ms)
[ RUN      ] SampleFrameworks.NoExecutorFramework
[       OK ] SampleFrameworks.NoExecutorFramework (1475 ms)
[ RUN      ] SampleFrameworks.JavaFramework
[       OK ] SampleFrameworks.JavaFramework (1588 ms)
[ RUN      ] SampleFrameworks.JavaExceptionFramework
[       OK ] SampleFrameworks.JavaExceptionFramework (190 ms)
[ RUN      ] SampleFrameworks.PythonFramework
[       OK ] SampleFrameworks.PythonFramework (1624 ms)
[----------] 5 tests from SampleFrameworks (10253 ms total)

[----------] 1 test from UUIDTest
[ RUN      ] UUIDTest.test
[       OK ] UUIDTest.test (1 ms)
[----------] 1 test from UUIDTest (1 ms total)

[----------] 23 tests from ResourcesTest
[ RUN      ] ResourcesTest.Parsing
[       OK ] ResourcesTest.Parsing (0 ms)
[ RUN      ] ResourcesTest.Printing
[       OK ] ResourcesTest.Printing (0 ms)
[ RUN      ] ResourcesTest.InitializedIsEmpty
[       OK ] ResourcesTest.InitializedIsEmpty (0 ms)
[ RUN      ] ResourcesTest.BadResourcesNotAllocatable
[       OK ] ResourcesTest.BadResourcesNotAllocatable (1 ms)
[ RUN      ] ResourcesTest.ScalarEquals
[       OK ] ResourcesTest.ScalarEquals (0 ms)
[ RUN      ] ResourcesTest.ScalarSubset
[       OK ] ResourcesTest.ScalarSubset (0 ms)
[ RUN      ] ResourcesTest.ScalarAddition
[       OK ] ResourcesTest.ScalarAddition (0 ms)
[ RUN      ] ResourcesTest.ScalarSubtraction
[       OK ] ResourcesTest.ScalarSubtraction (0 ms)
[ RUN      ] ResourcesTest.RangesEquals
[       OK ] ResourcesTest.RangesEquals (0 ms)
[ RUN      ] ResourcesTest.RangesSubset
[       OK ] ResourcesTest.RangesSubset (0 ms)
[ RUN      ] ResourcesTest.RangesAddition
[       OK ] ResourcesTest.RangesAddition (0 ms)
[ RUN      ] ResourcesTest.RangesAddition2
[       OK ] ResourcesTest.RangesAddition2 (0 ms)
[ RUN      ] ResourcesTest.RangesSubtraction
[       OK ] ResourcesTest.RangesSubtraction (0 ms)
[ RUN      ] ResourcesTest.RangesSubtraction1
[       OK ] ResourcesTest.RangesSubtraction1 (0 ms)
[ RUN      ] ResourcesTest.RangesSubtraction2
[       OK ] ResourcesTest.RangesSubtraction2 (0 ms)
[ RUN      ] ResourcesTest.RangesSubtraction3
[       OK ] ResourcesTest.RangesSubtraction3 (0 ms)
[ RUN      ] ResourcesTest.RangesSubtraction4
[       OK ] ResourcesTest.RangesSubtraction4 (0 ms)
[ RUN      ] ResourcesTest.RangesSubtraction5
[       OK ] ResourcesTest.RangesSubtraction5 (0 ms)
[ RUN      ] ResourcesTest.SetEquals
[       OK ] ResourcesTest.SetEquals (0 ms)
[ RUN      ] ResourcesTest.SetSubset
[       OK ] ResourcesTest.SetSubset (0 ms)
[ RUN      ] ResourcesTest.SetAddition
[       OK ] ResourcesTest.SetAddition (0 ms)
[ RUN      ] ResourcesTest.SetSubtraction
[       OK ] ResourcesTest.SetSubtraction (0 ms)
[ RUN      ] ResourcesTest.EmptyUnequal
[       OK ] ResourcesTest.EmptyUnequal (0 ms)
[----------] 23 tests from ResourcesTest (1 ms total)

[----------] 3 tests from ReplicaTest
[ RUN      ] ReplicaTest.Promise
[       OK ] ReplicaTest.Promise (28 ms)
[ RUN      ] ReplicaTest.Append
[       OK ] ReplicaTest.Append (27 ms)
[ RUN      ] ReplicaTest.Recover
[       OK ] ReplicaTest.Recover (40 ms)
[----------] 3 tests from ReplicaTest (95 ms total)

[----------] 17 tests from CoordinatorTest
[ RUN      ] CoordinatorTest.Elect
[       OK ] CoordinatorTest.Elect (37 ms)
[ RUN      ] CoordinatorTest.AppendRead
[       OK ] CoordinatorTest.AppendRead (61 ms)
[ RUN      ] CoordinatorTest.AppendReadError
[       OK ] CoordinatorTest.AppendReadError (54 ms)
[ RUN      ] CoordinatorTest.Failover
[       OK ] CoordinatorTest.Failover (43 ms)
[ RUN      ] CoordinatorTest.Demoted
[       OK ] CoordinatorTest.Demoted (67 ms)
[ RUN      ] CoordinatorTest.Fill
[       OK ] CoordinatorTest.Fill (75 ms)
[ RUN      ] CoordinatorTest.NotLearnedFill
[       OK ] CoordinatorTest.NotLearnedFill (76 ms)
[ RUN      ] CoordinatorTest.MultipleAppends
[       OK ] CoordinatorTest.MultipleAppends (83 ms)
[ RUN      ] CoordinatorTest.MultipleAppendsNotLearnedFill
[       OK ] CoordinatorTest.MultipleAppendsNotLearnedFill (141 ms)
[ RUN      ] CoordinatorTest.Truncate
[       OK ] CoordinatorTest.Truncate (74 ms)
[ RUN      ] CoordinatorTest.TruncateNotLearnedFill
[       OK ] CoordinatorTest.TruncateNotLearnedFill (182 ms)
[ RUN      ] CoordinatorTest.TruncateLearnedFill
E0514 18:18:51.876816  6174 replica.cpp:736] Error getting log record at 0: Attempted to read
truncated position
E0514 18:18:51.881074  6177 replica.cpp:736] Error getting log record at 1: Attempted to read
truncated position
E0514 18:18:51.884501  6178 replica.cpp:736] Error getting log record at 2: Attempted to read
truncated position
E0514 18:18:51.887959  6177 replica.cpp:736] Error getting log record at 3: Attempted to read
truncated position
E0514 18:18:51.891443  6176 replica.cpp:736] Error getting log record at 4: Attempted to read
truncated position
E0514 18:18:51.894428  6176 replica.cpp:736] Error getting log record at 5: Attempted to read
truncated position
E0514 18:18:51.897810  6179 replica.cpp:736] Error getting log record at 6: Attempted to read
truncated position
[       OK ] CoordinatorTest.TruncateLearnedFill (138 ms)
[ RUN      ] CoordinatorTest.RacingElect
[       OK ] CoordinatorTest.RacingElect (0 ms)
[ RUN      ] CoordinatorTest.FillNoQuorum
[       OK ] CoordinatorTest.FillNoQuorum (0 ms)
[ RUN      ] CoordinatorTest.FillInconsistent
[       OK ] CoordinatorTest.FillInconsistent (0 ms)
[ RUN      ] CoordinatorTest.LearnedOnOneReplica_NotLearnedOnAnother
[       OK ] CoordinatorTest.LearnedOnOneReplica_NotLearnedOnAnother (0 ms)
[ RUN      ] CoordinatorTest.LearnedOnOneReplica_NotLearnedOnAnother_AnotherFailsAndRecovers
[       OK ] CoordinatorTest.LearnedOnOneReplica_NotLearnedOnAnother_AnotherFailsAndRecovers
(0 ms)
[----------] 17 tests from CoordinatorTest (1032 ms total)

[----------] 2 tests from LogTest
[ RUN      ] LogTest.WriteRead
[       OK ] LogTest.WriteRead (37 ms)
[ RUN      ] LogTest.Position
[       OK ] LogTest.Position (35 ms)
[----------] 2 tests from LogTest (73 ms total)

[----------] 9 tests from FaultToleranceTest
[ RUN      ] FaultToleranceTest.SlaveLost
[       OK ] FaultToleranceTest.SlaveLost (1 ms)
[ RUN      ] FaultToleranceTest.SlavePartitioned
[       OK ] FaultToleranceTest.SlavePartitioned (7 ms)
[ RUN      ] FaultToleranceTest.SchedulerFailover
[       OK ] FaultToleranceTest.SchedulerFailover (2 ms)
[ RUN      ] FaultToleranceTest.FrameworkReliableRegistration
[       OK ] FaultToleranceTest.FrameworkReliableRegistration (2 ms)
[ RUN      ] FaultToleranceTest.FrameworkReregister
[       OK ] FaultToleranceTest.FrameworkReregister (2 ms)
[ RUN      ] FaultToleranceTest.SchedulerFailoverStatusUpdate
[       OK ] FaultToleranceTest.SchedulerFailoverStatusUpdate (8 ms)
[ RUN      ] FaultToleranceTest.SchedulerFailoverFrameworkMessage
[       OK ] FaultToleranceTest.SchedulerFailoverFrameworkMessage (6 ms)
[ RUN      ] FaultToleranceTest.SlaveReliableRegistration
[       OK ] FaultToleranceTest.SlaveReliableRegistration (2 ms)
[ RUN      ] FaultToleranceTest.SlaveReregister
[       OK ] FaultToleranceTest.SlaveReregister (2 ms)
[----------] 9 tests from FaultToleranceTest (32 ms total)

[----------] 8 tests from ResourceOffersTest
[ RUN      ] ResourceOffersTest.ResourceOfferWithMultipleSlaves
[       OK ] ResourceOffersTest.ResourceOfferWithMultipleSlaves (9 ms)
[ RUN      ] ResourceOffersTest.TaskUsesNoResources
[       OK ] ResourceOffersTest.TaskUsesNoResources (4 ms)
[ RUN      ] ResourceOffersTest.TaskUsesInvalidResources
[       OK ] ResourceOffersTest.TaskUsesInvalidResources (3 ms)
[ RUN      ] ResourceOffersTest.TaskUsesMoreResourcesThanOffered
[       OK ] ResourceOffersTest.TaskUsesMoreResourcesThanOffered (3 ms)
[ RUN      ] ResourceOffersTest.ResourcesGetReofferedWhenUnused
[       OK ] ResourceOffersTest.ResourcesGetReofferedWhenUnused (2 ms)
[ RUN      ] ResourceOffersTest.ResourcesGetReofferedAfterTaskInfoError
[       OK ] ResourceOffersTest.ResourcesGetReofferedAfterTaskInfoError (4 ms)
[ RUN      ] ResourceOffersTest.Request
[       OK ] ResourceOffersTest.Request (2 ms)
[ RUN      ] ResourceOffersTest.TasksExecutorInfoDiffers
[       OK ] ResourceOffersTest.TasksExecutorInfoDiffers (4 ms)
[----------] 8 tests from ResourceOffersTest (31 ms total)

[----------] 7 tests from MasterTest
[ RUN      ] MasterTest.TaskRunning
[       OK ] MasterTest.TaskRunning (6 ms)
[ RUN      ] MasterTest.KillTask
[       OK ] MasterTest.KillTask (5 ms)
[ RUN      ] MasterTest.FrameworkMessage
[       OK ] MasterTest.FrameworkMessage (6 ms)
[ RUN      ] MasterTest.MultipleExecutors
[       OK ] MasterTest.MultipleExecutors (8 ms)
[ RUN      ] MasterTest.MasterInfo
[       OK ] MasterTest.MasterInfo (1 ms)
[ RUN      ] MasterTest.MasterInfoOnReElection
[       OK ] MasterTest.MasterInfoOnReElection (2 ms)
[ RUN      ] MasterTest.MasterLost
[       OK ] MasterTest.MasterLost (2 ms)
[----------] 7 tests from MasterTest (30 ms total)

[----------] 5 tests from FrameworksManagerTestFixture
[ RUN      ] FrameworksManagerTestFixture.AddFramework
[       OK ] FrameworksManagerTestFixture.AddFramework (1 ms)
[ RUN      ] FrameworksManagerTestFixture.RemoveFramework
[       OK ] FrameworksManagerTestFixture.RemoveFramework (3 ms)
[ RUN      ] FrameworksManagerTestFixture.ResurrectFramework
[       OK ] FrameworksManagerTestFixture.ResurrectFramework (1 ms)
[ RUN      ] FrameworksManagerTestFixture.ResurrectExpiringFramework
[       OK ] FrameworksManagerTestFixture.ResurrectExpiringFramework (2 ms)
[ RUN      ] FrameworksManagerTestFixture.ResurrectInterspersedExpiringFrameworks
[       OK ] FrameworksManagerTestFixture.ResurrectInterspersedExpiringFrameworks (2 ms)
[----------] 5 tests from FrameworksManagerTestFixture (9 ms total)

[----------] 1 test from FrameworksManagerTest
[ RUN      ] FrameworksManagerTest.CacheFailure
E0514 18:18:52.096087  6174 frameworks_manager.cpp:213] Error getting framework info from
underlying storage: Fake Caching Error.
E0514 18:18:52.096796  6173 frameworks_manager.cpp:213] Error getting framework info from
underlying storage: Fake Caching Error.
[       OK ] FrameworksManagerTest.CacheFailure (2 ms)
[----------] 1 test from FrameworksManagerTest (2 ms total)

[----------] Global test environment tear-down
[==========] 123 tests from 23 test cases ran. (32949 ms total)
[  PASSED  ] 122 tests.
[  FAILED  ] 1 test, listed below:
[  FAILED  ] ZooKeeperTest.GroupCancelWithDisconnect

 1 FAILED TEST
  YOU HAVE 6 DISABLED TESTS

FAIL: mesos-tests
==================
1 of 1 test failed
==================
make[3]: *** [check-TESTS] Error 1
make[3]: Leaving directory `<https://builds.apache.org/job/Mesos-Trunk-Ubuntu-Build-In-Src-Set-JAVA_HOME/ws/src'>
make[2]: *** [check-am] Error 2
make[2]: Leaving directory `<https://builds.apache.org/job/Mesos-Trunk-Ubuntu-Build-In-Src-Set-JAVA_HOME/ws/src'>
make[1]: *** [check] Error 2
make[1]: Leaving directory `<https://builds.apache.org/job/Mesos-Trunk-Ubuntu-Build-In-Src-Set-JAVA_HOME/ws/src'>
make: *** [check-recursive] Error 1
Build step 'Execute shell' marked build as failure

Mime
View raw message