mesos-dev mailing list archives

Site index · List index
Message view « Date » · « Thread »
Top « Date » · « Thread »
From Apache Jenkins Server <jenk...@builds.apache.org>
Subject Build failed in Jenkins: Mesos-Trunk-Ubuntu-Build-In-Src-Set-JAVA_HOME #83
Date Thu, 15 Mar 2012 23:36:15 GMT
See <https://builds.apache.org/job/Mesos-Trunk-Ubuntu-Build-In-Src-Set-JAVA_HOME/83/changes>

Changes:

[benh] Factored out realpath, used to construct path for 'mesos-executor'.

[benh] Adding support to retrieve files (uri's) via HTTP/FTP (contributed by Florian Leibert).

------------------------------------------
[...truncated 209 lines...]
checking dependency style of g++... gcc3
checking how to run the C++ preprocessor... g++ -E
checking for ld used by g++... /usr/bin/ld
checking if the linker (/usr/bin/ld) is GNU ld... yes
checking whether the g++ linker (/usr/bin/ld) supports shared libraries... yes
checking for g++ option to produce PIC... -fPIC -DPIC
checking if g++ PIC flag -fPIC -DPIC works... yes
checking if g++ static flag -static works... yes
checking if g++ supports -c -o file.o... yes
checking if g++ supports -c -o file.o... (cached) yes
checking whether the g++ linker (/usr/bin/ld) supports shared libraries... yes
checking dynamic linker characteristics... GNU/Linux ld.so
checking how to hardcode library paths into programs... immediate
configure: creating ./config.lt
config.lt: creating libtool
===========================================================
Setting up build environment for x86_64 linux-gnu
===========================================================
checking whether we are using the GNU C++ compiler... (cached) yes
checking whether g++ accepts -g... (cached) yes
checking dependency style of g++... (cached) gcc3
checking whether we are using the GNU C compiler... (cached) yes
checking whether gcc accepts -g... (cached) yes
checking for gcc option to accept ISO C89... (cached) none needed
checking dependency style of gcc... (cached) gcc3
checking for the pthreads library -lpthreads... no
checking whether pthreads work without any flags... yes
checking for joinable pthread attribute... PTHREAD_CREATE_JOINABLE
checking if more special flags are required for pthreads... no
checking whether to check for GCC pthread/shared inconsistencies... yes
checking whether -pthread is sufficient with -shared... no
checking whether -lpthread fixes that... yes
checking whether or not we can build using the JDK... yes
checking for python... /usr/bin/python
checking for python version... 2.6
checking for python platform... linux2
checking for python script directory... ${prefix}/lib/python2.6/dist-packages
checking for python extension module directory... ${exec_prefix}/lib/python2.6/dist-packages
configure: creating ./config.status
config.status: creating Makefile
config.status: creating src/Makefile
config.status: creating third_party/Makefile
config.status: creating bin/mesos-build-env.sh
config.status: creating bin/mesos-local.sh
config.status: creating bin/mesos-master.sh
config.status: creating bin/mesos-slave.sh
config.status: creating bin/mesos-tests.sh
config.status: creating bin/gdb-mesos-local.sh
config.status: creating bin/gdb-mesos-master.sh
config.status: creating bin/gdb-mesos-slave.sh
config.status: creating bin/gdb-mesos-tests.sh
config.status: creating include/mesos/mesos.hpp
config.status: creating src/java/generated/org/apache/mesos/MesosNativeLibrary.java
config.status: creating src/examples/java/test-exception-framework
config.status: creating src/examples/java/test-executor
config.status: creating src/examples/java/test-framework
config.status: creating src/examples/java/test-multiple-executors-framework
config.status: creating src/java/mesos.pom
config.status: creating src/examples/python/test-executor
config.status: creating src/examples/python/test-framework
config.status: creating src/python/setup.py
config.status: executing depfiles commands
config.status: executing libtool commands
=== configuring in third_party/libprocess (<https://builds.apache.org/job/Mesos-Trunk-Ubuntu-Build-In-Src-Set-JAVA_HOME/ws/third_party/libprocess)>
configure: running /bin/bash ./configure --disable-option-checking '--prefix=/usr/local' 
'JAVA_HOME=/home/jenkins/tools/java/jdk1.6.0_20-64' '--enable-shared=no' '--with-pic' --cache-file=/dev/null
--srcdir=.
checking build system type... x86_64-unknown-linux-gnu
checking host system type... x86_64-unknown-linux-gnu
checking target system type... x86_64-unknown-linux-gnu
checking for a BSD-compatible install... /usr/bin/install -c
checking whether build environment is sane... yes
checking for a thread-safe mkdir -p... /bin/mkdir -p
checking for gawk... no
checking for mawk... mawk
checking whether make sets $(MAKE)... yes
checking for style of include used by make... GNU
checking for gcc... gcc
checking whether the C compiler works... yes
checking for C compiler default output file name... a.out
checking for suffix of executables... 
checking whether we are cross compiling... no
checking for suffix of object files... o
checking whether we are using the GNU C compiler... yes
checking whether gcc accepts -g... yes
checking for gcc option to accept ISO C89... none needed
checking dependency style of gcc... gcc3
checking for a sed that does not truncate output... /bin/sed
checking for grep that handles long lines and -e... /bin/grep
checking for egrep... /bin/grep -E
checking for fgrep... /bin/grep -F
checking for ld used by gcc... /usr/bin/ld
checking if the linker (/usr/bin/ld) is GNU ld... yes
checking for BSD- or MS-compatible name lister (nm)... /usr/bin/nm -B
checking the name lister (/usr/bin/nm -B) interface... BSD nm
checking whether ln -s works... yes
checking the maximum length of command line arguments... 1966080
checking whether the shell understands some XSI constructs... yes
checking whether the shell understands "+="... yes
checking for /usr/bin/ld option to reload object files... -r
checking for objdump... objdump
checking how to recognize dependent libraries... pass_all
checking for ar... ar
checking for strip... strip
checking for ranlib... ranlib
checking command to parse /usr/bin/nm -B output from gcc object... failed
checking how to run the C preprocessor... gcc -E
checking for ANSI C header files... yes
checking for sys/types.h... yes
checking for sys/stat.h... yes
checking for stdlib.h... yes
checking for string.h... yes
checking for memory.h... yes
checking for strings.h... yes
checking for inttypes.h... yes
checking for stdint.h... yes
checking for unistd.h... yes
checking for dlfcn.h... yes
checking for objdir... .libs
checking if gcc supports -fno-rtti -fno-exceptions... no
checking for gcc option to produce PIC... -fPIC -DPIC
checking if gcc PIC flag -fPIC -DPIC works... yes
checking if gcc static flag -static works... yes
checking if gcc supports -c -o file.o... yes
checking if gcc supports -c -o file.o... (cached) yes
checking whether the gcc linker (/usr/bin/ld) supports shared libraries... yes
checking dynamic linker characteristics... GNU/Linux ld.so
checking how to hardcode library paths into programs... immediate
checking whether stripping libraries is possible... yes
checking if libtool supports shared libraries... yes
checking whether to build shared libraries... no
checking whether to build static libraries... yes
checking for g++... g++
checking whether we are using the GNU C++ compiler... yes
checking whether g++ accepts -g... yes
checking dependency style of g++... gcc3
checking how to run the C++ preprocessor... g++ -E
checking for ld used by g++... /usr/bin/ld
checking if the linker (/usr/bin/ld) is GNU ld... yes
checking whether the g++ linker (/usr/bin/ld) supports shared libraries... yes
checking for g++ option to produce PIC... -fPIC -DPIC
checking if g++ PIC flag -fPIC -DPIC works... yes
checking if g++ static flag -static works... yes
checking if g++ supports -c -o file.o... yes
checking if g++ supports -c -o file.o... (cached) yes
checking whether the g++ linker (/usr/bin/ld) supports shared libraries... yes
checking dynamic linker characteristics... GNU/Linux ld.so
checking how to hardcode library paths into programs... immediate
configure: creating ./config.lt
config.lt: creating libtool
checking whether we are using the GNU C++ compiler... (cached) yes
checking whether g++ accepts -g... (cached) yes
checking dependency style of g++... (cached) gcc3
checking whether we are using the GNU C compiler... (cached) yes
checking whether gcc accepts -g... (cached) yes
checking for gcc option to accept ISO C89... (cached) none needed
checking dependency style of gcc... (cached) gcc3
checking for the pthreads library -lpthreads... no
checking whether pthreads work without any flags... no
checking whether pthreads work with -Kthread... no
checking whether pthreads work with -kthread... no
checking for the pthreads library -llthread... no
checking whether pthreads work with -pthread... yes
checking for joinable pthread attribute... PTHREAD_CREATE_JOINABLE
checking if more special flags are required for pthreads... no
checking whether to check for GCC pthread/shared inconsistencies... yes
checking whether -pthread is sufficient with -shared... yes
configure: creating ./config.status
config.status: creating Makefile
config.status: creating third_party/Makefile
config.status: executing depfiles commands
config.status: executing libtool commands
+ make
Making all in .
make[1]: Entering directory `<https://builds.apache.org/job/Mesos-Trunk-Ubuntu-Build-In-Src-Set-JAVA_HOME/ws/'>
make[1]: Nothing to be done for `all-am'.
make[1]: Leaving directory `<https://builds.apache.org/job/Mesos-Trunk-Ubuntu-Build-In-Src-Set-JAVA_HOME/ws/'>
Making all in third_party
make[1]: Entering directory `<https://builds.apache.org/job/Mesos-Trunk-Ubuntu-Build-In-Src-Set-JAVA_HOME/ws/third_party'>
make  all-recursive
make[2]: Entering directory `<https://builds.apache.org/job/Mesos-Trunk-Ubuntu-Build-In-Src-Set-JAVA_HOME/ws/third_party'>
Making all in libprocess
make[3]: Entering directory `<https://builds.apache.org/job/Mesos-Trunk-Ubuntu-Build-In-Src-Set-JAVA_HOME/ws/third_party/libprocess'>
Making all in third_party
make[4]: Entering directory `<https://builds.apache.org/job/Mesos-Trunk-Ubuntu-Build-In-Src-Set-JAVA_HOME/ws/third_party/libprocess/third_party'>
make  all-am
make[5]: Entering directory `<https://builds.apache.org/job/Mesos-Trunk-Ubuntu-Build-In-Src-Set-JAVA_HOME/ws/third_party/libprocess/third_party'>
make[5]: Nothing to be done for `all-am'.
make[5]: Leaving directory `<https://builds.apache.org/job/Mesos-Trunk-Ubuntu-Build-In-Src-Set-JAVA_HOME/ws/third_party/libprocess/third_party'>
make[4]: Leaving directory `<https://builds.apache.org/job/Mesos-Trunk-Ubuntu-Build-In-Src-Set-JAVA_HOME/ws/third_party/libprocess/third_party'>
Making all in .
make[4]: Entering directory `<https://builds.apache.org/job/Mesos-Trunk-Ubuntu-Build-In-Src-Set-JAVA_HOME/ws/third_party/libprocess'>
make[4]: Nothing to be done for `all-am'.
make[4]: Leaving directory `<https://builds.apache.org/job/Mesos-Trunk-Ubuntu-Build-In-Src-Set-JAVA_HOME/ws/third_party/libprocess'>
make[3]: Leaving directory `<https://builds.apache.org/job/Mesos-Trunk-Ubuntu-Build-In-Src-Set-JAVA_HOME/ws/third_party/libprocess'>
make[3]: Entering directory `<https://builds.apache.org/job/Mesos-Trunk-Ubuntu-Build-In-Src-Set-JAVA_HOME/ws/third_party'>
cd leveldb && \
          make  CC="g++" OPT="-g2 -O2 -fPIC"
make[4]: Entering directory `<https://builds.apache.org/job/Mesos-Trunk-Ubuntu-Build-In-Src-Set-JAVA_HOME/ws/third_party/leveldb'>
make[4]: Nothing to be done for `all'.
make[4]: Leaving directory `<https://builds.apache.org/job/Mesos-Trunk-Ubuntu-Build-In-Src-Set-JAVA_HOME/ws/third_party/leveldb'>
make[3]: Leaving directory `<https://builds.apache.org/job/Mesos-Trunk-Ubuntu-Build-In-Src-Set-JAVA_HOME/ws/third_party'>
make[2]: Leaving directory `<https://builds.apache.org/job/Mesos-Trunk-Ubuntu-Build-In-Src-Set-JAVA_HOME/ws/third_party'>
make[1]: Leaving directory `<https://builds.apache.org/job/Mesos-Trunk-Ubuntu-Build-In-Src-Set-JAVA_HOME/ws/third_party'>
Making all in src
make[1]: Entering directory `<https://builds.apache.org/job/Mesos-Trunk-Ubuntu-Build-In-Src-Set-JAVA_HOME/ws/src'>
Building mesos-0.9.0.jar ...
make  all-am
make[2]: Entering directory `<https://builds.apache.org/job/Mesos-Trunk-Ubuntu-Build-In-Src-Set-JAVA_HOME/ws/src'>
/bin/bash ../libtool  --tag=CXX   --mode=compile g++ -DPACKAGE_NAME=\"mesos\" -DPACKAGE_TARNAME=\"mesos\"
-DPACKAGE_VERSION=\"0.9.0\" -DPACKAGE_STRING=\"mesos\ 0.9.0\" -DPACKAGE_BUGREPORT=\"\" -DPACKAGE_URL=\"\"
-DPACKAGE=\"mesos\" -DVERSION=\"0.9.0\" -DSTDC_HEADERS=1 -DHAVE_SYS_TYPES_H=1 -DHAVE_SYS_STAT_H=1
-DHAVE_STDLIB_H=1 -DHAVE_STRING_H=1 -DHAVE_MEMORY_H=1 -DHAVE_STRINGS_H=1 -DHAVE_INTTYPES_H=1
-DHAVE_STDINT_H=1 -DHAVE_UNISTD_H=1 -DHAVE_DLFCN_H=1 -DLT_OBJDIR=\".libs/\" -DHAVE_PTHREAD=1
-DMESOS_HAS_JAVA=1 -DMESOS_HAS_PYTHON=1 -DMESOS_WEBUI=1 -I.   -DMESOS_WEBUI_DIR=\"/usr/local/share/mesos/webui\"
-DMESOS_LIBEXECDIR=\"/usr/local/libexec/mesos\" -I../include -I../third_party/libprocess/include
-I../include -I../third_party/boost-1.37.0 -I../third_party/protobuf-2.3.0/src -I../third_party/glog-0.3.1/src
-I../third_party/zookeeper-3.3.4/src/c/include -I../third_party/zookeeper-3.3.4/src/c/generated
  -g2 -O2 -MT sched/libmesos_no_third_party_la-sched.lo -MD -MP -MF sched/.deps/libmesos_no_third_party_la-sched.Tpo
-c -o sched/libmesos_no_third_party_la-sched.lo `test -f 'sched/sched.cpp' || echo './'`sched/sched.cpp
libtool: compile:  g++ -DPACKAGE_NAME=\"mesos\" -DPACKAGE_TARNAME=\"mesos\" -DPACKAGE_VERSION=\"0.9.0\"
"-DPACKAGE_STRING=\"mesos 0.9.0\"" -DPACKAGE_BUGREPORT=\"\" -DPACKAGE_URL=\"\" -DPACKAGE=\"mesos\"
-DVERSION=\"0.9.0\" -DSTDC_HEADERS=1 -DHAVE_SYS_TYPES_H=1 -DHAVE_SYS_STAT_H=1 -DHAVE_STDLIB_H=1
-DHAVE_STRING_H=1 -DHAVE_MEMORY_H=1 -DHAVE_STRINGS_H=1 -DHAVE_INTTYPES_H=1 -DHAVE_STDINT_H=1
-DHAVE_UNISTD_H=1 -DHAVE_DLFCN_H=1 -DLT_OBJDIR=\".libs/\" -DHAVE_PTHREAD=1 -DMESOS_HAS_JAVA=1
-DMESOS_HAS_PYTHON=1 -DMESOS_WEBUI=1 -I. -DMESOS_WEBUI_DIR=\"/usr/local/share/mesos/webui\"
-DMESOS_LIBEXECDIR=\"/usr/local/libexec/mesos\" -I../include -I../third_party/libprocess/include
-I../include -I../third_party/boost-1.37.0 -I../third_party/protobuf-2.3.0/src -I../third_party/glog-0.3.1/src
-I../third_party/zookeeper-3.3.4/src/c/include -I../third_party/zookeeper-3.3.4/src/c/generated
-g2 -O2 -MT sched/libmesos_no_third_party_la-sched.lo -MD -MP -MF sched/.deps/libmesos_no_third_party_la-sched.Tpo
-c sched/sched.cpp  -fPIC -DPIC -o sched/.libs/libmesos_no_third_party_la-sched.o
In file included from ./master/master.hpp:36,
                 from ./master/allocator.hpp:25,
                 from ./local/local.hpp:26,
                 from sched/sched.cpp:51:
./common/utils.hpp:36:23: error: curl/curl.h: No such file or directory
In file included from ../third_party/boost-1.37.0/boost/uuid/random_generator.hpp:12,
                 from ../third_party/boost-1.37.0/boost/uuid/uuid_generators.hpp:17,
                 from ./common/uuid.hpp:29,
                 from sched/sched.cpp:47:
../third_party/boost-1.37.0/boost/uuid/seed_rng.hpp: In member function 'void boost::uuids::detail::seed_rng::sha1_random_digest_()':
../third_party/boost-1.37.0/boost/uuid/seed_rng.hpp:153: warning: ignoring return value of
'size_t fread(void*, size_t, size_t, FILE*)', declared with attribute warn_unused_result
In file included from ./master/master.hpp:36,
                 from ./master/allocator.hpp:25,
                 from ./local/local.hpp:26,
                 from sched/sched.cpp:51:
./common/utils.hpp: In function 'Try<int> mesos::internal::utils::http::download(const
std::string&, const std::string&)':
./common/utils.hpp:665: error: 'CURL_GLOBAL_ALL' was not declared in this scope
./common/utils.hpp:665: error: 'curl_global_init' was not declared in this scope
./common/utils.hpp:666: error: 'CURL' was not declared in this scope
./common/utils.hpp:666: error: 'curl' was not declared in this scope
./common/utils.hpp:666: error: 'curl_easy_init' was not declared in this scope
./common/utils.hpp:669: error: 'curl_easy_cleanup' was not declared in this scope
./common/utils.hpp:674: error: 'CURLOPT_URL' was not declared in this scope
./common/utils.hpp:674: error: 'curl_easy_setopt' was not declared in this scope
./common/utils.hpp:675: error: 'CURLOPT_WRITEFUNCTION' was not declared in this scope
./common/utils.hpp:678: error: 'CURLOPT_WRITEDATA' was not declared in this scope
./common/utils.hpp:680: error: 'CURLcode' was not declared in this scope
./common/utils.hpp:680: error: expected ';' before 'curlErrorCode'
./common/utils.hpp:681: error: 'curlErrorCode' was not declared in this scope
./common/utils.hpp:682: error: 'curl_easy_cleanup' was not declared in this scope
./common/utils.hpp:684: error: 'curl_easy_strerror' was not declared in this scope
./common/utils.hpp:688: error: 'CURLINFO_RESPONSE_CODE' was not declared in this scope
./common/utils.hpp:688: error: 'curl_easy_getinfo' was not declared in this scope
./common/utils.hpp:689: error: 'curl_easy_cleanup' was not declared in this scope
make[2]: *** [sched/libmesos_no_third_party_la-sched.lo] Error 1
make[2]: Leaving directory `<https://builds.apache.org/job/Mesos-Trunk-Ubuntu-Build-In-Src-Set-JAVA_HOME/ws/src'>
make[1]: *** [all] Error 2
make[1]: Leaving directory `<https://builds.apache.org/job/Mesos-Trunk-Ubuntu-Build-In-Src-Set-JAVA_HOME/ws/src'>
make: *** [all-recursive] Error 1
Build step 'Execute shell' marked build as failure

Mime
View raw message