mesos-dev mailing list archives

Site index · List index
Message view « Date » · « Thread »
Top « Date » · « Thread »
From Apache Jenkins Server <jenk...@builds.apache.org>
Subject Build failed in Jenkins: Mesos-Trunk-Ubuntu-Build-In-Src-Set-JAVA_HOME #105
Date Wed, 28 Mar 2012 20:27:38 GMT
See <https://builds.apache.org/job/Mesos-Trunk-Ubuntu-Build-In-Src-Set-JAVA_HOME/105/changes>

Changes:

[benh] Updated configure.centos-5.4-64 to properly set LIBS instead of LDFLAGS.

------------------------------------------
[...truncated 1140 lines...]
[ RUN      ] ConfiguratorTest.ConfigFileSpacesIgnored
2012-03-28 20:27:26,883:3877(0x2b26dee3c700):ZOO_ERROR@handle_socket_error_msg@1579: Socket
[127.0.0.1:55359] zk retcode=-4, errno=111(Connection refused): server refused to accept the
client
[       OK ] ConfiguratorTest.ConfigFileSpacesIgnored (13 ms)
[ RUN      ] ConfiguratorTest.MalformedConfigFile
[       OK ] ConfiguratorTest.MalformedConfigFile (13 ms)
[----------] 8 tests from ConfiguratorTest (64 ms total)

[----------] 5 tests from SampleFrameworks
[ RUN      ] SampleFrameworks.CppFramework
2012-03-28 20:27:28,601:3877(0x2b26df23e700):ZOO_ERROR@handle_socket_error_msg@1579: Socket
[127.0.0.1:51906] zk retcode=-4, errno=111(Connection refused): server refused to accept the
client
2012-03-28 20:27:28,628:3877(0x2b26df841700):ZOO_ERROR@handle_socket_error_msg@1579: Socket
[127.0.0.1:39454] zk retcode=-4, errno=111(Connection refused): server refused to accept the
client
2012-03-28 20:27:28,679:3877(0x2b26dff46700):ZOO_ERROR@handle_socket_error_msg@1579: Socket
[127.0.0.1:49194] zk retcode=-4, errno=111(Connection refused): server refused to accept the
client
2012-03-28 20:27:28,723:3877(0x2b26e4401700):ZOO_ERROR@handle_socket_error_msg@1579: Socket
[127.0.0.1:37030] zk retcode=-4, errno=111(Connection refused): server refused to accept the
client
2012-03-28 20:27:28,885:3877(0x2b26dee3c700):ZOO_ERROR@handle_socket_error_msg@1579: Socket
[127.0.0.1:55359] zk retcode=-4, errno=111(Connection refused): server refused to accept the
client
2012-03-28 20:27:30,603:3877(0x2b26df23e700):ZOO_ERROR@handle_socket_error_msg@1579: Socket
[127.0.0.1:51906] zk retcode=-4, errno=111(Connection refused): server refused to accept the
client
2012-03-28 20:27:30,630:3877(0x2b26df841700):ZOO_ERROR@handle_socket_error_msg@1579: Socket
[127.0.0.1:39454] zk retcode=-4, errno=111(Connection refused): server refused to accept the
client
2012-03-28 20:27:30,681:3877(0x2b26dff46700):ZOO_ERROR@handle_socket_error_msg@1579: Socket
[127.0.0.1:49194] zk retcode=-4, errno=111(Connection refused): server refused to accept the
client
2012-03-28 20:27:30,725:3877(0x2b26e4401700):ZOO_ERROR@handle_socket_error_msg@1579: Socket
[127.0.0.1:37030] zk retcode=-4, errno=111(Connection refused): server refused to accept the
client
2012-03-28 20:27:30,887:3877(0x2b26dee3c700):ZOO_ERROR@handle_socket_error_msg@1579: Socket
[127.0.0.1:55359] zk retcode=-4, errno=111(Connection refused): server refused to accept the
client
[       OK ] SampleFrameworks.CppFramework (5361 ms)
[ RUN      ] SampleFrameworks.NoExecutorFramework
2012-03-28 20:27:32,605:3877(0x2b26df23e700):ZOO_ERROR@handle_socket_error_msg@1579: Socket
[127.0.0.1:51906] zk retcode=-4, errno=111(Connection refused): server refused to accept the
client
2012-03-28 20:27:32,631:3877(0x2b26df841700):ZOO_ERROR@handle_socket_error_msg@1579: Socket
[127.0.0.1:39454] zk retcode=-4, errno=111(Connection refused): server refused to accept the
client
2012-03-28 20:27:32,681:3877(0x2b26dff46700):ZOO_ERROR@handle_socket_error_msg@1579: Socket
[127.0.0.1:49194] zk retcode=-4, errno=111(Connection refused): server refused to accept the
client
2012-03-28 20:27:32,727:3877(0x2b26e4401700):ZOO_ERROR@handle_socket_error_msg@1579: Socket
[127.0.0.1:37030] zk retcode=-4, errno=111(Connection refused): server refused to accept the
client
2012-03-28 20:27:32,888:3877(0x2b26dee3c700):ZOO_ERROR@handle_socket_error_msg@1579: Socket
[127.0.0.1:55359] zk retcode=-4, errno=111(Connection refused): server refused to accept the
client
[       OK ] SampleFrameworks.NoExecutorFramework (1453 ms)
[ RUN      ] SampleFrameworks.JavaFramework
2012-03-28 20:27:34,608:3877(0x2b26df23e700):ZOO_ERROR@handle_socket_error_msg@1579: Socket
[127.0.0.1:51906] zk retcode=-4, errno=111(Connection refused): server refused to accept the
client
2012-03-28 20:27:34,633:3877(0x2b26df841700):ZOO_ERROR@handle_socket_error_msg@1579: Socket
[127.0.0.1:39454] zk retcode=-4, errno=111(Connection refused): server refused to accept the
client
2012-03-28 20:27:34,684:3877(0x2b26dff46700):ZOO_ERROR@handle_socket_error_msg@1579: Socket
[127.0.0.1:49194] zk retcode=-4, errno=111(Connection refused): server refused to accept the
client
2012-03-28 20:27:34,730:3877(0x2b26e4401700):ZOO_ERROR@handle_socket_error_msg@1579: Socket
[127.0.0.1:37030] zk retcode=-4, errno=111(Connection refused): server refused to accept the
client
2012-03-28 20:27:34,890:3877(0x2b26dee3c700):ZOO_ERROR@handle_socket_error_msg@1579: Socket
[127.0.0.1:55359] zk retcode=-4, errno=111(Connection refused): server refused to accept the
client
2012-03-28 20:27:36,610:3877(0x2b26df23e700):ZOO_ERROR@handle_socket_error_msg@1579: Socket
[127.0.0.1:51906] zk retcode=-4, errno=111(Connection refused): server refused to accept the
client
2012-03-28 20:27:36,635:3877(0x2b26df841700):ZOO_ERROR@handle_socket_error_msg@1579: Socket
[127.0.0.1:39454] zk retcode=-4, errno=111(Connection refused): server refused to accept the
client
2012-03-28 20:27:36,686:3877(0x2b26dff46700):ZOO_ERROR@handle_socket_error_msg@1579: Socket
[127.0.0.1:49194] zk retcode=-4, errno=111(Connection refused): server refused to accept the
client
2012-03-28 20:27:36,731:3877(0x2b26e4401700):ZOO_ERROR@handle_socket_error_msg@1579: Socket
[127.0.0.1:37030] zk retcode=-4, errno=111(Connection refused): server refused to accept the
client
2012-03-28 20:27:36,892:3877(0x2b26dee3c700):ZOO_ERROR@handle_socket_error_msg@1579: Socket
[127.0.0.1:55359] zk retcode=-4, errno=111(Connection refused): server refused to accept the
client
[       OK ] SampleFrameworks.JavaFramework (3295 ms)
[ RUN      ] SampleFrameworks.JavaExceptionFramework
[       OK ] SampleFrameworks.JavaExceptionFramework (291 ms)
[ RUN      ] SampleFrameworks.PythonFramework
tests/external_tests.cpp:64: Failure
Value of: exitCode
  Actual: 256
Expected: 0
External test PythonFramework failed
[  FAILED  ] SampleFrameworks.PythonFramework (55 ms)
[----------] 5 tests from SampleFrameworks (10455 ms total)

[----------] 1 test from UUIDTest
[ RUN      ] UUIDTest.test
[       OK ] UUIDTest.test (1 ms)
[----------] 1 test from UUIDTest (1 ms total)

[----------] 21 tests from ResourcesTest
[ RUN      ] ResourcesTest.Parsing
[       OK ] ResourcesTest.Parsing (0 ms)
[ RUN      ] ResourcesTest.Printing
[       OK ] ResourcesTest.Printing (0 ms)
[ RUN      ] ResourcesTest.InitializedIsEmpty
[       OK ] ResourcesTest.InitializedIsEmpty (0 ms)
[ RUN      ] ResourcesTest.BadResourcesNotAllocatable
[       OK ] ResourcesTest.BadResourcesNotAllocatable (0 ms)
[ RUN      ] ResourcesTest.ScalarEquals
[       OK ] ResourcesTest.ScalarEquals (0 ms)
[ RUN      ] ResourcesTest.ScalarSubset
[       OK ] ResourcesTest.ScalarSubset (0 ms)
[ RUN      ] ResourcesTest.ScalarAddition
[       OK ] ResourcesTest.ScalarAddition (0 ms)
[ RUN      ] ResourcesTest.ScalarSubtraction
[       OK ] ResourcesTest.ScalarSubtraction (0 ms)
[ RUN      ] ResourcesTest.RangesEquals
[       OK ] ResourcesTest.RangesEquals (0 ms)
[ RUN      ] ResourcesTest.RangesSubset
[       OK ] ResourcesTest.RangesSubset (0 ms)
[ RUN      ] ResourcesTest.RangesAddition
[       OK ] ResourcesTest.RangesAddition (0 ms)
[ RUN      ] ResourcesTest.RangesSubtraction
[       OK ] ResourcesTest.RangesSubtraction (0 ms)
[ RUN      ] ResourcesTest.RangesSubtraction1
[       OK ] ResourcesTest.RangesSubtraction1 (0 ms)
[ RUN      ] ResourcesTest.RangesSubtraction2
[       OK ] ResourcesTest.RangesSubtraction2 (1 ms)
[ RUN      ] ResourcesTest.RangesSubtraction3
[       OK ] ResourcesTest.RangesSubtraction3 (0 ms)
[ RUN      ] ResourcesTest.RangesSubtraction4
[       OK ] ResourcesTest.RangesSubtraction4 (0 ms)
[ RUN      ] ResourcesTest.SetEquals
[       OK ] ResourcesTest.SetEquals (0 ms)
[ RUN      ] ResourcesTest.SetSubset
[       OK ] ResourcesTest.SetSubset (0 ms)
[ RUN      ] ResourcesTest.SetAddition
[       OK ] ResourcesTest.SetAddition (0 ms)
[ RUN      ] ResourcesTest.SetSubtraction
[       OK ] ResourcesTest.SetSubtraction (0 ms)
[ RUN      ] ResourcesTest.EmptyUnequal
[       OK ] ResourcesTest.EmptyUnequal (0 ms)
[----------] 21 tests from ResourcesTest (1 ms total)

[----------] 3 tests from ReplicaTest
[ RUN      ] ReplicaTest.Promise
[       OK ] ReplicaTest.Promise (9 ms)
[ RUN      ] ReplicaTest.Append
[       OK ] ReplicaTest.Append (11 ms)
[ RUN      ] ReplicaTest.Recover
[       OK ] ReplicaTest.Recover (86 ms)
[----------] 3 tests from ReplicaTest (106 ms total)

[----------] 16 tests from CoordinatorTest
[ RUN      ] CoordinatorTest.Elect
[       OK ] CoordinatorTest.Elect (18 ms)
[ RUN      ] CoordinatorTest.AppendRead
[       OK ] CoordinatorTest.AppendRead (19 ms)
[ RUN      ] CoordinatorTest.AppendReadError
[       OK ] CoordinatorTest.AppendReadError (20 ms)
[ RUN      ] CoordinatorTest.Failover
[       OK ] CoordinatorTest.Failover (24 ms)
[ RUN      ] CoordinatorTest.Demoted
[       OK ] CoordinatorTest.Demoted (33 ms)
[ RUN      ] CoordinatorTest.Fill
[       OK ] CoordinatorTest.Fill (39 ms)
[ RUN      ] CoordinatorTest.NotLearnedFill
[       OK ] CoordinatorTest.NotLearnedFill (36 ms)
[ RUN      ] CoordinatorTest.MultipleAppends
[       OK ] CoordinatorTest.MultipleAppends (44 ms)
[ RUN      ] CoordinatorTest.MultipleAppendsNotLearnedFill
[       OK ] CoordinatorTest.MultipleAppendsNotLearnedFill (118 ms)
[ RUN      ] CoordinatorTest.Truncate
[       OK ] CoordinatorTest.Truncate (42 ms)
[ RUN      ] CoordinatorTest.TruncateNotLearnedFill
[       OK ] CoordinatorTest.TruncateNotLearnedFill (95 ms)
[ RUN      ] CoordinatorTest.RacingElect
[       OK ] CoordinatorTest.RacingElect (0 ms)
[ RUN      ] CoordinatorTest.FillNoQuorum
[       OK ] CoordinatorTest.FillNoQuorum (0 ms)
[ RUN      ] CoordinatorTest.FillInconsistent
[       OK ] CoordinatorTest.FillInconsistent (0 ms)
[ RUN      ] CoordinatorTest.LearnedOnOneReplica_NotLearnedOnAnother
[       OK ] CoordinatorTest.LearnedOnOneReplica_NotLearnedOnAnother (0 ms)
[ RUN      ] CoordinatorTest.LearnedOnOneReplica_NotLearnedOnAnother_AnotherFailsAndRecovers
[       OK ] CoordinatorTest.LearnedOnOneReplica_NotLearnedOnAnother_AnotherFailsAndRecovers
(0 ms)
[----------] 16 tests from CoordinatorTest (488 ms total)

[----------] 2 tests from LogTest
[ RUN      ] LogTest.WriteRead
[       OK ] LogTest.WriteRead (20 ms)
[ RUN      ] LogTest.Position
[       OK ] LogTest.Position (19 ms)
[----------] 2 tests from LogTest (39 ms total)

[----------] 9 tests from FaultToleranceTest
[ RUN      ] FaultToleranceTest.SlaveLost
[       OK ] FaultToleranceTest.SlaveLost (1 ms)
[ RUN      ] FaultToleranceTest.SlavePartitioned
[       OK ] FaultToleranceTest.SlavePartitioned (6 ms)
[ RUN      ] FaultToleranceTest.SchedulerFailover
[       OK ] FaultToleranceTest.SchedulerFailover (2 ms)
[ RUN      ] FaultToleranceTest.FrameworkReliableRegistration
[       OK ] FaultToleranceTest.FrameworkReliableRegistration (2 ms)
[ RUN      ] FaultToleranceTest.FrameworkReregister
[       OK ] FaultToleranceTest.FrameworkReregister (2 ms)
[ RUN      ] FaultToleranceTest.SchedulerFailoverStatusUpdate
[       OK ] FaultToleranceTest.SchedulerFailoverStatusUpdate (8 ms)
[ RUN      ] FaultToleranceTest.SchedulerFailoverFrameworkMessage
[       OK ] FaultToleranceTest.SchedulerFailoverFrameworkMessage (5 ms)
[ RUN      ] FaultToleranceTest.SlaveReliableRegistration
[       OK ] FaultToleranceTest.SlaveReliableRegistration (2 ms)
[ RUN      ] FaultToleranceTest.SlaveReregister
[       OK ] FaultToleranceTest.SlaveReregister (2 ms)
[----------] 9 tests from FaultToleranceTest (30 ms total)

[----------] 8 tests from ResourceOffersTest
[ RUN      ] ResourceOffersTest.ResourceOfferWithMultipleSlaves
[       OK ] ResourceOffersTest.ResourceOfferWithMultipleSlaves (4 ms)
[ RUN      ] ResourceOffersTest.TaskUsesNoResources
[       OK ] ResourceOffersTest.TaskUsesNoResources (3 ms)
[ RUN      ] ResourceOffersTest.TaskUsesInvalidResources
[       OK ] ResourceOffersTest.TaskUsesInvalidResources (3 ms)
[ RUN      ] ResourceOffersTest.TaskUsesMoreResourcesThanOffered
[       OK ] ResourceOffersTest.TaskUsesMoreResourcesThanOffered (3 ms)
[ RUN      ] ResourceOffersTest.ResourcesGetReofferedWhenUnused
[       OK ] ResourceOffersTest.ResourcesGetReofferedWhenUnused (2 ms)
[ RUN      ] ResourceOffersTest.ResourcesGetReofferedAfterTaskInfoError
[       OK ] ResourceOffersTest.ResourcesGetReofferedAfterTaskInfoError (4 ms)
[ RUN      ] ResourceOffersTest.Request
[       OK ] ResourceOffersTest.Request (1 ms)
[ RUN      ] ResourceOffersTest.TasksExecutorInfoDiffers
[       OK ] ResourceOffersTest.TasksExecutorInfoDiffers (4 ms)
[----------] 8 tests from ResourceOffersTest (24 ms total)

[----------] 7 tests from MasterTest
[ RUN      ] MasterTest.TaskRunning
[       OK ] MasterTest.TaskRunning (5 ms)
[ RUN      ] MasterTest.KillTask
[       OK ] MasterTest.KillTask (6 ms)
[ RUN      ] MasterTest.FrameworkMessage
[       OK ] MasterTest.FrameworkMessage (5 ms)
[ RUN      ] MasterTest.MultipleExecutors
[       OK ] MasterTest.MultipleExecutors (7 ms)
[ RUN      ] MasterTest.MasterInfo
[       OK ] MasterTest.MasterInfo (2 ms)
[ RUN      ] MasterTest.MasterInfoOnReElection
[       OK ] MasterTest.MasterInfoOnReElection (2 ms)
[ RUN      ] MasterTest.MasterLost
[       OK ] MasterTest.MasterLost (1 ms)
[----------] 7 tests from MasterTest (28 ms total)

[----------] 5 tests from FrameworksManagerTestFixture
[ RUN      ] FrameworksManagerTestFixture.AddFramework
[       OK ] FrameworksManagerTestFixture.AddFramework (2 ms)
[ RUN      ] FrameworksManagerTestFixture.RemoveFramework
[       OK ] FrameworksManagerTestFixture.RemoveFramework (2 ms)
[ RUN      ] FrameworksManagerTestFixture.ResurrectFramework
[       OK ] FrameworksManagerTestFixture.ResurrectFramework (2 ms)
[ RUN      ] FrameworksManagerTestFixture.ResurrectExpiringFramework
[       OK ] FrameworksManagerTestFixture.ResurrectExpiringFramework (2 ms)
[ RUN      ] FrameworksManagerTestFixture.ResurrectInterspersedExpiringFrameworks
[       OK ] FrameworksManagerTestFixture.ResurrectInterspersedExpiringFrameworks (2 ms)
[----------] 5 tests from FrameworksManagerTestFixture (10 ms total)

[----------] 1 test from FrameworksManagerTest
[ RUN      ] FrameworksManagerTest.CacheFailure
E0328 20:27:38.081848  3966 frameworks_manager.cpp:213] Error getting framework info from
underlying storage: Fake Caching Error.
E0328 20:27:38.082766  3965 frameworks_manager.cpp:213] Error getting framework info from
underlying storage: Fake Caching Error.
[       OK ] FrameworksManagerTest.CacheFailure (2 ms)
[----------] 1 test from FrameworksManagerTest (2 ms total)

[----------] Global test environment tear-down
[==========] 119 tests from 23 test cases ran. (25502 ms total)
[  PASSED  ] 118 tests.
[  FAILED  ] 1 test, listed below:
[  FAILED  ] SampleFrameworks.PythonFramework

 1 FAILED TEST
  YOU HAVE 6 DISABLED TESTS

FAIL: mesos-tests
==================
1 of 1 test failed
==================
make[3]: *** [check-TESTS] Error 1
make[3]: Leaving directory `<https://builds.apache.org/job/Mesos-Trunk-Ubuntu-Build-In-Src-Set-JAVA_HOME/ws/src'>
make[2]: *** [check-am] Error 2
make[2]: Leaving directory `<https://builds.apache.org/job/Mesos-Trunk-Ubuntu-Build-In-Src-Set-JAVA_HOME/ws/src'>
make[1]: *** [check] Error 2
make[1]: Leaving directory `<https://builds.apache.org/job/Mesos-Trunk-Ubuntu-Build-In-Src-Set-JAVA_HOME/ws/src'>
make: *** [check-recursive] Error 1
Build step 'Execute shell' marked build as failure

Mime
View raw message