mesos-dev mailing list archives

Site index · List index
Message view « Date » · « Thread »
Top « Date » · « Thread »
From Apache Jenkins Server <jenk...@builds.apache.org>
Subject Build failed in Jenkins: Mesos-Trunk-Ubuntu-Build-Out-Of-Src-Set-JAVA_HOME #92
Date Wed, 22 Feb 2012 23:33:29 GMT
See <https://builds.apache.org/job/Mesos-Trunk-Ubuntu-Build-Out-Of-Src-Set-JAVA_HOME/92/changes>

Changes:

[benh] Updated libprocess to use autotools and corresponding changes.

------------------------------------------
[...truncated 5346 lines...]
[       OK ] ConfiguratorTest.LoadingPriorities (11 ms)
[ RUN      ] ConfiguratorTest.ConfigFileSpacesIgnored
[       OK ] ConfiguratorTest.ConfigFileSpacesIgnored (10 ms)
[ RUN      ] ConfiguratorTest.MalformedConfigFile
[       OK ] ConfiguratorTest.MalformedConfigFile (11 ms)
[----------] 10 tests from ConfiguratorTest (74 ms total)

[----------] 4 tests from SampleFrameworks
[ RUN      ] SampleFrameworks.CppFramework
2012-02-22 23:33:15,253:1436(0x2b4b02949700):ZOO_ERROR@handle_socket_error_msg@1579: Socket
[127.0.0.1:38903] zk retcode=-4, errno=111(Connection refused): server refused to accept the
client
2012-02-22 23:33:16,945:1436(0x2b4b02d4b700):ZOO_ERROR@handle_socket_error_msg@1579: Socket
[127.0.0.1:33346] zk retcode=-4, errno=111(Connection refused): server refused to accept the
client
2012-02-22 23:33:16,965:1436(0x2b4b0334e700):ZOO_ERROR@handle_socket_error_msg@1579: Socket
[127.0.0.1:37034] zk retcode=-4, errno=111(Connection refused): server refused to accept the
client
2012-02-22 23:33:16,989:1436(0x2b4b0354f700):ZOO_ERROR@handle_socket_error_msg@1579: Socket
[127.0.0.1:51404] zk retcode=-4, errno=111(Connection refused): server refused to accept the
client
2012-02-22 23:33:17,013:1436(0x2b4b03a52700):ZOO_ERROR@handle_socket_error_msg@1579: Socket
[127.0.0.1:35701] zk retcode=-4, errno=111(Connection refused): server refused to accept the
client
2012-02-22 23:33:17,255:1436(0x2b4b02949700):ZOO_ERROR@handle_socket_error_msg@1579: Socket
[127.0.0.1:38903] zk retcode=-4, errno=111(Connection refused): server refused to accept the
client
2012-02-22 23:33:18,947:1436(0x2b4b02d4b700):ZOO_ERROR@handle_socket_error_msg@1579: Socket
[127.0.0.1:33346] zk retcode=-4, errno=111(Connection refused): server refused to accept the
client
2012-02-22 23:33:18,967:1436(0x2b4b0334e700):ZOO_ERROR@handle_socket_error_msg@1579: Socket
[127.0.0.1:37034] zk retcode=-4, errno=111(Connection refused): server refused to accept the
client
2012-02-22 23:33:18,991:1436(0x2b4b0354f700):ZOO_ERROR@handle_socket_error_msg@1579: Socket
[127.0.0.1:51404] zk retcode=-4, errno=111(Connection refused): server refused to accept the
client
2012-02-22 23:33:19,015:1436(0x2b4b03a52700):ZOO_ERROR@handle_socket_error_msg@1579: Socket
[127.0.0.1:35701] zk retcode=-4, errno=111(Connection refused): server refused to accept the
client
2012-02-22 23:33:19,257:1436(0x2b4b02949700):ZOO_ERROR@handle_socket_error_msg@1579: Socket
[127.0.0.1:38903] zk retcode=-4, errno=111(Connection refused): server refused to accept the
client
[       OK ] SampleFrameworks.CppFramework (5366 ms)
[ RUN      ] SampleFrameworks.JavaFramework
2012-02-22 23:33:20,947:1436(0x2b4b02d4b700):ZOO_ERROR@handle_socket_error_msg@1579: Socket
[127.0.0.1:33346] zk retcode=-4, errno=111(Connection refused): server refused to accept the
client
2012-02-22 23:33:20,969:1436(0x2b4b0334e700):ZOO_ERROR@handle_socket_error_msg@1579: Socket
[127.0.0.1:37034] zk retcode=-4, errno=111(Connection refused): server refused to accept the
client
2012-02-22 23:33:20,993:1436(0x2b4b0354f700):ZOO_ERROR@handle_socket_error_msg@1579: Socket
[127.0.0.1:51404] zk retcode=-4, errno=111(Connection refused): server refused to accept the
client
2012-02-22 23:33:21,017:1436(0x2b4b03a52700):ZOO_ERROR@handle_socket_error_msg@1579: Socket
[127.0.0.1:35701] zk retcode=-4, errno=111(Connection refused): server refused to accept the
client
2012-02-22 23:33:21,259:1436(0x2b4b02949700):ZOO_ERROR@handle_socket_error_msg@1579: Socket
[127.0.0.1:38903] zk retcode=-4, errno=111(Connection refused): server refused to accept the
client
2012-02-22 23:33:22,949:1436(0x2b4b02d4b700):ZOO_ERROR@handle_socket_error_msg@1579: Socket
[127.0.0.1:33346] zk retcode=-4, errno=111(Connection refused): server refused to accept the
client
2012-02-22 23:33:22,971:1436(0x2b4b0334e700):ZOO_ERROR@handle_socket_error_msg@1579: Socket
[127.0.0.1:37034] zk retcode=-4, errno=111(Connection refused): server refused to accept the
client
2012-02-22 23:33:22,995:1436(0x2b4b0354f700):ZOO_ERROR@handle_socket_error_msg@1579: Socket
[127.0.0.1:51404] zk retcode=-4, errno=111(Connection refused): server refused to accept the
client
2012-02-22 23:33:23,019:1436(0x2b4b03a52700):ZOO_ERROR@handle_socket_error_msg@1579: Socket
[127.0.0.1:35701] zk retcode=-4, errno=111(Connection refused): server refused to accept the
client
2012-02-22 23:33:23,261:1436(0x2b4b02949700):ZOO_ERROR@handle_socket_error_msg@1579: Socket
[127.0.0.1:38903] zk retcode=-4, errno=111(Connection refused): server refused to accept the
client
2012-02-22 23:33:24,951:1436(0x2b4b02d4b700):ZOO_ERROR@handle_socket_error_msg@1579: Socket
[127.0.0.1:33346] zk retcode=-4, errno=111(Connection refused): server refused to accept the
client
2012-02-22 23:33:24,973:1436(0x2b4b0334e700):ZOO_ERROR@handle_socket_error_msg@1579: Socket
[127.0.0.1:37034] zk retcode=-4, errno=111(Connection refused): server refused to accept the
client
2012-02-22 23:33:24,997:1436(0x2b4b0354f700):ZOO_ERROR@handle_socket_error_msg@1579: Socket
[127.0.0.1:51404] zk retcode=-4, errno=111(Connection refused): server refused to accept the
client
2012-02-22 23:33:25,021:1436(0x2b4b03a52700):ZOO_ERROR@handle_socket_error_msg@1579: Socket
[127.0.0.1:35701] zk retcode=-4, errno=111(Connection refused): server refused to accept the
client
2012-02-22 23:33:25,263:1436(0x2b4b02949700):ZOO_ERROR@handle_socket_error_msg@1579: Socket
[127.0.0.1:38903] zk retcode=-4, errno=111(Connection refused): server refused to accept the
client
[       OK ] SampleFrameworks.JavaFramework (5605 ms)
[ RUN      ] SampleFrameworks.JavaExceptionFramework
[       OK ] SampleFrameworks.JavaExceptionFramework (233 ms)
[ RUN      ] SampleFrameworks.PythonFramework
../../src/tests/external_tests.cpp:64: Failure
Value of: exitCode
  Actual: 256
Expected: 0
External test PythonFramework failed
[  FAILED  ] SampleFrameworks.PythonFramework (408 ms)
[----------] 4 tests from SampleFrameworks (11612 ms total)

[----------] 1 test from UUIDTest
[ RUN      ] UUIDTest.test
[       OK ] UUIDTest.test (1 ms)
[----------] 1 test from UUIDTest (1 ms total)

[----------] 21 tests from ResourcesTest
[ RUN      ] ResourcesTest.Parsing
[       OK ] ResourcesTest.Parsing (0 ms)
[ RUN      ] ResourcesTest.Printing
[       OK ] ResourcesTest.Printing (0 ms)
[ RUN      ] ResourcesTest.InitializedIsEmpty
[       OK ] ResourcesTest.InitializedIsEmpty (0 ms)
[ RUN      ] ResourcesTest.BadResourcesNotAllocatable
[       OK ] ResourcesTest.BadResourcesNotAllocatable (0 ms)
[ RUN      ] ResourcesTest.ScalarEquals
[       OK ] ResourcesTest.ScalarEquals (0 ms)
[ RUN      ] ResourcesTest.ScalarSubset
[       OK ] ResourcesTest.ScalarSubset (0 ms)
[ RUN      ] ResourcesTest.ScalarAddition
[       OK ] ResourcesTest.ScalarAddition (0 ms)
[ RUN      ] ResourcesTest.ScalarSubtraction
[       OK ] ResourcesTest.ScalarSubtraction (0 ms)
[ RUN      ] ResourcesTest.RangesEquals
[       OK ] ResourcesTest.RangesEquals (0 ms)
[ RUN      ] ResourcesTest.RangesSubset
[       OK ] ResourcesTest.RangesSubset (0 ms)
[ RUN      ] ResourcesTest.RangesAddition
[       OK ] ResourcesTest.RangesAddition (0 ms)
[ RUN      ] ResourcesTest.RangesSubtraction
[       OK ] ResourcesTest.RangesSubtraction (0 ms)
[ RUN      ] ResourcesTest.RangesSubtraction1
[       OK ] ResourcesTest.RangesSubtraction1 (0 ms)
[ RUN      ] ResourcesTest.RangesSubtraction2
[       OK ] ResourcesTest.RangesSubtraction2 (0 ms)
[ RUN      ] ResourcesTest.RangesSubtraction3
[       OK ] ResourcesTest.RangesSubtraction3 (0 ms)
[ RUN      ] ResourcesTest.RangesSubtraction4
[       OK ] ResourcesTest.RangesSubtraction4 (0 ms)
[ RUN      ] ResourcesTest.SetEquals
[       OK ] ResourcesTest.SetEquals (0 ms)
[ RUN      ] ResourcesTest.SetSubset
[       OK ] ResourcesTest.SetSubset (0 ms)
[ RUN      ] ResourcesTest.SetAddition
[       OK ] ResourcesTest.SetAddition (0 ms)
[ RUN      ] ResourcesTest.SetSubtraction
[       OK ] ResourcesTest.SetSubtraction (0 ms)
[ RUN      ] ResourcesTest.EmptyUnequal
[       OK ] ResourcesTest.EmptyUnequal (0 ms)
[----------] 21 tests from ResourcesTest (1 ms total)

[----------] 3 tests from ReplicaTest
[ RUN      ] ReplicaTest.Promise
[       OK ] ReplicaTest.Promise (65 ms)
[ RUN      ] ReplicaTest.Append
[       OK ] ReplicaTest.Append (3 ms)
[ RUN      ] ReplicaTest.Recover
[       OK ] ReplicaTest.Recover (6 ms)
[----------] 3 tests from ReplicaTest (74 ms total)

[----------] 16 tests from CoordinatorTest
[ RUN      ] CoordinatorTest.Elect
[       OK ] CoordinatorTest.Elect (8 ms)
[ RUN      ] CoordinatorTest.AppendRead
[       OK ] CoordinatorTest.AppendRead (9 ms)
[ RUN      ] CoordinatorTest.AppendReadError
[       OK ] CoordinatorTest.AppendReadError (9 ms)
[ RUN      ] CoordinatorTest.Failover
[       OK ] CoordinatorTest.Failover (11 ms)
[ RUN      ] CoordinatorTest.Demoted
2012-02-22 23:33:26,954:1436(0x2b4b02d4b700):ZOO_ERROR@handle_socket_error_msg@1579: Socket
[127.0.0.1:33346] zk retcode=-4, errno=111(Connection refused): server refused to accept the
client
[       OK ] CoordinatorTest.Demoted (13 ms)
[ RUN      ] CoordinatorTest.Fill
[       OK ] CoordinatorTest.Fill (15 ms)
[ RUN      ] CoordinatorTest.NotLearnedFill
2012-02-22 23:33:26,975:1436(0x2b4b0334e700):ZOO_ERROR@handle_socket_error_msg@1579: Socket
[127.0.0.1:37034] zk retcode=-4, errno=111(Connection refused): server refused to accept the
client
[       OK ] CoordinatorTest.NotLearnedFill (18 ms)
[ RUN      ] CoordinatorTest.MultipleAppends
2012-02-22 23:33:26,999:1436(0x2b4b0354f700):ZOO_ERROR@handle_socket_error_msg@1579: Socket
[127.0.0.1:51404] zk retcode=-4, errno=111(Connection refused): server refused to accept the
client
[       OK ] CoordinatorTest.MultipleAppends (18 ms)
[ RUN      ] CoordinatorTest.MultipleAppendsNotLearnedFill
2012-02-22 23:33:27,023:1436(0x2b4b03a52700):ZOO_ERROR@handle_socket_error_msg@1579: Socket
[127.0.0.1:35701] zk retcode=-4, errno=111(Connection refused): server refused to accept the
client
[       OK ] CoordinatorTest.MultipleAppendsNotLearnedFill (52 ms)
[ RUN      ] CoordinatorTest.Truncate
[       OK ] CoordinatorTest.Truncate (20 ms)
[ RUN      ] CoordinatorTest.TruncateNotLearnedFill
[       OK ] CoordinatorTest.TruncateNotLearnedFill (55 ms)
[ RUN      ] CoordinatorTest.RacingElect
[       OK ] CoordinatorTest.RacingElect (0 ms)
[ RUN      ] CoordinatorTest.FillNoQuorum
[       OK ] CoordinatorTest.FillNoQuorum (0 ms)
[ RUN      ] CoordinatorTest.FillInconsistent
[       OK ] CoordinatorTest.FillInconsistent (0 ms)
[ RUN      ] CoordinatorTest.LearnedOnOneReplica_NotLearnedOnAnother
[       OK ] CoordinatorTest.LearnedOnOneReplica_NotLearnedOnAnother (0 ms)
[ RUN      ] CoordinatorTest.LearnedOnOneReplica_NotLearnedOnAnother_AnotherFailsAndRecovers
[       OK ] CoordinatorTest.LearnedOnOneReplica_NotLearnedOnAnother_AnotherFailsAndRecovers
(0 ms)
[----------] 16 tests from CoordinatorTest (228 ms total)

[----------] 2 tests from LogTest
[ RUN      ] LogTest.WriteRead
[       OK ] LogTest.WriteRead (8 ms)
[ RUN      ] LogTest.Position
[       OK ] LogTest.Position (8 ms)
[----------] 2 tests from LogTest (16 ms total)

[----------] 9 tests from FaultToleranceTest
[ RUN      ] FaultToleranceTest.SlaveLost
[       OK ] FaultToleranceTest.SlaveLost (2 ms)
[ RUN      ] FaultToleranceTest.SlavePartitioned
[       OK ] FaultToleranceTest.SlavePartitioned (4 ms)
[ RUN      ] FaultToleranceTest.SchedulerFailover
[       OK ] FaultToleranceTest.SchedulerFailover (2 ms)
[ RUN      ] FaultToleranceTest.FrameworkReliableRegistration
2012-02-22 23:33:27,265:1436(0x2b4b02949700):ZOO_ERROR@handle_socket_error_msg@1579: Socket
[127.0.0.1:38903] zk retcode=-4, errno=111(Connection refused): server refused to accept the
client
[       OK ] FaultToleranceTest.FrameworkReliableRegistration (1010 ms)
[ RUN      ] FaultToleranceTest.FrameworkReregister
[       OK ] FaultToleranceTest.FrameworkReregister (2 ms)
[ RUN      ] FaultToleranceTest.SchedulerFailoverStatusUpdate
[       OK ] FaultToleranceTest.SchedulerFailoverStatusUpdate (6 ms)
[ RUN      ] FaultToleranceTest.SchedulerFailoverFrameworkMessage
[       OK ] FaultToleranceTest.SchedulerFailoverFrameworkMessage (5 ms)
[ RUN      ] FaultToleranceTest.SlaveReliableRegistration
2012-02-22 23:33:28,956:1436(0x2b4b02d4b700):ZOO_ERROR@handle_socket_error_msg@1579: Socket
[127.0.0.1:33346] zk retcode=-4, errno=111(Connection refused): server refused to accept the
client
2012-02-22 23:33:28,977:1436(0x2b4b0334e700):ZOO_ERROR@handle_socket_error_msg@1579: Socket
[127.0.0.1:37034] zk retcode=-4, errno=111(Connection refused): server refused to accept the
client
2012-02-22 23:33:29,001:1436(0x2b4b0354f700):ZOO_ERROR@handle_socket_error_msg@1579: Socket
[127.0.0.1:51404] zk retcode=-4, errno=111(Connection refused): server refused to accept the
client
2012-02-22 23:33:29,026:1436(0x2b4b03a52700):ZOO_ERROR@handle_socket_error_msg@1579: Socket
[127.0.0.1:35701] zk retcode=-4, errno=111(Connection refused): server refused to accept the
client
[       OK ] FaultToleranceTest.SlaveReliableRegistration (1008 ms)
[ RUN      ] FaultToleranceTest.SlaveReregister
[       OK ] FaultToleranceTest.SlaveReregister (2 ms)
[----------] 9 tests from FaultToleranceTest (2041 ms total)

[----------] 7 tests from ResourceOffersTest
[ RUN      ] ResourceOffersTest.ResourceOfferWithMultipleSlaves
[       OK ] ResourceOffersTest.ResourceOfferWithMultipleSlaves (1 ms)
[ RUN      ] ResourceOffersTest.TaskUsesNoResources
[       OK ] ResourceOffersTest.TaskUsesNoResources (3 ms)
[ RUN      ] ResourceOffersTest.TaskUsesInvalidResources
[       OK ] ResourceOffersTest.TaskUsesInvalidResources (2 ms)
[ RUN      ] ResourceOffersTest.TaskUsesMoreResourcesThanOffered
[       OK ] ResourceOffersTest.TaskUsesMoreResourcesThanOffered (3 ms)
[ RUN      ] ResourceOffersTest.ResourcesGetReofferedWhenUnused
[       OK ] ResourceOffersTest.ResourcesGetReofferedWhenUnused (1 ms)
[ RUN      ] ResourceOffersTest.ResourcesGetReofferedAfterTaskDescriptionError
[       OK ] ResourceOffersTest.ResourcesGetReofferedAfterTaskDescriptionError (3 ms)
[ RUN      ] ResourceOffersTest.ResourceRequest
[       OK ] ResourceOffersTest.ResourceRequest (1 ms)
[----------] 7 tests from ResourceOffersTest (14 ms total)

[----------] 4 tests from MasterTest
[ RUN      ] MasterTest.TaskRunning
[       OK ] MasterTest.TaskRunning (5 ms)
[ RUN      ] MasterTest.KillTask
[       OK ] MasterTest.KillTask (4 ms)
[ RUN      ] MasterTest.FrameworkMessage
[       OK ] MasterTest.FrameworkMessage (5 ms)
[ RUN      ] MasterTest.MultipleExecutors
[       OK ] MasterTest.MultipleExecutors (5 ms)
[----------] 4 tests from MasterTest (19 ms total)

[----------] 5 tests from FrameworksManagerTestFixture
[ RUN      ] FrameworksManagerTestFixture.AddFramework
[       OK ] FrameworksManagerTestFixture.AddFramework (1 ms)
[ RUN      ] FrameworksManagerTestFixture.RemoveFramework
[       OK ] FrameworksManagerTestFixture.RemoveFramework (2 ms)
[ RUN      ] FrameworksManagerTestFixture.ResurrectFramework
[       OK ] FrameworksManagerTestFixture.ResurrectFramework (1 ms)
[ RUN      ] FrameworksManagerTestFixture.ResurrectExpiringFramework
[       OK ] FrameworksManagerTestFixture.ResurrectExpiringFramework (2 ms)
[ RUN      ] FrameworksManagerTestFixture.ResurrectInterspersedExpiringFrameworks
[       OK ] FrameworksManagerTestFixture.ResurrectInterspersedExpiringFrameworks (1 ms)
[----------] 5 tests from FrameworksManagerTestFixture (7 ms total)

[----------] 1 test from FrameworksManagerTest
[ RUN      ] FrameworksManagerTest.CacheFailure
E0222 23:33:29.230458  1483 frameworks_manager.cpp:213] Error getting framework info from
underlying storage: Fake Caching Error.
E0222 23:33:29.231194  1483 frameworks_manager.cpp:213] Error getting framework info from
underlying storage: Fake Caching Error.
[       OK ] FrameworksManagerTest.CacheFailure (1 ms)
[----------] 1 test from FrameworksManagerTest (1 ms total)

[----------] Global test environment tear-down
[==========] 121 tests from 21 test cases ran. (28618 ms total)
[  PASSED  ] 120 tests.
[  FAILED  ] 1 test, listed below:
[  FAILED  ] SampleFrameworks.PythonFramework

 1 FAILED TEST
  YOU HAVE 6 DISABLED TESTS

FAIL: mesos-tests
==================
1 of 1 test failed
==================
make[3]: *** [check-TESTS] Error 1
make[3]: Leaving directory `<https://builds.apache.org/job/Mesos-Trunk-Ubuntu-Build-Out-Of-Src-Set-JAVA_HOME/ws/build/src'>
make[2]: *** [check-am] Error 2
make[2]: Leaving directory `<https://builds.apache.org/job/Mesos-Trunk-Ubuntu-Build-Out-Of-Src-Set-JAVA_HOME/ws/build/src'>
make[1]: *** [check] Error 2
make[1]: Leaving directory `<https://builds.apache.org/job/Mesos-Trunk-Ubuntu-Build-Out-Of-Src-Set-JAVA_HOME/ws/build/src'>
make: *** [check-recursive] Error 1
Build step 'Execute shell' marked build as failure


Mime
View raw message