mesos-dev mailing list archives

Site index · List index
Message view « Date » · « Thread »
Top « Date » · « Thread »
From Apache Jenkins Server <jenk...@builds.apache.org>
Subject Build failed in Jenkins: Mesos-Trunk-Ubuntu-Build-Out-Of-Src-Disable-Java-Disable-Python-Disable-Webui #37
Date Wed, 01 Feb 2012 21:27:31 GMT
See <https://builds.apache.org/job/Mesos-Trunk-Ubuntu-Build-Out-Of-Src-Disable-Java-Disable-Python-Disable-Webui/37/changes>

Changes:

[benh] Removed explicit dependency on src/config/config.hpp.

------------------------------------------
[...truncated 13041 lines...]
libtool: link: ranlib .libs/libgmock.a
libtool: link: ( cd ".libs" && rm -f "libgmock.la" && ln -s "../libgmock.la" "libgmock.la" )
make[2]: Leaving directory `<https://builds.apache.org/job/Mesos-Trunk-Ubuntu-Build-Out-Of-Src-Disable-Java-Disable-Python-Disable-Webui/ws/build'>
make[1]: Leaving directory `<https://builds.apache.org/job/Mesos-Trunk-Ubuntu-Build-Out-Of-Src-Disable-Java-Disable-Python-Disable-Webui/ws/build'>
Making check in src
make[1]: Entering directory `<https://builds.apache.org/job/Mesos-Trunk-Ubuntu-Build-Out-Of-Src-Disable-Java-Disable-Python-Disable-Webui/ws/build/src'>
make  check-am
make[2]: Entering directory `<https://builds.apache.org/job/Mesos-Trunk-Ubuntu-Build-Out-Of-Src-Disable-Java-Disable-Python-Disable-Webui/ws/build/src'>
/bin/bash ../libtool --tag=CXX   --mode=link g++  -g2 -O2   -o libbuild.la  common/libbuild_la-build.lo  -lrt
libtool: link: rm -fr  .libs/libbuild.a .libs/libbuild.la
libtool: link: ar cru .libs/libbuild.a common/.libs/libbuild_la-build.o 
libtool: link: ranlib .libs/libbuild.a
libtool: link: ( cd ".libs" && rm -f "libbuild.la" && ln -s "../libbuild.la" "libbuild.la" )
/bin/bash ../libtool --tag=CXX   --mode=link g++  -g2 -O2   -o libmesos_no_third_party.la  sched/libmesos_no_third_party_la-sched.lo local/libmesos_no_third_party_la-local.lo master/libmesos_no_third_party_la-master.lo master/libmesos_no_third_party_la-http.lo master/libmesos_no_third_party_la-slaves_manager.lo master/libmesos_no_third_party_la-frameworks_manager.lo master/libmesos_no_third_party_la-allocator_factory.lo master/libmesos_no_third_party_la-simple_allocator.lo slave/libmesos_no_third_party_la-slave.lo slave/libmesos_no_third_party_la-http.lo slave/libmesos_no_third_party_la-isolation_module.lo slave/libmesos_no_third_party_la-process_based_isolation_module.lo slave/libmesos_no_third_party_la-reaper.lo launcher/libmesos_no_third_party_la-launcher.lo exec/libmesos_no_third_party_la-exec.lo common/libmesos_no_third_party_la-fatal.lo common/libmesos_no_third_party_la-lock.lo detector/libmesos_no_third_party_la-detector.lo detector/libmesos_no_third_party_la-url_processor.lo configurator/libmesos_no_third_party_la-configurator.lo common/libmesos_no_third_party_la-logging.lo common/libmesos_no_third_party_la-utils.lo common/libmesos_no_third_party_la-date_utils.lo common/libmesos_no_third_party_la-resources.lo common/libmesos_no_third_party_la-attributes.lo common/libmesos_no_third_party_la-values.lo zookeeper/libmesos_no_third_party_la-zookeeper.lo zookeeper/libmesos_no_third_party_la-authentication.lo zookeeper/libmesos_no_third_party_la-group.lo slave/libmesos_no_third_party_la-lxc_isolation_module.lo libmesos_no_third_party_la-mesos.pb.lo messages/libmesos_no_third_party_la-messages.pb.lo libbuild.la liblog.la -lrt
libtool: link: rm -fr  .libs/libmesos_no_third_party.a .libs/libmesos_no_third_party.la
libtool: link: (cd .libs/libmesos_no_third_party.lax/libbuild.a && ar x "<https://builds.apache.org/job/Mesos-Trunk-Ubuntu-Build-Out-Of-Src-Disable-Java-Disable-Python-Disable-Webui/ws/build/src/./.libs/libbuild.a")>
libtool: link: (cd .libs/libmesos_no_third_party.lax/liblog.a && ar x "<https://builds.apache.org/job/Mesos-Trunk-Ubuntu-Build-Out-Of-Src-Disable-Java-Disable-Python-Disable-Webui/ws/build/src/./.libs/liblog.a")>
copying selected object files to avoid basename conflicts...
libtool: link: ln slave/.libs/libmesos_no_third_party_la-http.o .libs/libmesos_no_third_party.lax/lt1-libmesos_no_third_party_la-http.o || cp slave/.libs/libmesos_no_third_party_la-http.o .libs/libmesos_no_third_party.lax/lt1-libmesos_no_third_party_la-http.o
libtool: link: ar cru .libs/libmesos_no_third_party.a sched/.libs/libmesos_no_third_party_la-sched.o local/.libs/libmesos_no_third_party_la-local.o master/.libs/libmesos_no_third_party_la-master.o master/.libs/libmesos_no_third_party_la-http.o master/.libs/libmesos_no_third_party_la-slaves_manager.o master/.libs/libmesos_no_third_party_la-frameworks_manager.o master/.libs/libmesos_no_third_party_la-allocator_factory.o master/.libs/libmesos_no_third_party_la-simple_allocator.o slave/.libs/libmesos_no_third_party_la-slave.o .libs/libmesos_no_third_party.lax/lt1-libmesos_no_third_party_la-http.o slave/.libs/libmesos_no_third_party_la-isolation_module.o slave/.libs/libmesos_no_third_party_la-process_based_isolation_module.o slave/.libs/libmesos_no_third_party_la-reaper.o launcher/.libs/libmesos_no_third_party_la-launcher.o exec/.libs/libmesos_no_third_party_la-exec.o common/.libs/libmesos_no_third_party_la-fatal.o common/.libs/libmesos_no_third_party_la-lock.o detector/.libs/libmesos_no_third_party_la-detector.o detector/.libs/libmesos_no_third_party_la-url_processor.o configurator/.libs/libmesos_no_third_party_la-configurator.o common/.libs/libmesos_no_third_party_la-logging.o common/.libs/libmesos_no_third_party_la-utils.o common/.libs/libmesos_no_third_party_la-date_utils.o common/.libs/libmesos_no_third_party_la-resources.o common/.libs/libmesos_no_third_party_la-attributes.o common/.libs/libmesos_no_third_party_la-values.o zookeeper/.libs/libmesos_no_third_party_la-zookeeper.o zookeeper/.libs/libmesos_no_third_party_la-authentication.o zookeeper/.libs/libmesos_no_third_party_la-group.o slave/.libs/libmesos_no_third_party_la-lxc_isolation_module.o .libs/libmesos_no_third_party_la-mesos.pb.o messages/.libs/libmesos_no_third_party_la-messages.pb.o .libs/libmesos_no_third_party.lax/libbuild.a/libbuild_la-build.o .libs/libmesos_no_third_party.lax/liblog.a/liblog_la-coordinator.o .libs/libmesos_no_third_party.lax/liblog.a/liblog_la-replica.o .libs/libmesos_no_third_party.lax/liblog.a/liblog_la-log.pb.o
libtool: link: ranlib .libs/libmesos_no_third_party.a
libtool: link: rm -fr .libs/libmesos_no_third_party.lax .libs/libmesos_no_third_party.lax
libtool: link: ( cd ".libs" && rm -f "libmesos_no_third_party.la" && ln -s "../libmesos_no_third_party.la" "libmesos_no_third_party.la" )
/bin/bash ../libtool --tag=CC --tag=CXX  --mode=link gcc   -version-info 0:0 -shared  -o libmesos.la -rpath /usr/local/lib  libmesos_no_third_party.la ../third_party/protobuf-2.3.0/src/.libs/libprotobuf.la ../third_party/glog-0.3.1/.libs/libglog.la ../third_party/libprocess/libprocess.a ../third_party/libprocess/third_party/libev-3.8/.libs/libev.la ../third_party/zookeeper-3.3.1/src/c/.libs/libzookeeper_mt.a  -lrt

*** Warning: Linking the shared library libmesos.la against the
*** static library ../third_party/libprocess/libprocess.a is not portable!

*** Warning: Linking the shared library libmesos.la against the
*** static library ../third_party/zookeeper-3.3.1/src/c/.libs/libzookeeper_mt.a is not portable!
libtool: link: rm -fr  .libs/libmesos.la .libs/libmesos.lai .libs/libmesos.so .libs/libmesos.so.0 .libs/libmesos.so.0.0.0
libtool: link: g++ -shared -nostdlib /usr/lib/gcc/x86_64-linux-gnu/4.4.3/../../../../lib/crti.o /usr/lib/gcc/x86_64-linux-gnu/4.4.3/crtbeginS.o  -Wl,--whole-archive ./.libs/libmesos_no_third_party.a -Wl,--no-whole-archive  -L<https://builds.apache.org/job/Mesos-Trunk-Ubuntu-Build-Out-Of-Src-Disable-Java-Disable-Python-Disable-Webui/ws/build/third_party/leveldb> -lleveldb ../third_party/protobuf-2.3.0/src/.libs/libprotobuf.a ../third_party/glog-0.3.1/.libs/libglog.a ../third_party/libprocess/libprocess.a ../third_party/libprocess/third_party/libev-3.8/.libs/libev.a ../third_party/zookeeper-3.3.1/src/c/.libs/libzookeeper_mt.a -lrt -L/usr/lib/gcc/x86_64-linux-gnu/4.4.3 -L/usr/lib/gcc/x86_64-linux-gnu/4.4.3/../../../../lib -L/lib/../lib -L/usr/lib/../lib -L/usr/lib/gcc/x86_64-linux-gnu/4.4.3/../../.. -lstdc++ -lm -lc -lgcc_s /usr/lib/gcc/x86_64-linux-gnu/4.4.3/crtendS.o /usr/lib/gcc/x86_64-linux-gnu/4.4.3/../../../../lib/crtn.o    -pthread -Wl,-soname -Wl,libmesos.so.0 -o .libs/libmesos.so.0.0.0
libtool: link: (cd ".libs" && rm -f "libmesos.so.0" && ln -s "libmesos.so.0.0.0" "libmesos.so.0")
libtool: link: (cd ".libs" && rm -f "libmesos.so" && ln -s "libmesos.so.0.0.0" "libmesos.so")
libtool: link: ( cd ".libs" && rm -f "libmesos.la" && ln -s "../libmesos.la" "libmesos.la" )
/bin/bash ../libtool --tag=CXX   --mode=link g++  -g2 -O2   -o mesos-local local/mesos_local-main.o libmesos.la -lrt
libtool: link: g++ -g2 -O2 -o .libs/mesos-local local/mesos_local-main.o  ./.libs/libmesos.so -lrt -pthread
/bin/bash ../libtool --tag=CXX   --mode=link g++  -g2 -O2   -o mesos-log log/mesos_log-main.o libmesos.la -lrt
libtool: link: g++ -g2 -O2 -o .libs/mesos-log log/mesos_log-main.o  ./.libs/libmesos.so -lrt -pthread
/bin/bash ../libtool --tag=CXX   --mode=link g++  -g2 -O2   -o mesos-mesos mesos/mesos_mesos-main.o libmesos.la -lrt
libtool: link: g++ -g2 -O2 -o .libs/mesos-mesos mesos/mesos_mesos-main.o  ./.libs/libmesos.so -lrt -pthread
/bin/bash ../libtool --tag=CXX   --mode=link g++  -g2 -O2   -o mesos-launcher launcher/mesos_launcher-main.o launcher/mesos_launcher-launcher.o libmesos.la -lrt
libtool: link: g++ -g2 -O2 -o .libs/mesos-launcher launcher/mesos_launcher-main.o launcher/mesos_launcher-launcher.o  ./.libs/libmesos.so -lrt -pthread
/bin/bash ../libtool --tag=CXX   --mode=link g++  -g2 -O2   -o mesos-master master/mesos_master-main.o libwebui.la libmesos.la -lrt
libtool: link: g++ -g2 -O2 -o .libs/mesos-master master/mesos_master-main.o  ./.libs/libwebui.a ./.libs/libmesos.so -lrt -pthread
/bin/bash ../libtool --tag=CXX   --mode=link g++  -g2 -O2   -o mesos-slave slave/mesos_slave-main.o libwebui.la libmesos.la -lrt
libtool: link: g++ -g2 -O2 -o .libs/mesos-slave slave/mesos_slave-main.o  ./.libs/libwebui.a ./.libs/libmesos.so -lrt -pthread
make  test-framework test-executor long-lived-framework long-lived-executor memhog scheduled-memhog memhog-executor mesos-tests \
	  examples/java/test-framework examples/java/test-executor examples/java/test-exception-framework examples/java/test-multiple-executors-framework examples/python/test_framework.py examples/python/test-framework examples/python/test_executor.py examples/python/test-executor tests/external/LxcIsolation/HoldMoreMemThanRequested.sh tests/external/LxcIsolation/ScaleUpAndDown.sh tests/external/LxcIsolation/TwoSeparateTasks.sh tests/external/LxcIsolation/run_scheduled_memhog_test.sh tests/external/SampleFrameworks/CppFramework.sh tests/external/SampleFrameworks/JavaExceptionFramework.sh tests/external/SampleFrameworks/JavaFramework.sh tests/external/SampleFrameworks/PythonFramework.sh tests/external/KillTree/KillTreeTest.sh
make[3]: Entering directory `<https://builds.apache.org/job/Mesos-Trunk-Ubuntu-Build-Out-Of-Src-Disable-Java-Disable-Python-Disable-Webui/ws/build/src'>
g++ -DPACKAGE_NAME=\"mesos\" -DPACKAGE_TARNAME=\"mesos\" -DPACKAGE_VERSION=\"0.0.1\" -DPACKAGE_STRING=\"mesos\ 0.0.1\" -DPACKAGE_BUGREPORT=\"\" -DPACKAGE_URL=\"\" -DPACKAGE=\"mesos\" -DVERSION=\"0.0.1\" -DSTDC_HEADERS=1 -DHAVE_SYS_TYPES_H=1 -DHAVE_SYS_STAT_H=1 -DHAVE_STDLIB_H=1 -DHAVE_STRING_H=1 -DHAVE_MEMORY_H=1 -DHAVE_STRINGS_H=1 -DHAVE_INTTYPES_H=1 -DHAVE_STDINT_H=1 -DHAVE_UNISTD_H=1 -DHAVE_DLFCN_H=1 -DLT_OBJDIR=\".libs/\" -DHAVE_PTHREAD=1 -I. -I../../src   -DMESOS_WEBUI_DIR=\"/usr/local/share/mesos/webui\" -DMESOS_LIBEXECDIR=\"/usr/local/libexec/mesos\" -I../../include -I../../third_party/boost-1.37.0 -I../../third_party/protobuf-2.3.0/src -I../../third_party/glog-0.3.1/src -I../third_party/glog-0.3.1/src -I../../third_party/libprocess/include -I../../third_party/zookeeper-3.3.1/src/c/include -I../../third_party/zookeeper-3.3.1/src/c/generated   -g2 -O2 -MT examples/test_framework-test_framework.o -MD -MP -MF examples/.deps/test_framework-test_framework.Tpo -c -o examples/test_framework-test_framework.o `test -f 'examples/test_framework.cpp' || echo '../../src/'`examples/test_framework.cpp
../../src/examples/test_framework.cpp: In function 'int main(int, char**)':
../../src/examples/test_framework.cpp:155: warning: ignoring return value of 'char* realpath(const char*, char*)', declared with attribute warn_unused_result
mv -f examples/.deps/test_framework-test_framework.Tpo examples/.deps/test_framework-test_framework.Po
/bin/bash ../libtool --tag=CXX   --mode=link g++  -g2 -O2   -o libbuild.la  common/libbuild_la-build.lo  -lrt
libtool: link: rm -fr  .libs/libbuild.a .libs/libbuild.la
libtool: link: ar cru .libs/libbuild.a common/.libs/libbuild_la-build.o 
libtool: link: ranlib .libs/libbuild.a
libtool: link: ( cd ".libs" && rm -f "libbuild.la" && ln -s "../libbuild.la" "libbuild.la" )
/bin/bash ../libtool --tag=CXX   --mode=link g++  -g2 -O2   -o libmesos_no_third_party.la  sched/libmesos_no_third_party_la-sched.lo local/libmesos_no_third_party_la-local.lo master/libmesos_no_third_party_la-master.lo master/libmesos_no_third_party_la-http.lo master/libmesos_no_third_party_la-slaves_manager.lo master/libmesos_no_third_party_la-frameworks_manager.lo master/libmesos_no_third_party_la-allocator_factory.lo master/libmesos_no_third_party_la-simple_allocator.lo slave/libmesos_no_third_party_la-slave.lo slave/libmesos_no_third_party_la-http.lo slave/libmesos_no_third_party_la-isolation_module.lo slave/libmesos_no_third_party_la-process_based_isolation_module.lo slave/libmesos_no_third_party_la-reaper.lo launcher/libmesos_no_third_party_la-launcher.lo exec/libmesos_no_third_party_la-exec.lo common/libmesos_no_third_party_la-fatal.lo common/libmesos_no_third_party_la-lock.lo detector/libmesos_no_third_party_la-detector.lo detector/libmesos_no_third_party_la-url_processor.lo configurator/libmesos_no_third_party_la-configurator.lo common/libmesos_no_third_party_la-logging.lo common/libmesos_no_third_party_la-utils.lo common/libmesos_no_third_party_la-date_utils.lo common/libmesos_no_third_party_la-resources.lo common/libmesos_no_third_party_la-attributes.lo common/libmesos_no_third_party_la-values.lo zookeeper/libmesos_no_third_party_la-zookeeper.lo zookeeper/libmesos_no_third_party_la-authentication.lo zookeeper/libmesos_no_third_party_la-group.lo slave/libmesos_no_third_party_la-lxc_isolation_module.lo libmesos_no_third_party_la-mesos.pb.lo messages/libmesos_no_third_party_la-messages.pb.lo libbuild.la liblog.la -lrt
libtool: link: rm -fr  .libs/libmesos_no_third_party.a .libs/libmesos_no_third_party.la
libtool: link: (cd .libs/libmesos_no_third_party.lax/libbuild.a && ar x "<https://builds.apache.org/job/Mesos-Trunk-Ubuntu-Build-Out-Of-Src-Disable-Java-Disable-Python-Disable-Webui/ws/build/src/./.libs/libbuild.a")>
libtool: link: (cd .libs/libmesos_no_third_party.lax/liblog.a && ar x "<https://builds.apache.org/job/Mesos-Trunk-Ubuntu-Build-Out-Of-Src-Disable-Java-Disable-Python-Disable-Webui/ws/build/src/./.libs/liblog.a")>
copying selected object files to avoid basename conflicts...
libtool: link: ln slave/.libs/libmesos_no_third_party_la-http.o .libs/libmesos_no_third_party.lax/lt1-libmesos_no_third_party_la-http.o || cp slave/.libs/libmesos_no_third_party_la-http.o .libs/libmesos_no_third_party.lax/lt1-libmesos_no_third_party_la-http.o
libtool: link: ar cru .libs/libmesos_no_third_party.a sched/.libs/libmesos_no_third_party_la-sched.o local/.libs/libmesos_no_third_party_la-local.o master/.libs/libmesos_no_third_party_la-master.o master/.libs/libmesos_no_third_party_la-http.o master/.libs/libmesos_no_third_party_la-slaves_manager.o master/.libs/libmesos_no_third_party_la-frameworks_manager.o master/.libs/libmesos_no_third_party_la-allocator_factory.o master/.libs/libmesos_no_third_party_la-simple_allocator.o slave/.libs/libmesos_no_third_party_la-slave.o .libs/libmesos_no_third_party.lax/lt1-libmesos_no_third_party_la-http.o slave/.libs/libmesos_no_third_party_la-isolation_module.o slave/.libs/libmesos_no_third_party_la-process_based_isolation_module.o slave/.libs/libmesos_no_third_party_la-reaper.o launcher/.libs/libmesos_no_third_party_la-launcher.o exec/.libs/libmesos_no_third_party_la-exec.o common/.libs/libmesos_no_third_party_la-fatal.o common/.libs/libmesos_no_third_party_la-lock.o detector/.libs/libmesos_no_third_party_la-detector.o detector/.libs/libmesos_no_third_party_la-url_processor.o configurator/.libs/libmesos_no_third_party_la-configurator.o common/.libs/libmesos_no_third_party_la-logging.o common/.libs/libmesos_no_third_party_la-utils.o common/.libs/libmesos_no_third_party_la-date_utils.o common/.libs/libmesos_no_third_party_la-resources.o common/.libs/libmesos_no_third_party_la-attributes.o common/.libs/libmesos_no_third_party_la-values.o zookeeper/.libs/libmesos_no_third_party_la-zookeeper.o zookeeper/.libs/libmesos_no_third_party_la-authentication.o zookeeper/.libs/libmesos_no_third_party_la-group.o slave/.libs/libmesos_no_third_party_la-lxc_isolation_module.o .libs/libmesos_no_third_party_la-mesos.pb.o messages/.libs/libmesos_no_third_party_la-messages.pb.o .libs/libmesos_no_third_party.lax/libbuild.a/libbuild_la-build.o .libs/libmesos_no_third_party.lax/liblog.a/liblog_la-coordinator.o .libs/libmesos_no_third_party.lax/liblog.a/liblog_la-replica.o .libs/libmesos_no_third_party.lax/liblog.a/liblog_la-log.pb.o
libtool: link: ranlib .libs/libmesos_no_third_party.a
libtool: link: rm -fr .libs/libmesos_no_third_party.lax .libs/libmesos_no_third_party.lax
libtool: link: ( cd ".libs" && rm -f "libmesos_no_third_party.la" && ln -s "../libmesos_no_third_party.la" "libmesos_no_third_party.la" )
/bin/bash ../libtool --tag=CC --tag=CXX  --mode=link gcc   -version-info 0:0 -shared  -o libmesos.la -rpath /usr/local/lib  libmesos_no_third_party.la ../third_party/protobuf-2.3.0/src/.libs/libprotobuf.la ../third_party/glog-0.3.1/.libs/libglog.la ../third_party/libprocess/libprocess.a ../third_party/libprocess/third_party/libev-3.8/.libs/libev.la ../third_party/zookeeper-3.3.1/src/c/.libs/libzookeeper_mt.a  -lrt

*** Warning: Linking the shared library libmesos.la against the
*** static library ../third_party/libprocess/libprocess.a is not portable!

*** Warning: Linking the shared library libmesos.la against the
*** static library ../third_party/zookeeper-3.3.1/src/c/.libs/libzookeeper_mt.a is not portable!
libtool: link: rm -fr  .libs/libmesos.la .libs/libmesos.lai .libs/libmesos.so .libs/libmesos.so.0 .libs/libmesos.so.0.0.0
libtool: link: g++ -shared -nostdlib /usr/lib/gcc/x86_64-linux-gnu/4.4.3/../../../../lib/crti.o /usr/lib/gcc/x86_64-linux-gnu/4.4.3/crtbeginS.o  -Wl,--whole-archive ./.libs/libmesos_no_third_party.a -Wl,--no-whole-archive  -L<https://builds.apache.org/job/Mesos-Trunk-Ubuntu-Build-Out-Of-Src-Disable-Java-Disable-Python-Disable-Webui/ws/build/third_party/leveldb> -lleveldb ../third_party/protobuf-2.3.0/src/.libs/libprotobuf.a ../third_party/glog-0.3.1/.libs/libglog.a ../third_party/libprocess/libprocess.a ../third_party/libprocess/third_party/libev-3.8/.libs/libev.a ../third_party/zookeeper-3.3.1/src/c/.libs/libzookeeper_mt.a -lrt -L/usr/lib/gcc/x86_64-linux-gnu/4.4.3 -L/usr/lib/gcc/x86_64-linux-gnu/4.4.3/../../../../lib -L/lib/../lib -L/usr/lib/../lib -L/usr/lib/gcc/x86_64-linux-gnu/4.4.3/../../.. -lstdc++ -lm -lc -lgcc_s /usr/lib/gcc/x86_64-linux-gnu/4.4.3/crtendS.o /usr/lib/gcc/x86_64-linux-gnu/4.4.3/../../../../lib/crtn.o    -pthread -Wl,-soname -Wl,libmesos.so.0 -o .libs/libmesos.so.0.0.0
libtool: link: (cd ".libs" && rm -f "libmesos.so.0" && ln -s "libmesos.so.0.0.0" "libmesos.so.0")
libtool: link: (cd ".libs" && rm -f "libmesos.so" && ln -s "libmesos.so.0.0.0" "libmesos.so")
libtool: link: ( cd ".libs" && rm -f "libmesos.la" && ln -s "../libmesos.la" "libmesos.la" )
/bin/bash ../libtool --tag=CXX   --mode=link g++  -g2 -O2   -o test-framework examples/test_framework-test_framework.o libmesos.la -lrt
libtool: link: g++ -g2 -O2 -o .libs/test-framework examples/test_framework-test_framework.o  ./.libs/libmesos.so -lrt -pthread
g++ -DPACKAGE_NAME=\"mesos\" -DPACKAGE_TARNAME=\"mesos\" -DPACKAGE_VERSION=\"0.0.1\" -DPACKAGE_STRING=\"mesos\ 0.0.1\" -DPACKAGE_BUGREPORT=\"\" -DPACKAGE_URL=\"\" -DPACKAGE=\"mesos\" -DVERSION=\"0.0.1\" -DSTDC_HEADERS=1 -DHAVE_SYS_TYPES_H=1 -DHAVE_SYS_STAT_H=1 -DHAVE_STDLIB_H=1 -DHAVE_STRING_H=1 -DHAVE_MEMORY_H=1 -DHAVE_STRINGS_H=1 -DHAVE_INTTYPES_H=1 -DHAVE_STDINT_H=1 -DHAVE_UNISTD_H=1 -DHAVE_DLFCN_H=1 -DLT_OBJDIR=\".libs/\" -DHAVE_PTHREAD=1 -I. -I../../src   -DMESOS_WEBUI_DIR=\"/usr/local/share/mesos/webui\" -DMESOS_LIBEXECDIR=\"/usr/local/libexec/mesos\" -I../../include -I../../third_party/boost-1.37.0 -I../../third_party/protobuf-2.3.0/src -I../../third_party/glog-0.3.1/src -I../third_party/glog-0.3.1/src -I../../third_party/libprocess/include -I../../third_party/zookeeper-3.3.1/src/c/include -I../../third_party/zookeeper-3.3.1/src/c/generated   -g2 -O2 -MT examples/test_executor-test_executor.o -MD -MP -MF examples/.deps/test_executor-test_executor.Tpo -c -o examples/test_executor-test_executor.o `test -f 'examples/test_executor.cpp' || echo '../../src/'`examples/test_executor.cpp
mv -f examples/.deps/test_executor-test_executor.Tpo examples/.deps/test_executor-test_executor.Po
/bin/bash ../libtool --tag=CXX   --mode=link g++  -g2 -O2   -o test-executor examples/test_executor-test_executor.o libmesos.la -lrt
libtool: link: g++ -g2 -O2 -o .libs/test-executor examples/test_executor-test_executor.o  ./.libs/libmesos.so -lrt -pthread
g++ -DPACKAGE_NAME=\"mesos\" -DPACKAGE_TARNAME=\"mesos\" -DPACKAGE_VERSION=\"0.0.1\" -DPACKAGE_STRING=\"mesos\ 0.0.1\" -DPACKAGE_BUGREPORT=\"\" -DPACKAGE_URL=\"\" -DPACKAGE=\"mesos\" -DVERSION=\"0.0.1\" -DSTDC_HEADERS=1 -DHAVE_SYS_TYPES_H=1 -DHAVE_SYS_STAT_H=1 -DHAVE_STDLIB_H=1 -DHAVE_STRING_H=1 -DHAVE_MEMORY_H=1 -DHAVE_STRINGS_H=1 -DHAVE_INTTYPES_H=1 -DHAVE_STDINT_H=1 -DHAVE_UNISTD_H=1 -DHAVE_DLFCN_H=1 -DLT_OBJDIR=\".libs/\" -DHAVE_PTHREAD=1 -I. -I../../src   -DMESOS_WEBUI_DIR=\"/usr/local/share/mesos/webui\" -DMESOS_LIBEXECDIR=\"/usr/local/libexec/mesos\" -I../../include -I../../third_party/boost-1.37.0 -I../../third_party/protobuf-2.3.0/src -I../../third_party/glog-0.3.1/src -I../third_party/glog-0.3.1/src -I../../third_party/libprocess/include -I../../third_party/zookeeper-3.3.1/src/c/include -I../../third_party/zookeeper-3.3.1/src/c/generated   -g2 -O2 -MT examples/long_lived_framework-long_lived_framework.o -MD -MP -MF examples/.deps/long_lived_framework-long_lived_framework.Tpo -c -o examples/long_lived_framework-long_lived_framework.o `test -f 'examples/long_lived_framework.cpp' || echo '../../src/'`examples/long_lived_framework.cpp
../../src/examples/long_lived_framework.cpp: In function 'int main(int, char**)':
../../src/examples/long_lived_framework.cpp:145: warning: ignoring return value of 'char* realpath(const char*, char*)', declared with attribute warn_unused_result
mv -f examples/.deps/long_lived_framework-long_lived_framework.Tpo examples/.deps/long_lived_framework-long_lived_framework.Po
/bin/bash ../libtool --tag=CXX   --mode=link g++  -g2 -O2   -o long-lived-framework examples/long_lived_framework-long_lived_framework.o libmesos.la -lrt
libtool: link: g++ -g2 -O2 -o .libs/long-lived-framework examples/long_lived_framework-long_lived_framework.o  ./.libs/libmesos.so -lrt -pthread
g++ -DPACKAGE_NAME=\"mesos\" -DPACKAGE_TARNAME=\"mesos\" -DPACKAGE_VERSION=\"0.0.1\" -DPACKAGE_STRING=\"mesos\ 0.0.1\" -DPACKAGE_BUGREPORT=\"\" -DPACKAGE_URL=\"\" -DPACKAGE=\"mesos\" -DVERSION=\"0.0.1\" -DSTDC_HEADERS=1 -DHAVE_SYS_TYPES_H=1 -DHAVE_SYS_STAT_H=1 -DHAVE_STDLIB_H=1 -DHAVE_STRING_H=1 -DHAVE_MEMORY_H=1 -DHAVE_STRINGS_H=1 -DHAVE_INTTYPES_H=1 -DHAVE_STDINT_H=1 -DHAVE_UNISTD_H=1 -DHAVE_DLFCN_H=1 -DLT_OBJDIR=\".libs/\" -DHAVE_PTHREAD=1 -I. -I../../src   -DMESOS_WEBUI_DIR=\"/usr/local/share/mesos/webui\" -DMESOS_LIBEXECDIR=\"/usr/local/libexec/mesos\" -I../../include -I../../third_party/boost-1.37.0 -I../../third_party/protobuf-2.3.0/src -I../../third_party/glog-0.3.1/src -I../third_party/glog-0.3.1/src -I../../third_party/libprocess/include -I../../third_party/zookeeper-3.3.1/src/c/include -I../../third_party/zookeeper-3.3.1/src/c/generated   -g2 -O2 -MT examples/long_lived_executor-long_lived_executor.o -MD -MP -MF examples/.deps/long_lived_executor-long_lived_executor.Tpo -c -o examples/long_lived_executor-long_lived_executor.o `test -f 'examples/long_lived_executor.cpp' || echo '../../src/'`examples/long_lived_executor.cpp
mv -f examples/.deps/long_lived_executor-long_lived_executor.Tpo examples/.deps/long_lived_executor-long_lived_executor.Po
/bin/bash ../libtool --tag=CXX   --mode=link g++  -g2 -O2   -o long-lived-executor examples/long_lived_executor-long_lived_executor.o libmesos.la -lrt
libtool: link: g++ -g2 -O2 -o .libs/long-lived-executor examples/long_lived_executor-long_lived_executor.o  ./.libs/libmesos.so -lrt -pthread
g++ -DPACKAGE_NAME=\"mesos\" -DPACKAGE_TARNAME=\"mesos\" -DPACKAGE_VERSION=\"0.0.1\" -DPACKAGE_STRING=\"mesos\ 0.0.1\" -DPACKAGE_BUGREPORT=\"\" -DPACKAGE_URL=\"\" -DPACKAGE=\"mesos\" -DVERSION=\"0.0.1\" -DSTDC_HEADERS=1 -DHAVE_SYS_TYPES_H=1 -DHAVE_SYS_STAT_H=1 -DHAVE_STDLIB_H=1 -DHAVE_STRING_H=1 -DHAVE_MEMORY_H=1 -DHAVE_STRINGS_H=1 -DHAVE_INTTYPES_H=1 -DHAVE_STDINT_H=1 -DHAVE_UNISTD_H=1 -DHAVE_DLFCN_H=1 -DLT_OBJDIR=\".libs/\" -DHAVE_PTHREAD=1 -I. -I../../src   -DMESOS_WEBUI_DIR=\"/usr/local/share/mesos/webui\" -DMESOS_LIBEXECDIR=\"/usr/local/libexec/mesos\" -I../../include -I../../third_party/boost-1.37.0 -I../../third_party/protobuf-2.3.0/src -I../../third_party/glog-0.3.1/src -I../third_party/glog-0.3.1/src -I../../third_party/libprocess/include -I../../third_party/zookeeper-3.3.1/src/c/include -I../../third_party/zookeeper-3.3.1/src/c/generated   -g2 -O2 -MT examples/memhog-memhog.o -MD -MP -MF examples/.deps/memhog-memhog.Tpo -c -o examples/memhog-memhog.o `test -f 'examples/memhog.cpp' || echo '../../src/'`examples/memhog.cpp
../../src/examples/memhog.cpp: In function 'int main(int, char**)':
../../src/examples/memhog.cpp:163: warning: ignoring return value of 'char* realpath(const char*, char*)', declared with attribute warn_unused_result
mv -f examples/.deps/memhog-memhog.Tpo examples/.deps/memhog-memhog.Po
/bin/bash ../libtool --tag=CXX   --mode=link g++  -g2 -O2   -o memhog examples/memhog-memhog.o libmesos.la -lrt
libtool: link: g++ -g2 -O2 -o .libs/memhog examples/memhog-memhog.o  ./.libs/libmesos.so -lrt -pthread
g++ -DPACKAGE_NAME=\"mesos\" -DPACKAGE_TARNAME=\"mesos\" -DPACKAGE_VERSION=\"0.0.1\" -DPACKAGE_STRING=\"mesos\ 0.0.1\" -DPACKAGE_BUGREPORT=\"\" -DPACKAGE_URL=\"\" -DPACKAGE=\"mesos\" -DVERSION=\"0.0.1\" -DSTDC_HEADERS=1 -DHAVE_SYS_TYPES_H=1 -DHAVE_SYS_STAT_H=1 -DHAVE_STDLIB_H=1 -DHAVE_STRING_H=1 -DHAVE_MEMORY_H=1 -DHAVE_STRINGS_H=1 -DHAVE_INTTYPES_H=1 -DHAVE_STDINT_H=1 -DHAVE_UNISTD_H=1 -DHAVE_DLFCN_H=1 -DLT_OBJDIR=\".libs/\" -DHAVE_PTHREAD=1 -I. -I../../src   -DMESOS_WEBUI_DIR=\"/usr/local/share/mesos/webui\" -DMESOS_LIBEXECDIR=\"/usr/local/libexec/mesos\" -I../../include -I../../third_party/boost-1.37.0 -I../../third_party/protobuf-2.3.0/src -I../../third_party/glog-0.3.1/src -I../third_party/glog-0.3.1/src -I../../third_party/libprocess/include -I../../third_party/zookeeper-3.3.1/src/c/include -I../../third_party/zookeeper-3.3.1/src/c/generated   -g2 -O2 -MT examples/scheduled_memhog-scheduled_memhog.o -MD -MP -MF examples/.deps/scheduled_memhog-scheduled_memhog.Tpo -c -o examples/scheduled_memhog-scheduled_memhog.o `test -f 'examples/scheduled_memhog.cpp' || echo '../../src/'`examples/scheduled_memhog.cpp
../../src/examples/scheduled_memhog.cpp: In function 'int main(int, char**)':
../../src/examples/scheduled_memhog.cpp:221: warning: ignoring return value of 'char* realpath(const char*, char*)', declared with attribute warn_unused_result
mv -f examples/.deps/scheduled_memhog-scheduled_memhog.Tpo examples/.deps/scheduled_memhog-scheduled_memhog.Po
/bin/bash ../libtool --tag=CXX   --mode=link g++  -g2 -O2   -o scheduled-memhog examples/scheduled_memhog-scheduled_memhog.o libmesos.la -lrt
libtool: link: g++ -g2 -O2 -o .libs/scheduled-memhog examples/scheduled_memhog-scheduled_memhog.o  ./.libs/libmesos.so -lrt -pthread
g++ -DPACKAGE_NAME=\"mesos\" -DPACKAGE_TARNAME=\"mesos\" -DPACKAGE_VERSION=\"0.0.1\" -DPACKAGE_STRING=\"mesos\ 0.0.1\" -DPACKAGE_BUGREPORT=\"\" -DPACKAGE_URL=\"\" -DPACKAGE=\"mesos\" -DVERSION=\"0.0.1\" -DSTDC_HEADERS=1 -DHAVE_SYS_TYPES_H=1 -DHAVE_SYS_STAT_H=1 -DHAVE_STDLIB_H=1 -DHAVE_STRING_H=1 -DHAVE_MEMORY_H=1 -DHAVE_STRINGS_H=1 -DHAVE_INTTYPES_H=1 -DHAVE_STDINT_H=1 -DHAVE_UNISTD_H=1 -DHAVE_DLFCN_H=1 -DLT_OBJDIR=\".libs/\" -DHAVE_PTHREAD=1 -I. -I../../src   -DMESOS_WEBUI_DIR=\"/usr/local/share/mesos/webui\" -DMESOS_LIBEXECDIR=\"/usr/local/libexec/mesos\" -I../../include -I../../third_party/boost-1.37.0 -I../../third_party/protobuf-2.3.0/src -I../../third_party/glog-0.3.1/src -I../third_party/glog-0.3.1/src -I../../third_party/libprocess/include -I../../third_party/zookeeper-3.3.1/src/c/include -I../../third_party/zookeeper-3.3.1/src/c/generated   -g2 -O2 -MT examples/memhog_executor-memhog_executor.o -MD -MP -MF examples/.deps/memhog_executor-memhog_executor.Tpo -c -o examples/memhog_executor-memhog_executor.o `test -f 'examples/memhog_executor.cpp' || echo '../../src/'`examples/memhog_executor.cpp
mv -f examples/.deps/memhog_executor-memhog_executor.Tpo examples/.deps/memhog_executor-memhog_executor.Po
/bin/bash ../libtool --tag=CXX   --mode=link g++  -g2 -O2   -o memhog-executor examples/memhog_executor-memhog_executor.o libmesos.la -lrt
libtool: link: g++ -g2 -O2 -o .libs/memhog-executor examples/memhog_executor-memhog_executor.o  ./.libs/libmesos.so -lrt -pthread
g++ -DPACKAGE_NAME=\"mesos\" -DPACKAGE_TARNAME=\"mesos\" -DPACKAGE_VERSION=\"0.0.1\" -DPACKAGE_STRING=\"mesos\ 0.0.1\" -DPACKAGE_BUGREPORT=\"\" -DPACKAGE_URL=\"\" -DPACKAGE=\"mesos\" -DVERSION=\"0.0.1\" -DSTDC_HEADERS=1 -DHAVE_SYS_TYPES_H=1 -DHAVE_SYS_STAT_H=1 -DHAVE_STDLIB_H=1 -DHAVE_STRING_H=1 -DHAVE_MEMORY_H=1 -DHAVE_STRINGS_H=1 -DHAVE_INTTYPES_H=1 -DHAVE_STDINT_H=1 -DHAVE_UNISTD_H=1 -DHAVE_DLFCN_H=1 -DLT_OBJDIR=\".libs/\" -DHAVE_PTHREAD=1 -I. -I../../src   -DMESOS_WEBUI_DIR=\"/usr/local/share/mesos/webui\" -DMESOS_LIBEXECDIR=\"/usr/local/libexec/mesos\" -I../../include -I../../third_party/boost-1.37.0 -I../../third_party/protobuf-2.3.0/src -I../../third_party/glog-0.3.1/src -I../third_party/glog-0.3.1/src -I../../third_party/libprocess/include -I../../third_party/zookeeper-3.3.1/src/c/include -I../../third_party/zookeeper-3.3.1/src/c/generated -DSOURCE_DIR=\"<https://builds.apache.org/job/Mesos-Trunk-Ubuntu-Build-Out-Of-Src-Disable-Java-Disable-Python-Disable-Webui/ws/build/..\"> -DBUILD_DIR=\"<https://builds.apache.org/job/Mesos-Trunk-Ubuntu-Build-Out-Of-Src-Disable-Java-Disable-Python-Disable-Webui/ws/build\"> -I../../third_party/gmock-1.6.0/gtest/include -I../../third_party/gmock-1.6.0/include    -g2 -O2 -MT tests/mesos_tests-main.o -MD -MP -MF tests/.deps/mesos_tests-main.Tpo -c -o tests/mesos_tests-main.o `test -f 'tests/main.cpp' || echo '../../src/'`tests/main.cpp
In file included from ../../third_party/boost-1.37.0/boost/uuid/random_generator.hpp:12,
                 from ../../third_party/boost-1.37.0/boost/uuid/uuid_generators.hpp:17,
                 from ../../src/common/uuid.hpp:29,
                 from ../../src/slave/slave.hpp:33,
                 from ../../src/tests/utils.hpp:40,
                 from ../../src/tests/main.cpp:33:
../../third_party/boost-1.37.0/boost/uuid/seed_rng.hpp: In member function 'void boost::uuids::detail::seed_rng::sha1_random_digest_()':
../../third_party/boost-1.37.0/boost/uuid/seed_rng.hpp:153: warning: ignoring return value of 'size_t fread(void*, size_t, size_t, FILE*)', declared with attribute warn_unused_result
mv -f tests/.deps/mesos_tests-main.Tpo tests/.deps/mesos_tests-main.Po
g++ -DPACKAGE_NAME=\"mesos\" -DPACKAGE_TARNAME=\"mesos\" -DPACKAGE_VERSION=\"0.0.1\" -DPACKAGE_STRING=\"mesos\ 0.0.1\" -DPACKAGE_BUGREPORT=\"\" -DPACKAGE_URL=\"\" -DPACKAGE=\"mesos\" -DVERSION=\"0.0.1\" -DSTDC_HEADERS=1 -DHAVE_SYS_TYPES_H=1 -DHAVE_SYS_STAT_H=1 -DHAVE_STDLIB_H=1 -DHAVE_STRING_H=1 -DHAVE_MEMORY_H=1 -DHAVE_STRINGS_H=1 -DHAVE_INTTYPES_H=1 -DHAVE_STDINT_H=1 -DHAVE_UNISTD_H=1 -DHAVE_DLFCN_H=1 -DLT_OBJDIR=\".libs/\" -DHAVE_PTHREAD=1 -I. -I../../src   -DMESOS_WEBUI_DIR=\"/usr/local/share/mesos/webui\" -DMESOS_LIBEXECDIR=\"/usr/local/libexec/mesos\" -I../../include -I../../third_party/boost-1.37.0 -I../../third_party/protobuf-2.3.0/src -I../../third_party/glog-0.3.1/src -I../third_party/glog-0.3.1/src -I../../third_party/libprocess/include -I../../third_party/zookeeper-3.3.1/src/c/include -I../../third_party/zookeeper-3.3.1/src/c/generated -DSOURCE_DIR=\"<https://builds.apache.org/job/Mesos-Trunk-Ubuntu-Build-Out-Of-Src-Disable-Java-Disable-Python-Disable-Webui/ws/build/..\"> -DBUILD_DIR=\"<https://builds.apache.org/job/Mesos-Trunk-Ubuntu-Build-Out-Of-Src-Disable-Java-Disable-Python-Disable-Webui/ws/build\"> -I../../third_party/gmock-1.6.0/gtest/include -I../../third_party/gmock-1.6.0/include    -g2 -O2 -MT tests/mesos_tests-utils.o -MD -MP -MF tests/.deps/mesos_tests-utils.Tpo -c -o tests/mesos_tests-utils.o `test -f 'tests/utils.cpp' || echo '../../src/'`tests/utils.cpp
In file included from ../../third_party/boost-1.37.0/boost/uuid/random_generator.hpp:12,
                 from ../../third_party/boost-1.37.0/boost/uuid/uuid_generators.hpp:17,
                 from ../../src/common/uuid.hpp:29,
                 from ../../src/slave/slave.hpp:33,
                 from ../../src/tests/utils.hpp:40,
                 from ../../src/tests/utils.cpp:25:
../../third_party/boost-1.37.0/boost/uuid/seed_rng.hpp: In member function 'void boost::uuids::detail::seed_rng::sha1_random_digest_()':
../../third_party/boost-1.37.0/boost/uuid/seed_rng.hpp:153: warning: ignoring return value of 'size_t fread(void*, size_t, size_t, FILE*)', declared with attribute warn_unused_result
mv -f tests/.deps/mesos_tests-utils.Tpo tests/.deps/mesos_tests-utils.Po
g++ -DPACKAGE_NAME=\"mesos\" -DPACKAGE_TARNAME=\"mesos\" -DPACKAGE_VERSION=\"0.0.1\" -DPACKAGE_STRING=\"mesos\ 0.0.1\" -DPACKAGE_BUGREPORT=\"\" -DPACKAGE_URL=\"\" -DPACKAGE=\"mesos\" -DVERSION=\"0.0.1\" -DSTDC_HEADERS=1 -DHAVE_SYS_TYPES_H=1 -DHAVE_SYS_STAT_H=1 -DHAVE_STDLIB_H=1 -DHAVE_STRING_H=1 -DHAVE_MEMORY_H=1 -DHAVE_STRINGS_H=1 -DHAVE_INTTYPES_H=1 -DHAVE_STDINT_H=1 -DHAVE_UNISTD_H=1 -DHAVE_DLFCN_H=1 -DLT_OBJDIR=\".libs/\" -DHAVE_PTHREAD=1 -I. -I../../src   -DMESOS_WEBUI_DIR=\"/usr/local/share/mesos/webui\" -DMESOS_LIBEXECDIR=\"/usr/local/libexec/mesos\" -I../../include -I../../third_party/boost-1.37.0 -I../../third_party/protobuf-2.3.0/src -I../../third_party/glog-0.3.1/src -I../third_party/glog-0.3.1/src -I../../third_party/libprocess/include -I../../third_party/zookeeper-3.3.1/src/c/include -I../../third_party/zookeeper-3.3.1/src/c/generated -DSOURCE_DIR=\"<https://builds.apache.org/job/Mesos-Trunk-Ubuntu-Build-Out-Of-Src-Disable-Java-Disable-Python-Disable-Webui/ws/build/..\"> -DBUILD_DIR=\"<https://builds.apache.org/job/Mesos-Trunk-Ubuntu-Build-Out-Of-Src-Disable-Java-Disable-Python-Disable-Webui/ws/build\"> -I../../third_party/gmock-1.6.0/gtest/include -I../../third_party/gmock-1.6.0/include    -g2 -O2 -MT tests/mesos_tests-master_tests.o -MD -MP -MF tests/.deps/mesos_tests-master_tests.Tpo -c -o tests/mesos_tests-master_tests.o `test -f 'tests/master_tests.cpp' || echo '../../src/'`tests/master_tests.cpp
In file included from ../../third_party/boost-1.37.0/boost/uuid/random_generator.hpp:12,
                 from ../../third_party/boost-1.37.0/boost/uuid/uuid_generators.hpp:17,
                 from ../../src/common/uuid.hpp:29,
                 from ../../src/slave/slave.hpp:33,
                 from ../../src/tests/master_tests.cpp:35:
../../third_party/boost-1.37.0/boost/uuid/seed_rng.hpp: In member function 'void boost::uuids::detail::seed_rng::sha1_random_digest_()':
../../third_party/boost-1.37.0/boost/uuid/seed_rng.hpp:153: warning: ignoring return value of 'size_t fread(void*, size_t, size_t, FILE*)', declared with attribute warn_unused_result
mv -f tests/.deps/mesos_tests-master_tests.Tpo tests/.deps/mesos_tests-master_tests.Po
g++ -DPACKAGE_NAME=\"mesos\" -DPACKAGE_TARNAME=\"mesos\" -DPACKAGE_VERSION=\"0.0.1\" -DPACKAGE_STRING=\"mesos\ 0.0.1\" -DPACKAGE_BUGREPORT=\"\" -DPACKAGE_URL=\"\" -DPACKAGE=\"mesos\" -DVERSION=\"0.0.1\" -DSTDC_HEADERS=1 -DHAVE_SYS_TYPES_H=1 -DHAVE_SYS_STAT_H=1 -DHAVE_STDLIB_H=1 -DHAVE_STRING_H=1 -DHAVE_MEMORY_H=1 -DHAVE_STRINGS_H=1 -DHAVE_INTTYPES_H=1 -DHAVE_STDINT_H=1 -DHAVE_UNISTD_H=1 -DHAVE_DLFCN_H=1 -DLT_OBJDIR=\".libs/\" -DHAVE_PTHREAD=1 -I. -I../../src   -DMESOS_WEBUI_DIR=\"/usr/local/share/mesos/webui\" -DMESOS_LIBEXECDIR=\"/usr/local/libexec/mesos\" -I../../include -I../../third_party/boost-1.37.0 -I../../third_party/protobuf-2.3.0/src -I../../third_party/glog-0.3.1/src -I../third_party/glog-0.3.1/src -I../../third_party/libprocess/include -I../../third_party/zookeeper-3.3.1/src/c/include -I../../third_party/zookeeper-3.3.1/src/c/generated -DSOURCE_DIR=\"<https://builds.apache.org/job/Mesos-Trunk-Ubuntu-Build-Out-Of-Src-Disable-Java-Disable-Python-Disable-Webui/ws/build/..\"> -DBUILD_DIR=\"<https://builds.apache.org/job/Mesos-Trunk-Ubuntu-Build-Out-Of-Src-Disable-Java-Disable-Python-Disable-Webui/ws/build\"> -I../../third_party/gmock-1.6.0/gtest/include -I../../third_party/gmock-1.6.0/include    -g2 -O2 -MT tests/mesos_tests-resource_offers_tests.o -MD -MP -MF tests/.deps/mesos_tests-resource_offers_tests.Tpo -c -o tests/mesos_tests-resource_offers_tests.o `test -f 'tests/resource_offers_tests.cpp' || echo '../../src/'`tests/resource_offers_tests.cpp
In file included from ../../third_party/boost-1.37.0/boost/uuid/random_generator.hpp:12,
                 from ../../third_party/boost-1.37.0/boost/uuid/uuid_generators.hpp:17,
                 from ../../src/common/uuid.hpp:29,
                 from ../../src/slave/slave.hpp:33,
                 from ../../src/tests/resource_offers_tests.cpp:28:
../../third_party/boost-1.37.0/boost/uuid/seed_rng.hpp: In member function 'void boost::uuids::detail::seed_rng::sha1_random_digest_()':
../../third_party/boost-1.37.0/boost/uuid/seed_rng.hpp:153: warning: ignoring return value of 'size_t fread(void*, size_t, size_t, FILE*)', declared with attribute warn_unused_result
mv -f tests/.deps/mesos_tests-resource_offers_tests.Tpo tests/.deps/mesos_tests-resource_offers_tests.Po
g++ -DPACKAGE_NAME=\"mesos\" -DPACKAGE_TARNAME=\"mesos\" -DPACKAGE_VERSION=\"0.0.1\" -DPACKAGE_STRING=\"mesos\ 0.0.1\" -DPACKAGE_BUGREPORT=\"\" -DPACKAGE_URL=\"\" -DPACKAGE=\"mesos\" -DVERSION=\"0.0.1\" -DSTDC_HEADERS=1 -DHAVE_SYS_TYPES_H=1 -DHAVE_SYS_STAT_H=1 -DHAVE_STDLIB_H=1 -DHAVE_STRING_H=1 -DHAVE_MEMORY_H=1 -DHAVE_STRINGS_H=1 -DHAVE_INTTYPES_H=1 -DHAVE_STDINT_H=1 -DHAVE_UNISTD_H=1 -DHAVE_DLFCN_H=1 -DLT_OBJDIR=\".libs/\" -DHAVE_PTHREAD=1 -I. -I../../src   -DMESOS_WEBUI_DIR=\"/usr/local/share/mesos/webui\" -DMESOS_LIBEXECDIR=\"/usr/local/libexec/mesos\" -I../../include -I../../third_party/boost-1.37.0 -I../../third_party/protobuf-2.3.0/src -I../../third_party/glog-0.3.1/src -I../third_party/glog-0.3.1/src -I../../third_party/libprocess/include -I../../third_party/zookeeper-3.3.1/src/c/include -I../../third_party/zookeeper-3.3.1/src/c/generated -DSOURCE_DIR=\"<https://builds.apache.org/job/Mesos-Trunk-Ubuntu-Build-Out-Of-Src-Disable-Java-Disable-Python-Disable-Webui/ws/build/..\"> -DBUILD_DIR=\"<https://builds.apache.org/job/Mesos-Trunk-Ubuntu-Build-Out-Of-Src-Disable-Java-Disable-Python-Disable-Webui/ws/build\"> -I../../third_party/gmock-1.6.0/gtest/include -I../../third_party/gmock-1.6.0/include    -g2 -O2 -MT tests/mesos_tests-fault_tolerance_tests.o -MD -MP -MF tests/.deps/mesos_tests-fault_tolerance_tests.Tpo -c -o tests/mesos_tests-fault_tolerance_tests.o `test -f 'tests/fault_tolerance_tests.cpp' || echo '../../src/'`tests/fault_tolerance_tests.cpp
In file included from ../../third_party/boost-1.37.0/boost/uuid/random_generator.hpp:12,
                 from ../../third_party/boost-1.37.0/boost/uuid/uuid_generators.hpp:17,
                 from ../../src/common/uuid.hpp:29,
                 from ../../src/slave/slave.hpp:33,
                 from ../../src/slave/process_based_isolation_module.hpp:28,
                 from ../../src/tests/fault_tolerance_tests.cpp:31:
../../third_party/boost-1.37.0/boost/uuid/seed_rng.hpp: In member function 'void boost::uuids::detail::seed_rng::sha1_random_digest_()':
../../third_party/boost-1.37.0/boost/uuid/seed_rng.hpp:153: warning: ignoring return value of 'size_t fread(void*, size_t, size_t, FILE*)', declared with attribute warn_unused_result
mv -f tests/.deps/mesos_tests-fault_tolerance_tests.Tpo tests/.deps/mesos_tests-fault_tolerance_tests.Po
g++ -DPACKAGE_NAME=\"mesos\" -DPACKAGE_TARNAME=\"mesos\" -DPACKAGE_VERSION=\"0.0.1\" -DPACKAGE_STRING=\"mesos\ 0.0.1\" -DPACKAGE_BUGREPORT=\"\" -DPACKAGE_URL=\"\" -DPACKAGE=\"mesos\" -DVERSION=\"0.0.1\" -DSTDC_HEADERS=1 -DHAVE_SYS_TYPES_H=1 -DHAVE_SYS_STAT_H=1 -DHAVE_STDLIB_H=1 -DHAVE_STRING_H=1 -DHAVE_MEMORY_H=1 -DHAVE_STRINGS_H=1 -DHAVE_INTTYPES_H=1 -DHAVE_STDINT_H=1 -DHAVE_UNISTD_H=1 -DHAVE_DLFCN_H=1 -DLT_OBJDIR=\".libs/\" -DHAVE_PTHREAD=1 -I. -I../../src   -DMESOS_WEBUI_DIR=\"/usr/local/share/mesos/webui\" -DMESOS_LIBEXECDIR=\"/usr/local/libexec/mesos\" -I../../include -I../../third_party/boost-1.37.0 -I../../third_party/protobuf-2.3.0/src -I../../third_party/glog-0.3.1/src -I../third_party/glog-0.3.1/src -I../../third_party/libprocess/include -I../../third_party/zookeeper-3.3.1/src/c/include -I../../third_party/zookeeper-3.3.1/src/c/generated -DSOURCE_DIR=\"<https://builds.apache.org/job/Mesos-Trunk-Ubuntu-Build-Out-Of-Src-Disable-Java-Disable-Python-Disable-Webui/ws/build/..\"> -DBUILD_DIR=\"<https://builds.apache.org/job/Mesos-Trunk-Ubuntu-Build-Out-Of-Src-Disable-Java-Disable-Python-Disable-Webui/ws/build\"> -I../../third_party/gmock-1.6.0/gtest/include -I../../third_party/gmock-1.6.0/include    -g2 -O2 -MT tests/mesos_tests-log_tests.o -MD -MP -MF tests/.deps/mesos_tests-log_tests.Tpo -c -o tests/mesos_tests-log_tests.o `test -f 'tests/log_tests.cpp' || echo '../../src/'`tests/log_tests.cpp
In file included from ../../third_party/boost-1.37.0/boost/uuid/random_generator.hpp:12,
                 from ../../third_party/boost-1.37.0/boost/uuid/uuid_generators.hpp:17,
                 from ../../src/common/uuid.hpp:29,
                 from ../../src/slave/slave.hpp:33,
                 from ../../src/tests/utils.hpp:40,
                 from ../../src/tests/log_tests.cpp:37:
../../third_party/boost-1.37.0/boost/uuid/seed_rng.hpp: In member function 'void boost::uuids::detail::seed_rng::sha1_random_digest_()':
../../third_party/boost-1.37.0/boost/uuid/seed_rng.hpp:153: warning: ignoring return value of 'size_t fread(void*, size_t, size_t, FILE*)', declared with attribute warn_unused_result
mv -f tests/.deps/mesos_tests-log_tests.Tpo tests/.deps/mesos_tests-log_tests.Po
g++ -DPACKAGE_NAME=\"mesos\" -DPACKAGE_TARNAME=\"mesos\" -DPACKAGE_VERSION=\"0.0.1\" -DPACKAGE_STRING=\"mesos\ 0.0.1\" -DPACKAGE_BUGREPORT=\"\" -DPACKAGE_URL=\"\" -DPACKAGE=\"mesos\" -DVERSION=\"0.0.1\" -DSTDC_HEADERS=1 -DHAVE_SYS_TYPES_H=1 -DHAVE_SYS_STAT_H=1 -DHAVE_STDLIB_H=1 -DHAVE_STRING_H=1 -DHAVE_MEMORY_H=1 -DHAVE_STRINGS_H=1 -DHAVE_INTTYPES_H=1 -DHAVE_STDINT_H=1 -DHAVE_UNISTD_H=1 -DHAVE_DLFCN_H=1 -DLT_OBJDIR=\".libs/\" -DHAVE_PTHREAD=1 -I. -I../../src   -DMESOS_WEBUI_DIR=\"/usr/local/share/mesos/webui\" -DMESOS_LIBEXECDIR=\"/usr/local/libexec/mesos\" -I../../include -I../../third_party/boost-1.37.0 -I../../third_party/protobuf-2.3.0/src -I../../third_party/glog-0.3.1/src -I../third_party/glog-0.3.1/src -I../../third_party/libprocess/include -I../../third_party/zookeeper-3.3.1/src/c/include -I../../third_party/zookeeper-3.3.1/src/c/generated -DSOURCE_DIR=\"<https://builds.apache.org/job/Mesos-Trunk-Ubuntu-Build-Out-Of-Src-Disable-Java-Disable-Python-Disable-Webui/ws/build/..\"> -DBUILD_DIR=\"<https://builds.apache.org/job/Mesos-Trunk-Ubuntu-Build-Out-Of-Src-Disable-Java-Disable-Python-Disable-Webui/ws/build\"> -I../../third_party/gmock-1.6.0/gtest/include -I../../third_party/gmock-1.6.0/include    -g2 -O2 -MT tests/mesos_tests-resources_tests.o -MD -MP -MF tests/.deps/mesos_tests-resources_tests.Tpo -c -o tests/mesos_tests-resources_tests.o `test -f 'tests/resources_tests.cpp' || echo '../../src/'`tests/resources_tests.cpp
mv -f tests/.deps/mesos_tests-resources_tests.Tpo tests/.deps/mesos_tests-resources_tests.Po
g++ -DPACKAGE_NAME=\"mesos\" -DPACKAGE_TARNAME=\"mesos\" -DPACKAGE_VERSION=\"0.0.1\" -DPACKAGE_STRING=\"mesos\ 0.0.1\" -DPACKAGE_BUGREPORT=\"\" -DPACKAGE_URL=\"\" -DPACKAGE=\"mesos\" -DVERSION=\"0.0.1\" -DSTDC_HEADERS=1 -DHAVE_SYS_TYPES_H=1 -DHAVE_SYS_STAT_H=1 -DHAVE_STDLIB_H=1 -DHAVE_STRING_H=1 -DHAVE_MEMORY_H=1 -DHAVE_STRINGS_H=1 -DHAVE_INTTYPES_H=1 -DHAVE_STDINT_H=1 -DHAVE_UNISTD_H=1 -DHAVE_DLFCN_H=1 -DLT_OBJDIR=\".libs/\" -DHAVE_PTHREAD=1 -I. -I../../src   -DMESOS_WEBUI_DIR=\"/usr/local/share/mesos/webui\" -DMESOS_LIBEXECDIR=\"/usr/local/libexec/mesos\" -I../../include -I../../third_party/boost-1.37.0 -I../../third_party/protobuf-2.3.0/src -I../../third_party/glog-0.3.1/src -I../third_party/glog-0.3.1/src -I../../third_party/libprocess/include -I../../third_party/zookeeper-3.3.1/src/c/include -I../../third_party/zookeeper-3.3.1/src/c/generated -DSOURCE_DIR=\"<https://builds.apache.org/job/Mesos-Trunk-Ubuntu-Build-Out-Of-Src-Disable-Java-Disable-Python-Disable-Webui/ws/build/..\"> -DBUILD_DIR=\"<https://builds.apache.org/job/Mesos-Trunk-Ubuntu-Build-Out-Of-Src-Disable-Java-Disable-Python-Disable-Webui/ws/build\"> -I../../third_party/gmock-1.6.0/gtest/include -I../../third_party/gmock-1.6.0/include    -g2 -O2 -MT tests/mesos_tests-uuid_tests.o -MD -MP -MF tests/.deps/mesos_tests-uuid_tests.Tpo -c -o tests/mesos_tests-uuid_tests.o `test -f 'tests/uuid_tests.cpp' || echo '../../src/'`tests/uuid_tests.cpp
In file included from ../../third_party/boost-1.37.0/boost/uuid/random_generator.hpp:12,
                 from ../../third_party/boost-1.37.0/boost/uuid/uuid_generators.hpp:17,
                 from ../../src/common/uuid.hpp:29,
                 from ../../src/tests/uuid_tests.cpp:21:
../../third_party/boost-1.37.0/boost/uuid/seed_rng.hpp: In member function 'void boost::uuids::detail::seed_rng::sha1_random_digest_()':
../../third_party/boost-1.37.0/boost/uuid/seed_rng.hpp:153: warning: ignoring return value of 'size_t fread(void*, size_t, size_t, FILE*)', declared with attribute warn_unused_result
mv -f tests/.deps/mesos_tests-uuid_tests.Tpo tests/.deps/mesos_tests-uuid_tests.Po
g++ -DPACKAGE_NAME=\"mesos\" -DPACKAGE_TARNAME=\"mesos\" -DPACKAGE_VERSION=\"0.0.1\" -DPACKAGE_STRING=\"mesos\ 0.0.1\" -DPACKAGE_BUGREPORT=\"\" -DPACKAGE_URL=\"\" -DPACKAGE=\"mesos\" -DVERSION=\"0.0.1\" -DSTDC_HEADERS=1 -DHAVE_SYS_TYPES_H=1 -DHAVE_SYS_STAT_H=1 -DHAVE_STDLIB_H=1 -DHAVE_STRING_H=1 -DHAVE_MEMORY_H=1 -DHAVE_STRINGS_H=1 -DHAVE_INTTYPES_H=1 -DHAVE_STDINT_H=1 -DHAVE_UNISTD_H=1 -DHAVE_DLFCN_H=1 -DLT_OBJDIR=\".libs/\" -DHAVE_PTHREAD=1 -I. -I../../src   -DMESOS_WEBUI_DIR=\"/usr/local/share/mesos/webui\" -DMESOS_LIBEXECDIR=\"/usr/local/libexec/mesos\" -I../../include -I../../third_party/boost-1.37.0 -I../../third_party/protobuf-2.3.0/src -I../../third_party/glog-0.3.1/src -I../third_party/glog-0.3.1/src -I../../third_party/libprocess/include -I../../third_party/zookeeper-3.3.1/src/c/include -I../../third_party/zookeeper-3.3.1/src/c/generated -DSOURCE_DIR=\"<https://builds.apache.org/job/Mesos-Trunk-Ubuntu-Build-Out-Of-Src-Disable-Java-Disable-Python-Disable-Webui/ws/build/..\"> -DBUILD_DIR=\"<https://builds.apache.org/job/Mesos-Trunk-Ubuntu-Build-Out-Of-Src-Disable-Java-Disable-Python-Disable-Webui/ws/build\"> -I../../third_party/gmock-1.6.0/gtest/include -I../../third_party/gmock-1.6.0/include    -g2 -O2 -MT tests/mesos_tests-external_tests.o -MD -MP -MF tests/.deps/mesos_tests-external_tests.Tpo -c -o tests/mesos_tests-external_tests.o `test -f 'tests/external_tests.cpp' || echo '../../src/'`tests/external_tests.cpp
In file included from ../../third_party/boost-1.37.0/boost/uuid/random_generator.hpp:12,
                 from ../../third_party/boost-1.37.0/boost/uuid/uuid_generators.hpp:17,
                 from ../../src/common/uuid.hpp:29,
                 from ../../src/slave/slave.hpp:33,
                 from ../../src/tests/utils.hpp:40,
                 from ../../src/tests/external_tests.cpp:30:
../../third_party/boost-1.37.0/boost/uuid/seed_rng.hpp: In member function 'void boost::uuids::detail::seed_rng::sha1_random_digest_()':
../../third_party/boost-1.37.0/boost/uuid/seed_rng.hpp:153: warning: ignoring return value of 'size_t fread(void*, size_t, size_t, FILE*)', declared with attribute warn_unused_result
mv -f tests/.deps/mesos_tests-external_tests.Tpo tests/.deps/mesos_tests-external_tests.Po
g++ -DPACKAGE_NAME=\"mesos\" -DPACKAGE_TARNAME=\"mesos\" -DPACKAGE_VERSION=\"0.0.1\" -DPACKAGE_STRING=\"mesos\ 0.0.1\" -DPACKAGE_BUGREPORT=\"\" -DPACKAGE_URL=\"\" -DPACKAGE=\"mesos\" -DVERSION=\"0.0.1\" -DSTDC_HEADERS=1 -DHAVE_SYS_TYPES_H=1 -DHAVE_SYS_STAT_H=1 -DHAVE_STDLIB_H=1 -DHAVE_STRING_H=1 -DHAVE_MEMORY_H=1 -DHAVE_STRINGS_H=1 -DHAVE_INTTYPES_H=1 -DHAVE_STDINT_H=1 -DHAVE_UNISTD_H=1 -DHAVE_DLFCN_H=1 -DLT_OBJDIR=\".libs/\" -DHAVE_PTHREAD=1 -I. -I../../src   -DMESOS_WEBUI_DIR=\"/usr/local/share/mesos/webui\" -DMESOS_LIBEXECDIR=\"/usr/local/libexec/mesos\" -I../../include -I../../third_party/boost-1.37.0 -I../../third_party/protobuf-2.3.0/src -I../../third_party/glog-0.3.1/src -I../third_party/glog-0.3.1/src -I../../third_party/libprocess/include -I../../third_party/zookeeper-3.3.1/src/c/include -I../../third_party/zookeeper-3.3.1/src/c/generated -DSOURCE_DIR=\"<https://builds.apache.org/job/Mesos-Trunk-Ubuntu-Build-Out-Of-Src-Disable-Java-Disable-Python-Disable-Webui/ws/build/..\"> -DBUILD_DIR=\"<https://builds.apache.org/job/Mesos-Trunk-Ubuntu-Build-Out-Of-Src-Disable-Java-Disable-Python-Disable-Webui/ws/build\"> -I../../third_party/gmock-1.6.0/gtest/include -I../../third_party/gmock-1.6.0/include    -g2 -O2 -MT tests/mesos_tests-sample_frameworks_tests.o -MD -MP -MF tests/.deps/mesos_tests-sample_frameworks_tests.Tpo -c -o tests/mesos_tests-sample_frameworks_tests.o `test -f 'tests/sample_frameworks_tests.cpp' || echo '../../src/'`tests/sample_frameworks_tests.cpp
mv -f tests/.deps/mesos_tests-sample_frameworks_tests.Tpo tests/.deps/mesos_tests-sample_frameworks_tests.Po
g++ -DPACKAGE_NAME=\"mesos\" -DPACKAGE_TARNAME=\"mesos\" -DPACKAGE_VERSION=\"0.0.1\" -DPACKAGE_STRING=\"mesos\ 0.0.1\" -DPACKAGE_BUGREPORT=\"\" -DPACKAGE_URL=\"\" -DPACKAGE=\"mesos\" -DVERSION=\"0.0.1\" -DSTDC_HEADERS=1 -DHAVE_SYS_TYPES_H=1 -DHAVE_SYS_STAT_H=1 -DHAVE_STDLIB_H=1 -DHAVE_STRING_H=1 -DHAVE_MEMORY_H=1 -DHAVE_STRINGS_H=1 -DHAVE_INTTYPES_H=1 -DHAVE_STDINT_H=1 -DHAVE_UNISTD_H=1 -DHAVE_DLFCN_H=1 -DLT_OBJDIR=\".libs/\" -DHAVE_PTHREAD=1 -I. -I../../src   -DMESOS_WEBUI_DIR=\"/usr/local/share/mesos/webui\" -DMESOS_LIBEXECDIR=\"/usr/local/libexec/mesos\" -I../../include -I../../third_party/boost-1.37.0 -I../../third_party/protobuf-2.3.0/src -I../../third_party/glog-0.3.1/src -I../third_party/glog-0.3.1/src -I../../third_party/libprocess/include -I../../third_party/zookeeper-3.3.1/src/c/include -I../../third_party/zookeeper-3.3.1/src/c/generated -DSOURCE_DIR=\"<https://builds.apache.org/job/Mesos-Trunk-Ubuntu-Build-Out-Of-Src-Disable-Java-Disable-Python-Disable-Webui/ws/build/..\"> -DBUILD_DIR=\"<https://builds.apache.org/job/Mesos-Trunk-Ubuntu-Build-Out-Of-Src-Disable-Java-Disable-Python-Disable-Webui/ws/build\"> -I../../third_party/gmock-1.6.0/gtest/include -I../../third_party/gmock-1.6.0/include    -g2 -O2 -MT tests/mesos_tests-configurator_tests.o -MD -MP -MF tests/.deps/mesos_tests-configurator_tests.Tpo -c -o tests/mesos_tests-configurator_tests.o `test -f 'tests/configurator_tests.cpp' || echo '../../src/'`tests/configurator_tests.cpp
In file included from ../../third_party/boost-1.37.0/boost/uuid/random_generator.hpp:12,
                 from ../../third_party/boost-1.37.0/boost/uuid/uuid_generators.hpp:17,
                 from ../../src/common/uuid.hpp:29,
                 from ../../src/slave/slave.hpp:33,
                 from ../../src/tests/utils.hpp:40,
                 from ../../src/tests/configurator_tests.cpp:27:
../../third_party/boost-1.37.0/boost/uuid/seed_rng.hpp: In member function 'void boost::uuids::detail::seed_rng::sha1_random_digest_()':
../../third_party/boost-1.37.0/boost/uuid/seed_rng.hpp:153: warning: ignoring return value of 'size_t fread(void*, size_t, size_t, FILE*)', declared with attribute warn_unused_result
mv -f tests/.deps/mesos_tests-configurator_tests.Tpo tests/.deps/mesos_tests-configurator_tests.Po
g++ -DPACKAGE_NAME=\"mesos\" -DPACKAGE_TARNAME=\"mesos\" -DPACKAGE_VERSION=\"0.0.1\" -DPACKAGE_STRING=\"mesos\ 0.0.1\" -DPACKAGE_BUGREPORT=\"\" -DPACKAGE_URL=\"\" -DPACKAGE=\"mesos\" -DVERSION=\"0.0.1\" -DSTDC_HEADERS=1 -DHAVE_SYS_TYPES_H=1 -DHAVE_SYS_STAT_H=1 -DHAVE_STDLIB_H=1 -DHAVE_STRING_H=1 -DHAVE_MEMORY_H=1 -DHAVE_STRINGS_H=1 -DHAVE_INTTYPES_H=1 -DHAVE_STDINT_H=1 -DHAVE_UNISTD_H=1 -DHAVE_DLFCN_H=1 -DLT_OBJDIR=\".libs/\" -DHAVE_PTHREAD=1 -I. -I../../src   -DMESOS_WEBUI_DIR=\"/usr/local/share/mesos/webui\" -DMESOS_LIBEXECDIR=\"/usr/local/libexec/mesos\" -I../../include -I../../third_party/boost-1.37.0 -I../../third_party/protobuf-2.3.0/src -I../../third_party/glog-0.3.1/src -I../third_party/glog-0.3.1/src -I../../third_party/libprocess/include -I../../third_party/zookeeper-3.3.1/src/c/include -I../../third_party/zookeeper-3.3.1/src/c/generated -DSOURCE_DIR=\"<https://builds.apache.org/job/Mesos-Trunk-Ubuntu-Build-Out-Of-Src-Disable-Java-Disable-Python-Disable-Webui/ws/build/..\"> -DBUILD_DIR=\"<https://builds.apache.org/job/Mesos-Trunk-Ubuntu-Build-Out-Of-Src-Disable-Java-Disable-Python-Disable-Webui/ws/build\"> -I../../third_party/gmock-1.6.0/gtest/include -I../../third_party/gmock-1.6.0/include    -g2 -O2 -MT tests/mesos_tests-strings_tests.o -MD -MP -MF tests/.deps/mesos_tests-strings_tests.Tpo -c -o tests/mesos_tests-strings_tests.o `test -f 'tests/strings_tests.cpp' || echo '../../src/'`tests/strings_tests.cpp
mv -f tests/.deps/mesos_tests-strings_tests.Tpo tests/.deps/mesos_tests-strings_tests.Po
g++ -DPACKAGE_NAME=\"mesos\" -DPACKAGE_TARNAME=\"mesos\" -DPACKAGE_VERSION=\"0.0.1\" -DPACKAGE_STRING=\"mesos\ 0.0.1\" -DPACKAGE_BUGREPORT=\"\" -DPACKAGE_URL=\"\" -DPACKAGE=\"mesos\" -DVERSION=\"0.0.1\" -DSTDC_HEADERS=1 -DHAVE_SYS_TYPES_H=1 -DHAVE_SYS_STAT_H=1 -DHAVE_STDLIB_H=1 -DHAVE_STRING_H=1 -DHAVE_MEMORY_H=1 -DHAVE_STRINGS_H=1 -DHAVE_INTTYPES_H=1 -DHAVE_STDINT_H=1 -DHAVE_UNISTD_H=1 -DHAVE_DLFCN_H=1 -DLT_OBJDIR=\".libs/\" -DHAVE_PTHREAD=1 -I. -I../../src   -DMESOS_WEBUI_DIR=\"/usr/local/share/mesos/webui\" -DMESOS_LIBEXECDIR=\"/usr/local/libexec/mesos\" -I../../include -I../../third_party/boost-1.37.0 -I../../third_party/protobuf-2.3.0/src -I../../third_party/glog-0.3.1/src -I../third_party/glog-0.3.1/src -I../../third_party/libprocess/include -I../../third_party/zookeeper-3.3.1/src/c/include -I../../third_party/zookeeper-3.3.1/src/c/generated -DSOURCE_DIR=\"<https://builds.apache.org/job/Mesos-Trunk-Ubuntu-Build-Out-Of-Src-Disable-Java-Disable-Python-Disable-Webui/ws/build/..\"> -DBUILD_DIR=\"<https://builds.apache.org/job/Mesos-Trunk-Ubuntu-Build-Out-Of-Src-Disable-Java-Disable-Python-Disable-Webui/ws/build\"> -I../../third_party/gmock-1.6.0/gtest/include -I../../third_party/gmock-1.6.0/include    -g2 -O2 -MT tests/mesos_tests-multihashmap_tests.o -MD -MP -MF tests/.deps/mesos_tests-multihashmap_tests.Tpo -c -o tests/mesos_tests-multihashmap_tests.o `test -f 'tests/multihashmap_tests.cpp' || echo '../../src/'`tests/multihashmap_tests.cpp
mv -f tests/.deps/mesos_tests-multihashmap_tests.Tpo tests/.deps/mesos_tests-multihashmap_tests.Po
g++ -DPACKAGE_NAME=\"mesos\" -DPACKAGE_TARNAME=\"mesos\" -DPACKAGE_VERSION=\"0.0.1\" -DPACKAGE_STRING=\"mesos\ 0.0.1\" -DPACKAGE_BUGREPORT=\"\" -DPACKAGE_URL=\"\" -DPACKAGE=\"mesos\" -DVERSION=\"0.0.1\" -DSTDC_HEADERS=1 -DHAVE_SYS_TYPES_H=1 -DHAVE_SYS_STAT_H=1 -DHAVE_STDLIB_H=1 -DHAVE_STRING_H=1 -DHAVE_MEMORY_H=1 -DHAVE_STRINGS_H=1 -DHAVE_INTTYPES_H=1 -DHAVE_STDINT_H=1 -DHAVE_UNISTD_H=1 -DHAVE_DLFCN_H=1 -DLT_OBJDIR=\".libs/\" -DHAVE_PTHREAD=1 -I. -I../../src   -DMESOS_WEBUI_DIR=\"/usr/local/share/mesos/webui\" -DMESOS_LIBEXECDIR=\"/usr/local/libexec/mesos\" -I../../include -I../../third_party/boost-1.37.0 -I../../third_party/protobuf-2.3.0/src -I../../third_party/glog-0.3.1/src -I../third_party/glog-0.3.1/src -I../../third_party/libprocess/include -I../../third_party/zookeeper-3.3.1/src/c/include -I../../third_party/zookeeper-3.3.1/src/c/generated -DSOURCE_DIR=\"<https://builds.apache.org/job/Mesos-Trunk-Ubuntu-Build-Out-Of-Src-Disable-Java-Disable-Python-Disable-Webui/ws/build/..\"> -DBUILD_DIR=\"<https://builds.apache.org/job/Mesos-Trunk-Ubuntu-Build-Out-Of-Src-Disable-Java-Disable-Python-Disable-Webui/ws/build\"> -I../../third_party/gmock-1.6.0/gtest/include -I../../third_party/gmock-1.6.0/include    -g2 -O2 -MT tests/mesos_tests-protobuf_io_tests.o -MD -MP -MF tests/.deps/mesos_tests-protobuf_io_tests.Tpo -c -o tests/mesos_tests-protobuf_io_tests.o `test -f 'tests/protobuf_io_tests.cpp' || echo '../../src/'`tests/protobuf_io_tests.cpp
mv -f tests/.deps/mesos_tests-protobuf_io_tests.Tpo tests/.deps/mesos_tests-protobuf_io_tests.Po
g++ -DPACKAGE_NAME=\"mesos\" -DPACKAGE_TARNAME=\"mesos\" -DPACKAGE_VERSION=\"0.0.1\" -DPACKAGE_STRING=\"mesos\ 0.0.1\" -DPACKAGE_BUGREPORT=\"\" -DPACKAGE_URL=\"\" -DPACKAGE=\"mesos\" -DVERSION=\"0.0.1\" -DSTDC_HEADERS=1 -DHAVE_SYS_TYPES_H=1 -DHAVE_SYS_STAT_H=1 -DHAVE_STDLIB_H=1 -DHAVE_STRING_H=1 -DHAVE_MEMORY_H=1 -DHAVE_STRINGS_H=1 -DHAVE_INTTYPES_H=1 -DHAVE_STDINT_H=1 -DHAVE_UNISTD_H=1 -DHAVE_DLFCN_H=1 -DLT_OBJDIR=\".libs/\" -DHAVE_PTHREAD=1 -I. -I../../src   -DMESOS_WEBUI_DIR=\"/usr/local/share/mesos/webui\" -DMESOS_LIBEXECDIR=\"/usr/local/libexec/mesos\" -I../../include -I../../third_party/boost-1.37.0 -I../../third_party/protobuf-2.3.0/src -I../../third_party/glog-0.3.1/src -I../third_party/glog-0.3.1/src -I../../third_party/libprocess/include -I../../third_party/zookeeper-3.3.1/src/c/include -I../../third_party/zookeeper-3.3.1/src/c/generated -DSOURCE_DIR=\"<https://builds.apache.org/job/Mesos-Trunk-Ubuntu-Build-Out-Of-Src-Disable-Java-Disable-Python-Disable-Webui/ws/build/..\"> -DBUILD_DIR=\"<https://builds.apache.org/job/Mesos-Trunk-Ubuntu-Build-Out-Of-Src-Disable-Java-Disable-Python-Disable-Webui/ws/build\"> -I../../third_party/gmock-1.6.0/gtest/include -I../../third_party/gmock-1.6.0/include    -g2 -O2 -MT tests/mesos_tests-lxc_isolation_tests.o -MD -MP -MF tests/.deps/mesos_tests-lxc_isolation_tests.Tpo -c -o tests/mesos_tests-lxc_isolation_tests.o `test -f 'tests/lxc_isolation_tests.cpp' || echo '../../src/'`tests/lxc_isolation_tests.cpp
mv -f tests/.deps/mesos_tests-lxc_isolation_tests.Tpo tests/.deps/mesos_tests-lxc_isolation_tests.Po
g++ -DPACKAGE_NAME=\"mesos\" -DPACKAGE_TARNAME=\"mesos\" -DPACKAGE_VERSION=\"0.0.1\" -DPACKAGE_STRING=\"mesos\ 0.0.1\" -DPACKAGE_BUGREPORT=\"\" -DPACKAGE_URL=\"\" -DPACKAGE=\"mesos\" -DVERSION=\"0.0.1\" -DSTDC_HEADERS=1 -DHAVE_SYS_TYPES_H=1 -DHAVE_SYS_STAT_H=1 -DHAVE_STDLIB_H=1 -DHAVE_STRING_H=1 -DHAVE_MEMORY_H=1 -DHAVE_STRINGS_H=1 -DHAVE_INTTYPES_H=1 -DHAVE_STDINT_H=1 -DHAVE_UNISTD_H=1 -DHAVE_DLFCN_H=1 -DLT_OBJDIR=\".libs/\" -DHAVE_PTHREAD=1 -I. -I../../src   -DMESOS_WEBUI_DIR=\"/usr/local/share/mesos/webui\" -DMESOS_LIBEXECDIR=\"/usr/local/libexec/mesos\" -I../../include -I../../third_party/boost-1.37.0 -I../../third_party/protobuf-2.3.0/src -I../../third_party/glog-0.3.1/src -I../third_party/glog-0.3.1/src -I../../third_party/libprocess/include -I../../third_party/zookeeper-3.3.1/src/c/include -I../../third_party/zookeeper-3.3.1/src/c/generated -DSOURCE_DIR=\"<https://builds.apache.org/job/Mesos-Trunk-Ubuntu-Build-Out-Of-Src-Disable-Java-Disable-Python-Disable-Webui/ws/build/..\"> -DBUILD_DIR=\"<https://builds.apache.org/job/Mesos-Trunk-Ubuntu-Build-Out-Of-Src-Disable-Java-Disable-Python-Disable-Webui/ws/build\"> -I../../third_party/gmock-1.6.0/gtest/include -I../../third_party/gmock-1.6.0/include    -g2 -O2 -MT tests/mesos_tests-utils_tests.o -MD -MP -MF tests/.deps/mesos_tests-utils_tests.Tpo -c -o tests/mesos_tests-utils_tests.o `test -f 'tests/utils_tests.cpp' || echo '../../src/'`tests/utils_tests.cpp
In file included from ../../third_party/boost-1.37.0/boost/uuid/random_generator.hpp:12,
                 from ../../third_party/boost-1.37.0/boost/uuid/uuid_generators.hpp:17,
                 from ../../src/common/uuid.hpp:29,
                 from ../../src/tests/utils_tests.cpp:24:
../../third_party/boost-1.37.0/boost/uuid/seed_rng.hpp: In member function 'void boost::uuids::detail::seed_rng::sha1_random_digest_()':
../../third_party/boost-1.37.0/boost/uuid/seed_rng.hpp:153: warning: ignoring return value of 'size_t fread(void*, size_t, size_t, FILE*)', declared with attribute warn_unused_result
mv -f tests/.deps/mesos_tests-utils_tests.Tpo tests/.deps/mesos_tests-utils_tests.Po
g++ -DPACKAGE_NAME=\"mesos\" -DPACKAGE_TARNAME=\"mesos\" -DPACKAGE_VERSION=\"0.0.1\" -DPACKAGE_STRING=\"mesos\ 0.0.1\" -DPACKAGE_BUGREPORT=\"\" -DPACKAGE_URL=\"\" -DPACKAGE=\"mesos\" -DVERSION=\"0.0.1\" -DSTDC_HEADERS=1 -DHAVE_SYS_TYPES_H=1 -DHAVE_SYS_STAT_H=1 -DHAVE_STDLIB_H=1 -DHAVE_STRING_H=1 -DHAVE_MEMORY_H=1 -DHAVE_STRINGS_H=1 -DHAVE_INTTYPES_H=1 -DHAVE_STDINT_H=1 -DHAVE_UNISTD_H=1 -DHAVE_DLFCN_H=1 -DLT_OBJDIR=\".libs/\" -DHAVE_PTHREAD=1 -I. -I../../src   -DMESOS_WEBUI_DIR=\"/usr/local/share/mesos/webui\" -DMESOS_LIBEXECDIR=\"/usr/local/libexec/mesos\" -I../../include -I../../third_party/boost-1.37.0 -I../../third_party/protobuf-2.3.0/src -I../../third_party/glog-0.3.1/src -I../third_party/glog-0.3.1/src -I../../third_party/libprocess/include -I../../third_party/zookeeper-3.3.1/src/c/include -I../../third_party/zookeeper-3.3.1/src/c/generated -DSOURCE_DIR=\"<https://builds.apache.org/job/Mesos-Trunk-Ubuntu-Build-Out-Of-Src-Disable-Java-Disable-Python-Disable-Webui/ws/build/..\"> -DBUILD_DIR=\"<https://builds.apache.org/job/Mesos-Trunk-Ubuntu-Build-Out-Of-Src-Disable-Java-Disable-Python-Disable-Webui/ws/build\"> -I../../third_party/gmock-1.6.0/gtest/include -I../../third_party/gmock-1.6.0/include    -g2 -O2 -MT tests/mesos_tests-url_processor_tests.o -MD -MP -MF tests/.deps/mesos_tests-url_processor_tests.Tpo -c -o tests/mesos_tests-url_processor_tests.o `test -f 'tests/url_processor_tests.cpp' || echo '../../src/'`tests/url_processor_tests.cpp
In file included from ../../third_party/boost-1.37.0/boost/uuid/random_generator.hpp:12,
                 from ../../third_party/boost-1.37.0/boost/uuid/uuid_generators.hpp:17,
                 from ../../src/common/uuid.hpp:29,
                 from ../../src/tests/url_processor_tests.cpp:28:
../../third_party/boost-1.37.0/boost/uuid/seed_rng.hpp: In member function 'void boost::uuids::detail::seed_rng::sha1_random_digest_()':
../../third_party/boost-1.37.0/boost/uuid/seed_rng.hpp:153: warning: ignoring return value of 'size_t fread(void*, size_t, size_t, FILE*)', declared with attribute warn_unused_result
mv -f tests/.deps/mesos_tests-url_processor_tests.Tpo tests/.deps/mesos_tests-url_processor_tests.Po
g++ -DPACKAGE_NAME=\"mesos\" -DPACKAGE_TARNAME=\"mesos\" -DPACKAGE_VERSION=\"0.0.1\" -DPACKAGE_STRING=\"mesos\ 0.0.1\" -DPACKAGE_BUGREPORT=\"\" -DPACKAGE_URL=\"\" -DPACKAGE=\"mesos\" -DVERSION=\"0.0.1\" -DSTDC_HEADERS=1 -DHAVE_SYS_TYPES_H=1 -DHAVE_SYS_STAT_H=1 -DHAVE_STDLIB_H=1 -DHAVE_STRING_H=1 -DHAVE_MEMORY_H=1 -DHAVE_STRINGS_H=1 -DHAVE_INTTYPES_H=1 -DHAVE_STDINT_H=1 -DHAVE_UNISTD_H=1 -DHAVE_DLFCN_H=1 -DLT_OBJDIR=\".libs/\" -DHAVE_PTHREAD=1 -I. -I../../src   -DMESOS_WEBUI_DIR=\"/usr/local/share/mesos/webui\" -DMESOS_LIBEXECDIR=\"/usr/local/libexec/mesos\" -I../../include -I../../third_party/boost-1.37.0 -I../../third_party/protobuf-2.3.0/src -I../../third_party/glog-0.3.1/src -I../third_party/glog-0.3.1/src -I../../third_party/libprocess/include -I../../third_party/zookeeper-3.3.1/src/c/include -I../../third_party/zookeeper-3.3.1/src/c/generated -DSOURCE_DIR=\"<https://builds.apache.org/job/Mesos-Trunk-Ubuntu-Build-Out-Of-Src-Disable-Java-Disable-Python-Disable-Webui/ws/build/..\"> -DBUILD_DIR=\"<https://builds.apache.org/job/Mesos-Trunk-Ubuntu-Build-Out-Of-Src-Disable-Java-Disable-Python-Disable-Webui/ws/build\"> -I../../third_party/gmock-1.6.0/gtest/include -I../../third_party/gmock-1.6.0/include    -g2 -O2 -MT tests/mesos_tests-killtree_tests.o -MD -MP -MF tests/.deps/mesos_tests-killtree_tests.Tpo -c -o tests/mesos_tests-killtree_tests.o `test -f 'tests/killtree_tests.cpp' || echo '../../src/'`tests/killtree_tests.cpp
mv -f tests/.deps/mesos_tests-killtree_tests.Tpo tests/.deps/mesos_tests-killtree_tests.Po
g++ -DPACKAGE_NAME=\"mesos\" -DPACKAGE_TARNAME=\"mesos\" -DPACKAGE_VERSION=\"0.0.1\" -DPACKAGE_STRING=\"mesos\ 0.0.1\" -DPACKAGE_BUGREPORT=\"\" -DPACKAGE_URL=\"\" -DPACKAGE=\"mesos\" -DVERSION=\"0.0.1\" -DSTDC_HEADERS=1 -DHAVE_SYS_TYPES_H=1 -DHAVE_SYS_STAT_H=1 -DHAVE_STDLIB_H=1 -DHAVE_STRING_H=1 -DHAVE_MEMORY_H=1 -DHAVE_STRINGS_H=1 -DHAVE_INTTYPES_H=1 -DHAVE_STDINT_H=1 -DHAVE_UNISTD_H=1 -DHAVE_DLFCN_H=1 -DLT_OBJDIR=\".libs/\" -DHAVE_PTHREAD=1 -I. -I../../src   -DMESOS_WEBUI_DIR=\"/usr/local/share/mesos/webui\" -DMESOS_LIBEXECDIR=\"/usr/local/libexec/mesos\" -I../../include -I../../third_party/boost-1.37.0 -I../../third_party/protobuf-2.3.0/src -I../../third_party/glog-0.3.1/src -I../third_party/glog-0.3.1/src -I../../third_party/libprocess/include -I../../third_party/zookeeper-3.3.1/src/c/include -I../../third_party/zookeeper-3.3.1/src/c/generated -DSOURCE_DIR=\"<https://builds.apache.org/job/Mesos-Trunk-Ubuntu-Build-Out-Of-Src-Disable-Java-Disable-Python-Disable-Webui/ws/build/..\"> -DBUILD_DIR=\"<https://builds.apache.org/job/Mesos-Trunk-Ubuntu-Build-Out-Of-Src-Disable-Java-Disable-Python-Disable-Webui/ws/build\"> -I../../third_party/gmock-1.6.0/gtest/include -I../../third_party/gmock-1.6.0/include    -g2 -O2 -MT tests/mesos_tests-exception_tests.o -MD -MP -MF tests/.deps/mesos_tests-exception_tests.Tpo -c -o tests/mesos_tests-exception_tests.o `test -f 'tests/exception_tests.cpp' || echo '../../src/'`tests/exception_tests.cpp
In file included from ../../third_party/boost-1.37.0/boost/uuid/random_generator.hpp:12,
                 from ../../third_party/boost-1.37.0/boost/uuid/uuid_generators.hpp:17,
                 from ../../src/common/uuid.hpp:29,
                 from ../../src/slave/slave.hpp:33,
                 from ../../src/slave/process_based_isolation_module.hpp:28,
                 from ../../src/tests/exception_tests.cpp:31:
../../third_party/boost-1.37.0/boost/uuid/seed_rng.hpp: In member function 'void boost::uuids::detail::seed_rng::sha1_random_digest_()':
../../third_party/boost-1.37.0/boost/uuid/seed_rng.hpp:153: warning: ignoring return value of 'size_t fread(void*, size_t, size_t, FILE*)', declared with attribute warn_unused_result
mv -f tests/.deps/mesos_tests-exception_tests.Tpo tests/.deps/mesos_tests-exception_tests.Po
/bin/bash ../libtool --tag=CXX   --mode=link g++  -g2 -O2   -o mesos-tests tests/mesos_tests-main.o tests/mesos_tests-utils.o tests/mesos_tests-master_tests.o tests/mesos_tests-resource_offers_tests.o tests/mesos_tests-fault_tolerance_tests.o tests/mesos_tests-log_tests.o tests/mesos_tests-resources_tests.o tests/mesos_tests-uuid_tests.o tests/mesos_tests-external_tests.o tests/mesos_tests-sample_frameworks_tests.o tests/mesos_tests-configurator_tests.o tests/mesos_tests-strings_tests.o tests/mesos_tests-multihashmap_tests.o tests/mesos_tests-protobuf_io_tests.o tests/mesos_tests-lxc_isolation_tests.o tests/mesos_tests-utils_tests.o tests/mesos_tests-url_processor_tests.o tests/mesos_tests-killtree_tests.o tests/mesos_tests-exception_tests.o  ../.libs/libgmock.la libmesos.la -lrt
libtool: link: g++ -g2 -O2 -o .libs/mesos-tests tests/mesos_tests-main.o tests/mesos_tests-utils.o tests/mesos_tests-master_tests.o tests/mesos_tests-resource_offers_tests.o tests/mesos_tests-fault_tolerance_tests.o tests/mesos_tests-log_tests.o tests/mesos_tests-resources_tests.o tests/mesos_tests-uuid_tests.o tests/mesos_tests-external_tests.o tests/mesos_tests-sample_frameworks_tests.o tests/mesos_tests-configurator_tests.o tests/mesos_tests-strings_tests.o tests/mesos_tests-multihashmap_tests.o tests/mesos_tests-protobuf_io_tests.o tests/mesos_tests-lxc_isolation_tests.o tests/mesos_tests-utils_tests.o tests/mesos_tests-url_processor_tests.o tests/mesos_tests-killtree_tests.o tests/mesos_tests-exception_tests.o  ../.libs/libgmock.a ./.libs/libmesos.so -lrt -pthread
make[3]: *** No rule to make target `examples/java/test-framework'.  Stop.
make[3]: Leaving directory `<https://builds.apache.org/job/Mesos-Trunk-Ubuntu-Build-Out-Of-Src-Disable-Java-Disable-Python-Disable-Webui/ws/build/src'>
make[2]: *** [check-am] Error 2
make[2]: Leaving directory `<https://builds.apache.org/job/Mesos-Trunk-Ubuntu-Build-Out-Of-Src-Disable-Java-Disable-Python-Disable-Webui/ws/build/src'>
make[1]: *** [check] Error 2
make[1]: Leaving directory `<https://builds.apache.org/job/Mesos-Trunk-Ubuntu-Build-Out-Of-Src-Disable-Java-Disable-Python-Disable-Webui/ws/build/src'>
make: *** [check-recursive] Error 1
Build step 'Execute shell' marked build as failure


Mime
View raw message