mesos-dev mailing list archives

Site index · List index
Message view « Date » · « Thread »
Top « Date » · « Thread »
From Apache Jenkins Server <jenk...@builds.apache.org>
Subject Build failed in Jenkins: Mesos-Trunk-Ubuntu-Build-In-Src-Set-JAVA_HOME #36
Date Wed, 01 Feb 2012 04:09:09 GMT
See <https://builds.apache.org/job/Mesos-Trunk-Ubuntu-Build-In-Src-Set-JAVA_HOME/36/>

------------------------------------------
[...truncated 14257 lines...]
2012-02-01 04:08:49,419:31306(0x2b05e7dab700):ZOO_ERROR@handle_socket_error_msg@1579: Socket
[127.0.0.1:43999] zk retcode=-4, errno=111(Connection refused): server refused to accept the
client
2012-02-01 04:08:49,513:31306(0x2b05ec602700):ZOO_ERROR@handle_socket_error_msg@1579: Socket
[127.0.0.1:37076] zk retcode=-4, errno=111(Connection refused): server refused to accept the
client
2012-02-01 04:08:49,642:31306(0x2b05ec401700):ZOO_ERROR@handle_socket_error_msg@1579: Socket
[127.0.0.1:39805] zk retcode=-4, errno=111(Connection refused): server refused to accept the
client
2012-02-01 04:08:49,642:31306(0x2b05e79a9700):ZOO_ERROR@handle_socket_error_msg@1579: Socket
[127.0.0.1:56273] zk retcode=-4, errno=111(Connection refused): server refused to accept the
client
2012-02-01 04:08:49,748:31306(0x2b05e7baa700):ZOO_ERROR@handle_socket_error_msg@1579: Socket
[127.0.0.1:47353] zk retcode=-4, errno=111(Connection refused): server refused to accept the
client
[       OK ] SampleFrameworks.CppFramework (5382 ms)
[ RUN      ] SampleFrameworks.JavaFramework
tests/external_tests.cpp:64: Failure
Value of: exitCode
  Actual: 256
Expected: 0
External test JavaFramework failed
[  FAILED  ] SampleFrameworks.JavaFramework (251 ms)
[ RUN      ] SampleFrameworks.JavaExceptionFramework
tests/external_tests.cpp:64: Failure
Value of: exitCode
  Actual: 256
Expected: 0
External test JavaExceptionFramework failed
[  FAILED  ] SampleFrameworks.JavaExceptionFramework (239 ms)
[ RUN      ] SampleFrameworks.PythonFramework
2012-02-01 04:08:51,421:31306(0x2b05e7dab700):ZOO_ERROR@handle_socket_error_msg@1579: Socket
[127.0.0.1:43999] zk retcode=-4, errno=111(Connection refused): server refused to accept the
client
2012-02-01 04:08:51,515:31306(0x2b05ec602700):ZOO_ERROR@handle_socket_error_msg@1579: Socket
[127.0.0.1:37076] zk retcode=-4, errno=111(Connection refused): server refused to accept the
client
2012-02-01 04:08:51,644:31306(0x2b05ec401700):ZOO_ERROR@handle_socket_error_msg@1579: Socket
[127.0.0.1:39805] zk retcode=-4, errno=111(Connection refused): server refused to accept the
client
2012-02-01 04:08:51,644:31306(0x2b05e79a9700):ZOO_ERROR@handle_socket_error_msg@1579: Socket
[127.0.0.1:56273] zk retcode=-4, errno=111(Connection refused): server refused to accept the
client
2012-02-01 04:08:51,750:31306(0x2b05e7baa700):ZOO_ERROR@handle_socket_error_msg@1579: Socket
[127.0.0.1:47353] zk retcode=-4, errno=111(Connection refused): server refused to accept the
client
2012-02-01 04:08:53,423:31306(0x2b05e7dab700):ZOO_ERROR@handle_socket_error_msg@1579: Socket
[127.0.0.1:43999] zk retcode=-4, errno=111(Connection refused): server refused to accept the
client
2012-02-01 04:08:53,517:31306(0x2b05ec602700):ZOO_ERROR@handle_socket_error_msg@1579: Socket
[127.0.0.1:37076] zk retcode=-4, errno=111(Connection refused): server refused to accept the
client
2012-02-01 04:08:53,645:31306(0x2b05ec401700):ZOO_ERROR@handle_socket_error_msg@1579: Socket
[127.0.0.1:39805] zk retcode=-4, errno=111(Connection refused): server refused to accept the
client
2012-02-01 04:08:53,645:31306(0x2b05e79a9700):ZOO_ERROR@handle_socket_error_msg@1579: Socket
[127.0.0.1:56273] zk retcode=-4, errno=111(Connection refused): server refused to accept the
client
2012-02-01 04:08:53,751:31306(0x2b05e7baa700):ZOO_ERROR@handle_socket_error_msg@1579: Socket
[127.0.0.1:47353] zk retcode=-4, errno=111(Connection refused): server refused to accept the
client
2012-02-01 04:08:55,425:31306(0x2b05e7dab700):ZOO_ERROR@handle_socket_error_msg@1579: Socket
[127.0.0.1:43999] zk retcode=-4, errno=111(Connection refused): server refused to accept the
client
2012-02-01 04:08:55,519:31306(0x2b05ec602700):ZOO_ERROR@handle_socket_error_msg@1579: Socket
[127.0.0.1:37076] zk retcode=-4, errno=111(Connection refused): server refused to accept the
client
2012-02-01 04:08:55,648:31306(0x2b05ec401700):ZOO_ERROR@handle_socket_error_msg@1579: Socket
[127.0.0.1:39805] zk retcode=-4, errno=111(Connection refused): server refused to accept the
client
2012-02-01 04:08:55,648:31306(0x2b05e79a9700):ZOO_ERROR@handle_socket_error_msg@1579: Socket
[127.0.0.1:56273] zk retcode=-4, errno=111(Connection refused): server refused to accept the
client
2012-02-01 04:08:55,753:31306(0x2b05e7baa700):ZOO_ERROR@handle_socket_error_msg@1579: Socket
[127.0.0.1:47353] zk retcode=-4, errno=111(Connection refused): server refused to accept the
client
[       OK ] SampleFrameworks.PythonFramework (6534 ms)
[----------] 4 tests from SampleFrameworks (12406 ms total)

[----------] 1 test from UUIDTest
[ RUN      ] UUIDTest.test
[       OK ] UUIDTest.test (1 ms)
[----------] 1 test from UUIDTest (1 ms total)

[----------] 20 tests from ResourcesTest
[ RUN      ] ResourcesTest.Parsing
[       OK ] ResourcesTest.Parsing (1 ms)
[ RUN      ] ResourcesTest.Printing
[       OK ] ResourcesTest.Printing (0 ms)
[ RUN      ] ResourcesTest.InitializedIsEmpty
[       OK ] ResourcesTest.InitializedIsEmpty (0 ms)
[ RUN      ] ResourcesTest.BadResourcesNotAllocatable
[       OK ] ResourcesTest.BadResourcesNotAllocatable (0 ms)
[ RUN      ] ResourcesTest.ScalarEquals
[       OK ] ResourcesTest.ScalarEquals (0 ms)
[ RUN      ] ResourcesTest.ScalarSubset
[       OK ] ResourcesTest.ScalarSubset (0 ms)
[ RUN      ] ResourcesTest.ScalarAddition
[       OK ] ResourcesTest.ScalarAddition (0 ms)
[ RUN      ] ResourcesTest.ScalarSubtraction
[       OK ] ResourcesTest.ScalarSubtraction (0 ms)
[ RUN      ] ResourcesTest.RangesEquals
[       OK ] ResourcesTest.RangesEquals (0 ms)
[ RUN      ] ResourcesTest.RangesSubset
[       OK ] ResourcesTest.RangesSubset (0 ms)
[ RUN      ] ResourcesTest.RangesAddition
[       OK ] ResourcesTest.RangesAddition (0 ms)
[ RUN      ] ResourcesTest.RangesSubtraction
[       OK ] ResourcesTest.RangesSubtraction (0 ms)
[ RUN      ] ResourcesTest.RangesSubtraction1
[       OK ] ResourcesTest.RangesSubtraction1 (0 ms)
[ RUN      ] ResourcesTest.RangesSubtraction2
[       OK ] ResourcesTest.RangesSubtraction2 (0 ms)
[ RUN      ] ResourcesTest.RangesSubtraction3
[       OK ] ResourcesTest.RangesSubtraction3 (0 ms)
[ RUN      ] ResourcesTest.RangesSubtraction4
[       OK ] ResourcesTest.RangesSubtraction4 (0 ms)
[ RUN      ] ResourcesTest.SetEquals
[       OK ] ResourcesTest.SetEquals (0 ms)
[ RUN      ] ResourcesTest.SetSubset
[       OK ] ResourcesTest.SetSubset (0 ms)
[ RUN      ] ResourcesTest.SetAddition
[       OK ] ResourcesTest.SetAddition (0 ms)
[ RUN      ] ResourcesTest.SetSubtraction
[       OK ] ResourcesTest.SetSubtraction (0 ms)
[----------] 20 tests from ResourcesTest (1 ms total)

[----------] 3 tests from ReplicaTest
[ RUN      ] ReplicaTest.Promise
[       OK ] ReplicaTest.Promise (146 ms)
[ RUN      ] ReplicaTest.Append
[       OK ] ReplicaTest.Append (71 ms)
[ RUN      ] ReplicaTest.Recover
2012-02-01 04:08:57,427:31306(0x2b05e7dab700):ZOO_ERROR@handle_socket_error_msg@1579: Socket
[127.0.0.1:43999] zk retcode=-4, errno=111(Connection refused): server refused to accept the
client
[       OK ] ReplicaTest.Recover (141 ms)
[----------] 3 tests from ReplicaTest (358 ms total)

[----------] 16 tests from CoordinatorTest
[ RUN      ] CoordinatorTest.Elect
2012-02-01 04:08:57,521:31306(0x2b05ec602700):ZOO_ERROR@handle_socket_error_msg@1579: Socket
[127.0.0.1:37076] zk retcode=-4, errno=111(Connection refused): server refused to accept the
client
[       OK ] CoordinatorTest.Elect (149 ms)
[ RUN      ] CoordinatorTest.AppendRead
2012-02-01 04:08:57,650:31306(0x2b05ec401700):ZOO_ERROR@handle_socket_error_msg@1579: Socket
[127.0.0.1:39805] zk retcode=-4, errno=111(Connection refused): server refused to accept the
client
2012-02-01 04:08:57,650:31306(0x2b05e79a9700):ZOO_ERROR@handle_socket_error_msg@1579: Socket
[127.0.0.1:56273] zk retcode=-4, errno=111(Connection refused): server refused to accept the
client
2012-02-01 04:08:57,755:31306(0x2b05e7baa700):ZOO_ERROR@handle_socket_error_msg@1579: Socket
[127.0.0.1:47353] zk retcode=-4, errno=111(Connection refused): server refused to accept the
client
[       OK ] CoordinatorTest.AppendRead (154 ms)
[ RUN      ] CoordinatorTest.AppendReadError
[       OK ] CoordinatorTest.AppendReadError (164 ms)
[ RUN      ] CoordinatorTest.Failover
[       OK ] CoordinatorTest.Failover (210 ms)
[ RUN      ] CoordinatorTest.Demoted
[       OK ] CoordinatorTest.Demoted (243 ms)
[ RUN      ] CoordinatorTest.Fill
[       OK ] CoordinatorTest.Fill (284 ms)
[ RUN      ] CoordinatorTest.NotLearnedFill
[       OK ] CoordinatorTest.NotLearnedFill (276 ms)
[ RUN      ] CoordinatorTest.MultipleAppends
[       OK ] CoordinatorTest.MultipleAppends (374 ms)
[ RUN      ] CoordinatorTest.MultipleAppendsNotLearnedFill
2012-02-01 04:08:59,430:31306(0x2b05e7dab700):ZOO_ERROR@handle_socket_error_msg@1579: Socket
[127.0.0.1:43999] zk retcode=-4, errno=111(Connection refused): server refused to accept the
client
2012-02-01 04:08:59,524:31306(0x2b05ec602700):ZOO_ERROR@handle_socket_error_msg@1579: Socket
[127.0.0.1:37076] zk retcode=-4, errno=111(Connection refused): server refused to accept the
client
2012-02-01 04:08:59,652:31306(0x2b05ec401700):ZOO_ERROR@handle_socket_error_msg@1579: Socket
[127.0.0.1:39805] zk retcode=-4, errno=111(Connection refused): server refused to accept the
client
2012-02-01 04:08:59,652:31306(0x2b05e79a9700):ZOO_ERROR@handle_socket_error_msg@1579: Socket
[127.0.0.1:56273] zk retcode=-4, errno=111(Connection refused): server refused to accept the
client
2012-02-01 04:08:59,758:31306(0x2b05e7baa700):ZOO_ERROR@handle_socket_error_msg@1579: Socket
[127.0.0.1:47353] zk retcode=-4, errno=111(Connection refused): server refused to accept the
client
[       OK ] CoordinatorTest.MultipleAppendsNotLearnedFill (747 ms)
[ RUN      ] CoordinatorTest.Truncate
[       OK ] CoordinatorTest.Truncate (449 ms)
[ RUN      ] CoordinatorTest.TruncateNotLearnedFill
[       OK ] CoordinatorTest.TruncateNotLearnedFill (778 ms)
[ RUN      ] CoordinatorTest.RacingElect
[       OK ] CoordinatorTest.RacingElect (0 ms)
[ RUN      ] CoordinatorTest.FillNoQuorum
[       OK ] CoordinatorTest.FillNoQuorum (0 ms)
[ RUN      ] CoordinatorTest.FillInconsistent
[       OK ] CoordinatorTest.FillInconsistent (0 ms)
[ RUN      ] CoordinatorTest.LearnedOnOneReplica_NotLearnedOnAnother
[       OK ] CoordinatorTest.LearnedOnOneReplica_NotLearnedOnAnother (0 ms)
[ RUN      ] CoordinatorTest.LearnedOnOneReplica_NotLearnedOnAnother_AnotherFailsAndRecovers
[       OK ] CoordinatorTest.LearnedOnOneReplica_NotLearnedOnAnother_AnotherFailsAndRecovers
(0 ms)
[----------] 16 tests from CoordinatorTest (3828 ms total)

[----------] 2 tests from LogTest
[ RUN      ] LogTest.WriteRead
2012-02-01 04:09:01,432:31306(0x2b05e7dab700):ZOO_ERROR@handle_socket_error_msg@1579: Socket
[127.0.0.1:43999] zk retcode=-4, errno=111(Connection refused): server refused to accept the
client
[       OK ] LogTest.WriteRead (199 ms)
[ RUN      ] LogTest.Position
2012-02-01 04:09:01,524:31306(0x2b05ec602700):ZOO_ERROR@handle_socket_error_msg@1579: Socket
[127.0.0.1:37076] zk retcode=-4, errno=111(Connection refused): server refused to accept the
client
[       OK ] LogTest.Position (156 ms)
[----------] 2 tests from LogTest (355 ms total)

[----------] 9 tests from FaultToleranceTest
[ RUN      ] FaultToleranceTest.SlaveLost
[       OK ] FaultToleranceTest.SlaveLost (1 ms)
[ RUN      ] FaultToleranceTest.SlavePartitioned
[       OK ] FaultToleranceTest.SlavePartitioned (2 ms)
[ RUN      ] FaultToleranceTest.SchedulerFailover
2012-02-01 04:09:01,654:31306(0x2b05ec401700):ZOO_ERROR@handle_socket_error_msg@1579: Socket
[127.0.0.1:39805] zk retcode=-4, errno=111(Connection refused): server refused to accept the
client
2012-02-01 04:09:01,654:31306(0x2b05e79a9700):ZOO_ERROR@handle_socket_error_msg@1579: Socket
[127.0.0.1:56273] zk retcode=-4, errno=111(Connection refused): server refused to accept the
client
[       OK ] FaultToleranceTest.SchedulerFailover (2 ms)
[ RUN      ] FaultToleranceTest.FrameworkReliableRegistration
2012-02-01 04:09:01,760:31306(0x2b05e7baa700):ZOO_ERROR@handle_socket_error_msg@1579: Socket
[127.0.0.1:47353] zk retcode=-4, errno=111(Connection refused): server refused to accept the
client
[       OK ] FaultToleranceTest.FrameworkReliableRegistration (1007 ms)
[ RUN      ] FaultToleranceTest.FrameworkReregister
[       OK ] FaultToleranceTest.FrameworkReregister (1 ms)
[ RUN      ] FaultToleranceTest.SchedulerFailoverStatusUpdate
[       OK ] FaultToleranceTest.SchedulerFailoverStatusUpdate (85 ms)
[ RUN      ] FaultToleranceTest.SchedulerFailoverFrameworkMessage
[       OK ] FaultToleranceTest.SchedulerFailoverFrameworkMessage (5 ms)
[ RUN      ] FaultToleranceTest.SlaveReliableRegistration
2012-02-01 04:09:03,434:31306(0x2b05e7dab700):ZOO_ERROR@handle_socket_error_msg@1579: Socket
[127.0.0.1:43999] zk retcode=-4, errno=111(Connection refused): server refused to accept the
client
2012-02-01 04:09:03,526:31306(0x2b05ec602700):ZOO_ERROR@handle_socket_error_msg@1579: Socket
[127.0.0.1:37076] zk retcode=-4, errno=111(Connection refused): server refused to accept the
client
2012-02-01 04:09:03,656:31306(0x2b05e79a9700):ZOO_ERROR@handle_socket_error_msg@1579: Socket
[127.0.0.1:56273] zk retcode=-4, errno=111(Connection refused): server refused to accept the
client
2012-02-01 04:09:03,656:31306(0x2b05ec401700):ZOO_ERROR@handle_socket_error_msg@1579: Socket
[127.0.0.1:39805] zk retcode=-4, errno=111(Connection refused): server refused to accept the
client
[       OK ] FaultToleranceTest.SlaveReliableRegistration (998 ms)
[ RUN      ] FaultToleranceTest.SlaveReregister
[       OK ] FaultToleranceTest.SlaveReregister (2 ms)
[----------] 9 tests from FaultToleranceTest (2104 ms total)

[----------] 7 tests from ResourceOffersTest
[ RUN      ] ResourceOffersTest.ResourceOfferWithMultipleSlaves
[       OK ] ResourceOffersTest.ResourceOfferWithMultipleSlaves (2 ms)
[ RUN      ] ResourceOffersTest.TaskUsesNoResources
[       OK ] ResourceOffersTest.TaskUsesNoResources (2 ms)
[ RUN      ] ResourceOffersTest.TaskUsesInvalidResources
[       OK ] ResourceOffersTest.TaskUsesInvalidResources (3 ms)
[ RUN      ] ResourceOffersTest.TaskUsesMoreResourcesThanOffered
2[       OK ] ResourceOffersTest.TaskUsesMoreResourcesThanOffered (2 ms)
012-02-01 04:09:03,762[ RUN      ] ResourceOffersTest.ResourcesGetReofferedWhenUnused
:31306(0x2b05e7baa700):ZOO_ERROR@handle_socket_error_msg@1579: Socket [127.0.0.1:47353] zk
retcode=-4, errno=111(Connection refused): server refused to accept the client
[       OK ] ResourceOffersTest.ResourcesGetReofferedWhenUnused (2 ms)
[ RUN      ] ResourceOffersTest.ResourcesGetReofferedAfterTaskDescriptionError
[       OK ] ResourceOffersTest.ResourcesGetReofferedAfterTaskDescriptionError (3 ms)
[ RUN      ] ResourceOffersTest.ResourceRequest
[       OK ] ResourceOffersTest.ResourceRequest (1 ms)
[----------] 7 tests from ResourceOffersTest (15 ms total)

[----------] 4 tests from MasterTest
[ RUN      ] MasterTest.TaskRunning
[       OK ] MasterTest.TaskRunning (4 ms)
[ RUN      ] MasterTest.KillTask
[       OK ] MasterTest.KillTask (4 ms)
[ RUN      ] MasterTest.FrameworkMessage
[       OK ] MasterTest.FrameworkMessage (5 ms)
[ RUN      ] MasterTest.MultipleExecutors
[       OK ] MasterTest.MultipleExecutors (30 ms)
[----------] 4 tests from MasterTest (43 ms total)

[----------] 5 tests from FrameworksManagerTestFixture
[ RUN      ] FrameworksManagerTestFixture.AddFramework
[       OK ] FrameworksManagerTestFixture.AddFramework (1 ms)
[ RUN      ] FrameworksManagerTestFixture.RemoveFramework
[       OK ] FrameworksManagerTestFixture.RemoveFramework (2 ms)
[ RUN      ] FrameworksManagerTestFixture.ResurrectFramework
[       OK ] FrameworksManagerTestFixture.ResurrectFramework (1 ms)
[ RUN      ] FrameworksManagerTestFixture.ResurrectExpiringFramework
[       OK ] FrameworksManagerTestFixture.ResurrectExpiringFramework (1 ms)
[ RUN      ] FrameworksManagerTestFixture.ResurrectInterspersedExpiringFrameworks
[       OK ] FrameworksManagerTestFixture.ResurrectInterspersedExpiringFrameworks (2 ms)
[----------] 5 tests from FrameworksManagerTestFixture (7 ms total)

[----------] 1 test from FrameworksManagerTest
[ RUN      ] FrameworksManagerTest.CacheFailure
E0201 04:09:03.818629 31328 frameworks_manager.cpp:213] Error getting framework info from
underlying storage: Fake Caching Error.
E0201 04:09:03.819124 31328 frameworks_manager.cpp:213] Error getting framework info from
underlying storage: Fake Caching Error.
[       OK ] FrameworksManagerTest.CacheFailure (1 ms)
[----------] 1 test from FrameworksManagerTest (1 ms total)

[----------] Global test environment tear-down
[==========] 120 tests from 21 test cases ran. (38049 ms total)
[  PASSED  ] 118 tests.
[  FAILED  ] 2 tests, listed below:
[  FAILED  ] SampleFrameworks.JavaFramework
[  FAILED  ] SampleFrameworks.JavaExceptionFramework

 2 FAILED TESTS
  YOU HAVE 6 DISABLED TESTS

FAIL: mesos-tests
==================
1 of 1 test failed
==================
make[3]: *** [check-TESTS] Error 1
make[3]: Leaving directory `<https://builds.apache.org/job/Mesos-Trunk-Ubuntu-Build-In-Src-Set-JAVA_HOME/ws/src'>
make[2]: *** [check-am] Error 2
make[2]: Leaving directory `<https://builds.apache.org/job/Mesos-Trunk-Ubuntu-Build-In-Src-Set-JAVA_HOME/ws/src'>
make[1]: *** [check] Error 2
make[1]: Leaving directory `<https://builds.apache.org/job/Mesos-Trunk-Ubuntu-Build-In-Src-Set-JAVA_HOME/ws/src'>
make: *** [check-recursive] Error 1
Build step 'Execute shell' marked build as failure


Mime
View raw message