mesos-dev mailing list archives

Site index · List index
Message view « Date » · « Thread »
Top « Date » · « Thread »
From Apache Jenkins Server <jenk...@builds.apache.org>
Subject Build failed in Jenkins: Mesos-Trunk-Ubuntu-Build-Out-Of-Src-Set-JAVA_HOME #67
Date Wed, 01 Feb 2012 16:24:37 GMT
See <https://builds.apache.org/job/Mesos-Trunk-Ubuntu-Build-Out-Of-Src-Set-JAVA_HOME/67/>

------------------------------------------
[...truncated 14042 lines...]
[ RUN      ] ConfiguratorTest.MalformedConfigFile
[       OK ] ConfiguratorTest.MalformedConfigFile (6 ms)
[----------] 10 tests from ConfiguratorTest (59 ms total)

[----------] 4 tests from SampleFrameworks
[ RUN      ] SampleFrameworks.CppFramework
2012-02-01 16:24:23,142:10969(0x2aff8d34a700):ZOO_ERROR@handle_socket_error_msg@1579: Socket
[127.0.0.1:48008] zk retcode=-4, errno=111(Connection refused): server refused to accept the
client
2012-02-01 16:24:24,838:10969(0x2aff8d74c700):ZOO_ERROR@handle_socket_error_msg@1579: Socket
[127.0.0.1:49490] zk retcode=-4, errno=111(Connection refused): server refused to accept the
client
2012-02-01 16:24:24,865:10969(0x2aff8df50700):ZOO_ERROR@handle_socket_error_msg@1579: Socket
[127.0.0.1:58871] zk retcode=-4, errno=111(Connection refused): server refused to accept the
client
2012-02-01 16:24:24,892:10969(0x2aff8d54b700):ZOO_ERROR@handle_socket_error_msg@1579: Socket
[127.0.0.1:35287] zk retcode=-4, errno=111(Connection refused): server refused to accept the
client
2012-02-01 16:24:24,916:10969(0x2aff8dd4f700):ZOO_ERROR@handle_socket_error_msg@1579: Socket
[127.0.0.1:36004] zk retcode=-4, errno=111(Connection refused): server refused to accept the
client
2012-02-01 16:24:25,144:10969(0x2aff8d34a700):ZOO_ERROR@handle_socket_error_msg@1579: Socket
[127.0.0.1:48008] zk retcode=-4, errno=111(Connection refused): server refused to accept the
client
2012-02-01 16:24:26,840:10969(0x2aff8d74c700):ZOO_ERROR@handle_socket_error_msg@1579: Socket
[127.0.0.1:49490] zk retcode=-4, errno=111(Connection refused): server refused to accept the
client
2012-02-01 16:24:26,867:10969(0x2aff8df50700):ZOO_ERROR@handle_socket_error_msg@1579: Socket
[127.0.0.1:58871] zk retcode=-4, errno=111(Connection refused): server refused to accept the
client
2012-02-01 16:24:26,895:10969(0x2aff8d54b700):ZOO_ERROR@handle_socket_error_msg@1579: Socket
[127.0.0.1:35287] zk retcode=-4, errno=111(Connection refused): server refused to accept the
client
2012-02-01 16:24:26,918:10969(0x2aff8dd4f700):ZOO_ERROR@handle_socket_error_msg@1579: Socket
[127.0.0.1:36004] zk retcode=-4, errno=111(Connection refused): server refused to accept the
client
2012-02-01 16:24:27,147:10969(0x2aff8d34a700):ZOO_ERROR@handle_socket_error_msg@1579: Socket
[127.0.0.1:48008] zk retcode=-4, errno=111(Connection refused): server refused to accept the
client
[       OK ] SampleFrameworks.CppFramework (5285 ms)
[ RUN      ] SampleFrameworks.JavaFramework
../../src/tests/external_tests.cpp:64: Failure
Value of: exitCode
  Actual: 256
Expected: 0
External test JavaFramework failed
[  FAILED  ] SampleFrameworks.JavaFramework (262 ms)
[ RUN      ] SampleFrameworks.JavaExceptionFramework
../../src/tests/external_tests.cpp:64: Failure
Value of: exitCode
  Actual: 256
Expected: 0
External test JavaExceptionFramework failed
[  FAILED  ] SampleFrameworks.JavaExceptionFramework (195 ms)
[ RUN      ] SampleFrameworks.PythonFramework
2012-02-01 16:24:28,843:10969(0x2aff8d74c700):ZOO_ERROR@handle_socket_error_msg@1579: Socket
[127.0.0.1:49490] zk retcode=-4, errno=111(Connection refused): server refused to accept the
client
2012-02-01 16:24:28,869:10969(0x2aff8df50700):ZOO_ERROR@handle_socket_error_msg@1579: Socket
[127.0.0.1:58871] zk retcode=-4, errno=111(Connection refused): server refused to accept the
client
2012-02-01 16:24:28,897:10969(0x2aff8d54b700):ZOO_ERROR@handle_socket_error_msg@1579: Socket
[127.0.0.1:35287] zk retcode=-4, errno=111(Connection refused): server refused to accept the
client
2012-02-01 16:24:28,921:10969(0x2aff8dd4f700):ZOO_ERROR@handle_socket_error_msg@1579: Socket
[127.0.0.1:36004] zk retcode=-4, errno=111(Connection refused): server refused to accept the
client
2012-02-01 16:24:29,149:10969(0x2aff8d34a700):ZOO_ERROR@handle_socket_error_msg@1579: Socket
[127.0.0.1:48008] zk retcode=-4, errno=111(Connection refused): server refused to accept the
client
2012-02-01 16:24:30,845:10969(0x2aff8d74c700):ZOO_ERROR@handle_socket_error_msg@1579: Socket
[127.0.0.1:49490] zk retcode=-4, errno=111(Connection refused): server refused to accept the
client
2012-02-01 16:24:30,871:10969(0x2aff8df50700):ZOO_ERROR@handle_socket_error_msg@1579: Socket
[127.0.0.1:58871] zk retcode=-4, errno=111(Connection refused): server refused to accept the
client
2012-02-01 16:24:30,899:10969(0x2aff8d54b700):ZOO_ERROR@handle_socket_error_msg@1579: Socket
[127.0.0.1:35287] zk retcode=-4, errno=111(Connection refused): server refused to accept the
client
2012-02-01 16:24:30,923:10969(0x2aff8dd4f700):ZOO_ERROR@handle_socket_error_msg@1579: Socket
[127.0.0.1:36004] zk retcode=-4, errno=111(Connection refused): server refused to accept the
client
2012-02-01 16:24:31,151:10969(0x2aff8d34a700):ZOO_ERROR@handle_socket_error_msg@1579: Socket
[127.0.0.1:48008] zk retcode=-4, errno=111(Connection refused): server refused to accept the
client
2012-02-01 16:24:32,847:10969(0x2aff8d74c700):ZOO_ERROR@handle_socket_error_msg@1579: Socket
[127.0.0.1:49490] zk retcode=-4, errno=111(Connection refused): server refused to accept the
client
2012-02-01 16:24:32,872:10969(0x2aff8df50700):ZOO_ERROR@handle_socket_error_msg@1579: Socket
[127.0.0.1:58871] zk retcode=-4, errno=111(Connection refused): server refused to accept the
client
2012-02-01 16:24:32,901:10969(0x2aff8d54b700):ZOO_ERROR@handle_socket_error_msg@1579: Socket
[127.0.0.1:35287] zk retcode=-4, errno=111(Connection refused): server refused to accept the
client
2012-02-01 16:24:32,925:10969(0x2aff8dd4f700):ZOO_ERROR@handle_socket_error_msg@1579: Socket
[127.0.0.1:36004] zk retcode=-4, errno=111(Connection refused): server refused to accept the
client
2012-02-01 16:24:33,153:10969(0x2aff8d34a700):ZOO_ERROR@handle_socket_error_msg@1579: Socket
[127.0.0.1:48008] zk retcode=-4, errno=111(Connection refused): server refused to accept the
client
[       OK ] SampleFrameworks.PythonFramework (5568 ms)
[----------] 4 tests from SampleFrameworks (11310 ms total)

[----------] 1 test from UUIDTest
[ RUN      ] UUIDTest.test
[       OK ] UUIDTest.test (0 ms)
[----------] 1 test from UUIDTest (0 ms total)

[----------] 20 tests from ResourcesTest
[ RUN      ] ResourcesTest.Parsing
[       OK ] ResourcesTest.Parsing (1 ms)
[ RUN      ] ResourcesTest.Printing
[       OK ] ResourcesTest.Printing (0 ms)
[ RUN      ] ResourcesTest.InitializedIsEmpty
[       OK ] ResourcesTest.InitializedIsEmpty (0 ms)
[ RUN      ] ResourcesTest.BadResourcesNotAllocatable
[       OK ] ResourcesTest.BadResourcesNotAllocatable (0 ms)
[ RUN      ] ResourcesTest.ScalarEquals
[       OK ] ResourcesTest.ScalarEquals (0 ms)
[ RUN      ] ResourcesTest.ScalarSubset
[       OK ] ResourcesTest.ScalarSubset (0 ms)
[ RUN      ] ResourcesTest.ScalarAddition
[       OK ] ResourcesTest.ScalarAddition (0 ms)
[ RUN      ] ResourcesTest.ScalarSubtraction
[       OK ] ResourcesTest.ScalarSubtraction (0 ms)
[ RUN      ] ResourcesTest.RangesEquals
[       OK ] ResourcesTest.RangesEquals (0 ms)
[ RUN      ] ResourcesTest.RangesSubset
[       OK ] ResourcesTest.RangesSubset (0 ms)
[ RUN      ] ResourcesTest.RangesAddition
[       OK ] ResourcesTest.RangesAddition (0 ms)
[ RUN      ] ResourcesTest.RangesSubtraction
[       OK ] ResourcesTest.RangesSubtraction (0 ms)
[ RUN      ] ResourcesTest.RangesSubtraction1
[       OK ] ResourcesTest.RangesSubtraction1 (0 ms)
[ RUN      ] ResourcesTest.RangesSubtraction2
[       OK ] ResourcesTest.RangesSubtraction2 (0 ms)
[ RUN      ] ResourcesTest.RangesSubtraction3
[       OK ] ResourcesTest.RangesSubtraction3 (0 ms)
[ RUN      ] ResourcesTest.RangesSubtraction4
[       OK ] ResourcesTest.RangesSubtraction4 (0 ms)
[ RUN      ] ResourcesTest.SetEquals
[       OK ] ResourcesTest.SetEquals (0 ms)
[ RUN      ] ResourcesTest.SetSubset
[       OK ] ResourcesTest.SetSubset (0 ms)
[ RUN      ] ResourcesTest.SetAddition
[       OK ] ResourcesTest.SetAddition (0 ms)
[ RUN      ] ResourcesTest.SetSubtraction
[       OK ] ResourcesTest.SetSubtraction (0 ms)
[----------] 20 tests from ResourcesTest (1 ms total)

[----------] 3 tests from ReplicaTest
[ RUN      ] ReplicaTest.Promise
[       OK ] ReplicaTest.Promise (3 ms)
[ RUN      ] ReplicaTest.Append
[       OK ] ReplicaTest.Append (2 ms)
[ RUN      ] ReplicaTest.Recover
[       OK ] ReplicaTest.Recover (3 ms)
[----------] 3 tests from ReplicaTest (8 ms total)

[----------] 16 tests from CoordinatorTest
[ RUN      ] CoordinatorTest.Elect
[       OK ] CoordinatorTest.Elect (4 ms)
[ RUN      ] CoordinatorTest.AppendRead
[       OK ] CoordinatorTest.AppendRead (5 ms)
[ RUN      ] CoordinatorTest.AppendReadError
[       OK ] CoordinatorTest.AppendReadError (5 ms)
[ RUN      ] CoordinatorTest.Failover
[       OK ] CoordinatorTest.Failover (6 ms)
[ RUN      ] CoordinatorTest.Demoted
[       OK ] CoordinatorTest.Demoted (7 ms)
[ RUN      ] CoordinatorTest.Fill
[       OK ] CoordinatorTest.Fill (9 ms)
[ RUN      ] CoordinatorTest.NotLearnedFill
[       OK ] CoordinatorTest.NotLearnedFill (12 ms)
[ RUN      ] CoordinatorTest.MultipleAppends
[       OK ] CoordinatorTest.MultipleAppends (11 ms)
[ RUN      ] CoordinatorTest.MultipleAppendsNotLearnedFill
[       OK ] CoordinatorTest.MultipleAppendsNotLearnedFill (34 ms)
[ RUN      ] CoordinatorTest.Truncate
[       OK ] CoordinatorTest.Truncate (13 ms)
[ RUN      ] CoordinatorTest.TruncateNotLearnedFill
[       OK ] CoordinatorTest.TruncateNotLearnedFill (39 ms)
[ RUN      ] CoordinatorTest.RacingElect
[       OK ] CoordinatorTest.RacingElect (0 ms)
[ RUN      ] CoordinatorTest.FillNoQuorum
[       OK ] CoordinatorTest.FillNoQuorum (0 ms)
[ RUN      ] CoordinatorTest.FillInconsistent
[       OK ] CoordinatorTest.FillInconsistent (0 ms)
[ RUN      ] CoordinatorTest.LearnedOnOneReplica_NotLearnedOnAnother
[       OK ] CoordinatorTest.LearnedOnOneReplica_NotLearnedOnAnother (0 ms)
[ RUN      ] CoordinatorTest.LearnedOnOneReplica_NotLearnedOnAnother_AnotherFailsAndRecovers
[       OK ] CoordinatorTest.LearnedOnOneReplica_NotLearnedOnAnother_AnotherFailsAndRecovers
(0 ms)
[----------] 16 tests from CoordinatorTest (145 ms total)

[----------] 2 tests from LogTest
[ RUN      ] LogTest.WriteRead
[       OK ] LogTest.WriteRead (5 ms)
[ RUN      ] LogTest.Position
[       OK ] LogTest.Position (5 ms)
[----------] 2 tests from LogTest (10 ms total)

[----------] 9 tests from FaultToleranceTest
[ RUN      ] FaultToleranceTest.SlaveLost
[       OK ] FaultToleranceTest.SlaveLost (2 ms)
[ RUN      ] FaultToleranceTest.SlavePartitioned
[       OK ] FaultToleranceTest.SlavePartitioned (2 ms)
[ RUN      ] FaultToleranceTest.SchedulerFailover
[       OK ] FaultToleranceTest.SchedulerFailover (1 ms)
[ RUN      ] FaultToleranceTest.FrameworkReliableRegistration
2012-02-01 16:24:34,849:10969(0x2aff8d74c700):ZOO_ERROR@handle_socket_error_msg@1579: Socket
[127.0.0.1:49490] zk retcode=-4, errno=111(Connection refused): server refused to accept the
client
2012-02-01 16:24:34,875:10969(0x2aff8df50700):ZOO_ERROR@handle_socket_error_msg@1579: Socket
[127.0.0.1:58871] zk retcode=-4, errno=111(Connection refused): server refused to accept the
client
2012-02-01 16:24:34,902:10969(0x2aff8d54b700):ZOO_ERROR@handle_socket_error_msg@1579: Socket
[127.0.0.1:35287] zk retcode=-4, errno=111(Connection refused): server refused to accept the
client
2012-02-01 16:24:34,927:10969(0x2aff8dd4f700):ZOO_ERROR@handle_socket_error_msg@1579: Socket
[127.0.0.1:36004] zk retcode=-4, errno=111(Connection refused): server refused to accept the
client
2012-02-01 16:24:35,155:10969(0x2aff8d34a700):ZOO_ERROR@handle_socket_error_msg@1579: Socket
[127.0.0.1:48008] zk retcode=-4, errno=111(Connection refused): server refused to accept the
client
[       OK ] FaultToleranceTest.FrameworkReliableRegistration (1009 ms)
[ RUN      ] FaultToleranceTest.FrameworkReregister
[       OK ] FaultToleranceTest.FrameworkReregister (2 ms)
[ RUN      ] FaultToleranceTest.SchedulerFailoverStatusUpdate
[       OK ] FaultToleranceTest.SchedulerFailoverStatusUpdate (6 ms)
[ RUN      ] FaultToleranceTest.SchedulerFailoverFrameworkMessage
[       OK ] FaultToleranceTest.SchedulerFailoverFrameworkMessage (5 ms)
[ RUN      ] FaultToleranceTest.SlaveReliableRegistration
[       OK ] FaultToleranceTest.SlaveReliableRegistration (1007 ms)
[ RUN      ] FaultToleranceTest.SlaveReregister
[       OK ] FaultToleranceTest.SlaveReregister (2 ms)
[----------] 9 tests from FaultToleranceTest (2037 ms total)

[----------] 7 tests from ResourceOffersTest
[ RUN      ] ResourceOffersTest.ResourceOfferWithMultipleSlaves
[       OK ] ResourceOffersTest.ResourceOfferWithMultipleSlaves (1 ms)
[ RUN      ] ResourceOffersTest.TaskUsesNoResources
[       OK ] ResourceOffersTest.TaskUsesNoResources (2 ms)
[ RUN      ] ResourceOffersTest.TaskUsesInvalidResources
[       OK ] ResourceOffersTest.TaskUsesInvalidResources (2 ms)
[ RUN      ] ResourceOffersTest.TaskUsesMoreResourcesThanOffered
[       OK ] ResourceOffersTest.TaskUsesMoreResourcesThanOffered (1 ms)
[ RUN      ] ResourceOffersTest.ResourcesGetReofferedWhenUnused
[       OK ] ResourceOffersTest.ResourcesGetReofferedWhenUnused (1 ms)
[ RUN      ] ResourceOffersTest.ResourcesGetReofferedAfterTaskDescriptionError
[       OK ] ResourceOffersTest.ResourcesGetReofferedAfterTaskDescriptionError (2 ms)
[ RUN      ] ResourceOffersTest.ResourceRequest
[       OK ] ResourceOffersTest.ResourceRequest (1 ms)
[----------] 7 tests from ResourceOffersTest (10 ms total)

[----------] 4 tests from MasterTest
[ RUN      ] MasterTest.TaskRunning
[       OK ] MasterTest.TaskRunning (3 ms)
[ RUN      ] MasterTest.KillTask
[       OK ] MasterTest.KillTask (4 ms)
[ RUN      ] MasterTest.FrameworkMessage
[       OK ] MasterTest.FrameworkMessage (3 ms)
[ RUN      ] MasterTest.MultipleExecutors
[       OK ] MasterTest.MultipleExecutors (4 ms)
[----------] 4 tests from MasterTest (14 ms total)

[----------] 5 tests from FrameworksManagerTestFixture
[ RUN      ] FrameworksManagerTestFixture.AddFramework
[       OK ] FrameworksManagerTestFixture.AddFramework (1 ms)
[ RUN      ] FrameworksManagerTestFixture.RemoveFramework
[       OK ] FrameworksManagerTestFixture.RemoveFramework (1 ms)
[ RUN      ] FrameworksManagerTestFixture.ResurrectFramework
[       OK ] FrameworksManagerTestFixture.ResurrectFramework (0 ms)
[ RUN      ] FrameworksManagerTestFixture.ResurrectExpiringFramework
[       OK ] FrameworksManagerTestFixture.ResurrectExpiringFramework (0 ms)
[ RUN      ] FrameworksManagerTestFixture.ResurrectInterspersedExpiringFrameworks
[       OK ] FrameworksManagerTestFixture.ResurrectInterspersedExpiringFrameworks (1 ms)
[----------] 5 tests from FrameworksManagerTestFixture (4 ms total)

[----------] 1 test from FrameworksManagerTest
[ RUN      ] FrameworksManagerTest.CacheFailure
E0201 16:24:36.636482 10992 frameworks_manager.cpp:213] Error getting framework info from
underlying storage: Fake Caching Error.
E0201 16:24:36.636844 10989 frameworks_manager.cpp:213] Error getting framework info from
underlying storage: Fake Caching Error.
[       OK ] FrameworksManagerTest.CacheFailure (0 ms)
[----------] 1 test from FrameworksManagerTest (0 ms total)

[----------] Global test environment tear-down
[==========] 120 tests from 21 test cases ran. (28182 ms total)
[  PASSED  ] 118 tests.
[  FAILED  ] 2 tests, listed below:
[  FAILED  ] SampleFrameworks.JavaFramework
[  FAILED  ] SampleFrameworks.JavaExceptionFramework

 2 FAILED TESTS
  YOU HAVE 6 DISABLED TESTS

FAIL: mesos-tests
==================
1 of 1 test failed
==================
make[3]: *** [check-TESTS] Error 1
make[3]: Leaving directory `/x1/jenkins/jenkins-slave/workspace/Mesos-Trunk-Ubuntu-Build-Out-Of-Src-Set-JAVA_HOME/build/src'
make[2]: *** [check-am] Error 2
make[2]: Leaving directory `/x1/jenkins/jenkins-slave/workspace/Mesos-Trunk-Ubuntu-Build-Out-Of-Src-Set-JAVA_HOME/build/src'
make[1]: *** [check] Error 2
make[1]: Leaving directory `/x1/jenkins/jenkins-slave/workspace/Mesos-Trunk-Ubuntu-Build-Out-Of-Src-Set-JAVA_HOME/build/src'
make: *** [check-recursive] Error 1
Build step 'Execute shell' marked build as failure
Publishing Clover coverage report...
Clover xml file does not exist in: <https://builds.apache.org/job/Mesos-Trunk-Ubuntu-Build-Out-Of-Src-Set-JAVA_HOME/ws/>
called: clover.xml and will not be copied to: /home/hudson/hudson/jobs/Mesos-Trunk-Ubuntu-Build-Out-Of-Src-Set-JAVA_HOME/builds/2012-02-01_16-14-17/clover.xml
Could not find '/clover.xml'.  Did you generate the XML report for Clover?


Mime
View raw message