mesos-dev mailing list archives

Site index · List index
Message view « Date » · « Thread »
Top « Date » · « Thread »
From Apache Jenkins Server <jenk...@builds.apache.org>
Subject Build failed in Jenkins: Mesos-Trunk-Ubuntu-Build-In-Src-Set-JAVA_HOME #37
Date Wed, 01 Feb 2012 17:50:44 GMT
See <https://builds.apache.org/job/Mesos-Trunk-Ubuntu-Build-In-Src-Set-JAVA_HOME/37/changes>

Changes:

[benh] Changed jobject to jweak where necessary.

------------------------------------------
[...truncated 2296 lines...]
2012-02-01 17:50:29,063:30685(0x2b2d1f5bb700):ZOO_ERROR@handle_socket_error_msg@1579: Socket
[127.0.0.1:53995] zk retcode=-4, errno=111(Connection refused): server refused to accept the
client
2012-02-01 17:50:29,165:30685(0x2b2d1fbbe700):ZOO_ERROR@handle_socket_error_msg@1579: Socket
[127.0.0.1:47123] zk retcode=-4, errno=111(Connection refused): server refused to accept the
client
2012-02-01 17:50:29,245:30685(0x2b2d1f1b9700):ZOO_ERROR@handle_socket_error_msg@1579: Socket
[127.0.0.1:55991] zk retcode=-4, errno=111(Connection refused): server refused to accept the
client
2012-02-01 17:50:29,338:30685(0x2b2d1fdbf700):ZOO_ERROR@handle_socket_error_msg@1579: Socket
[127.0.0.1:40450] zk retcode=-4, errno=111(Connection refused): server refused to accept the
client
2012-02-01 17:50:29,469:30685(0x2b2d24301700):ZOO_ERROR@handle_socket_error_msg@1579: Socket
[127.0.0.1:34406] zk retcode=-4, errno=111(Connection refused): server refused to accept the
client
[       OK ] SampleFrameworks.CppFramework (5572 ms)
[ RUN      ] SampleFrameworks.JavaFramework
tests/external_tests.cpp:64: Failure
Value of: exitCode
  Actual: 256
Expected: 0
External test JavaFramework failed
[  FAILED  ] SampleFrameworks.JavaFramework (573 ms)
[ RUN      ] SampleFrameworks.JavaExceptionFramework
2012-02-01 17:50:31,065:30685(0x2b2d1f5bb700):ZOO_ERROR@handle_socket_error_msg@1579: Socket
[127.0.0.1:53995] zk retcode=-4, errno=111(Connection refused): server refused to accept the
client
tests/external_tests.cpp:64: Failure
Value of: exitCode
  Actual: 256
Expected: 0
External test JavaExceptionFramework failed
[  FAILED  ] SampleFrameworks.JavaExceptionFramework (393 ms)
[ RUN      ] SampleFrameworks.PythonFramework
2012-02-01 17:50:31,165:30685(0x2b2d1fbbe700):ZOO_ERROR@handle_socket_error_msg@1579: Socket
[127.0.0.1:47123] zk retcode=-4, errno=111(Connection refused): server refused to accept the
client
2012-02-01 17:50:31,247:30685(0x2b2d1f1b9700):ZOO_ERROR@handle_socket_error_msg@1579: Socket
[127.0.0.1:55991] zk retcode=-4, errno=111(Connection refused): server refused to accept the
client
2012-02-01 17:50:31,340:30685(0x2b2d1fdbf700):ZOO_ERROR@handle_socket_error_msg@1579: Socket
[127.0.0.1:40450] zk retcode=-4, errno=111(Connection refused): server refused to accept the
client
2012-02-01 17:50:31,471:30685(0x2b2d24301700):ZOO_ERROR@handle_socket_error_msg@1579: Socket
[127.0.0.1:34406] zk retcode=-4, errno=111(Connection refused): server refused to accept the
client
2012-02-01 17:50:33,067:30685(0x2b2d1f5bb700):ZOO_ERROR@handle_socket_error_msg@1579: Socket
[127.0.0.1:53995] zk retcode=-4, errno=111(Connection refused): server refused to accept the
client
2012-02-01 17:50:33,168:30685(0x2b2d1fbbe700):ZOO_ERROR@handle_socket_error_msg@1579: Socket
[127.0.0.1:47123] zk retcode=-4, errno=111(Connection refused): server refused to accept the
client
2012-02-01 17:50:33,249:30685(0x2b2d1f1b9700):ZOO_ERROR@handle_socket_error_msg@1579: Socket
[127.0.0.1:55991] zk retcode=-4, errno=111(Connection refused): server refused to accept the
client
2012-02-01 17:50:33,342:30685(0x2b2d1fdbf700):ZOO_ERROR@handle_socket_error_msg@1579: Socket
[127.0.0.1:40450] zk retcode=-4, errno=111(Connection refused): server refused to accept the
client
2012-02-01 17:50:33,473:30685(0x2b2d24301700):ZOO_ERROR@handle_socket_error_msg@1579: Socket
[127.0.0.1:34406] zk retcode=-4, errno=111(Connection refused): server refused to accept the
client
2012-02-01 17:50:35,069:30685(0x2b2d1f5bb700):ZOO_ERROR@handle_socket_error_msg@1579: Socket
[127.0.0.1:53995] zk retcode=-4, errno=111(Connection refused): server refused to accept the
client
2012-02-01 17:50:35,170:30685(0x2b2d1fbbe700):ZOO_ERROR@handle_socket_error_msg@1579: Socket
[127.0.0.1:47123] zk retcode=-4, errno=111(Connection refused): server refused to accept the
client
2012-02-01 17:50:35,251:30685(0x2b2d1f1b9700):ZOO_ERROR@handle_socket_error_msg@1579: Socket
[127.0.0.1:55991] zk retcode=-4, errno=111(Connection refused): server refused to accept the
client
2012-02-01 17:50:35,344:30685(0x2b2d1fdbf700):ZOO_ERROR@handle_socket_error_msg@1579: Socket
[127.0.0.1:40450] zk retcode=-4, errno=111(Connection refused): server refused to accept the
client
2012-02-01 17:50:35,474:30685(0x2b2d24301700):ZOO_ERROR@handle_socket_error_msg@1579: Socket
[127.0.0.1:34406] zk retcode=-4, errno=111(Connection refused): server refused to accept the
client
2012-02-01 17:50:37,071:30685(0x2b2d1f5bb700):ZOO_ERROR@handle_socket_error_msg@1579: Socket
[127.0.0.1:53995] zk retcode=-4, errno=111(Connection refused): server refused to accept the
client
2012-02-01 17:50:37,172:30685(0x2b2d1fbbe700):ZOO_ERROR@handle_socket_error_msg@1579: Socket
[127.0.0.1:47123] zk retcode=-4, errno=111(Connection refused): server refused to accept the
client
[       OK ] SampleFrameworks.PythonFramework (6159 ms)
[----------] 4 tests from SampleFrameworks (12697 ms total)

[----------] 1 test from UUIDTest
[ RUN      ] UUIDTest.test
[       OK ] UUIDTest.test (1 ms)
[----------] 1 test from UUIDTest (1 ms total)

[----------] 20 tests from ResourcesTest
[ RUN      ] ResourcesTest.Parsing
[       OK ] ResourcesTest.Parsing (0 ms)
[ RUN      ] ResourcesTest.Printing
[       OK ] ResourcesTest.Printing (0 ms)
[ RUN      ] ResourcesTest.InitializedIsEmpty
[       OK ] ResourcesTest.InitializedIsEmpty (0 ms)
[ RUN      ] ResourcesTest.BadResourcesNotAllocatable
[       OK ] ResourcesTest.BadResourcesNotAllocatable (0 ms)
[ RUN      ] ResourcesTest.ScalarEquals
[       OK ] ResourcesTest.ScalarEquals (0 ms)
[ RUN      ] ResourcesTest.ScalarSubset
[       OK ] ResourcesTest.ScalarSubset (0 ms)
[ RUN      ] ResourcesTest.ScalarAddition
[       OK ] ResourcesTest.ScalarAddition (0 ms)
[ RUN      ] ResourcesTest.ScalarSubtraction
[       OK ] ResourcesTest.ScalarSubtraction (0 ms)
[ RUN      ] ResourcesTest.RangesEquals
[       OK ] ResourcesTest.RangesEquals (0 ms)
[ RUN      ] ResourcesTest.RangesSubset
[       OK ] ResourcesTest.RangesSubset (0 ms)
[ RUN      ] ResourcesTest.RangesAddition
[       OK ] ResourcesTest.RangesAddition (0 ms)
[ RUN      ] ResourcesTest.RangesSubtraction
[       OK ] ResourcesTest.RangesSubtraction (0 ms)
[ RUN      ] ResourcesTest.RangesSubtraction1
[       OK ] ResourcesTest.RangesSubtraction1 (0 ms)
[ RUN      ] ResourcesTest.RangesSubtraction2
[       OK ] ResourcesTest.RangesSubtraction2 (0 ms)
[ RUN      ] ResourcesTest.RangesSubtraction3
[       OK ] ResourcesTest.RangesSubtraction3 (0 ms)
[ RUN      ] ResourcesTest.RangesSubtraction4
[       OK ] ResourcesTest.RangesSubtraction4 (0 ms)
[ RUN      ] ResourcesTest.SetEquals
[       OK ] ResourcesTest.SetEquals (0 ms)
[ RUN      ] ResourcesTest.SetSubset
[       OK ] ResourcesTest.SetSubset (0 ms)
[ RUN      ] ResourcesTest.SetAddition
[       OK ] ResourcesTest.SetAddition (0 ms)
[ RUN      ] ResourcesTest.SetSubtraction
[       OK ] ResourcesTest.SetSubtraction (0 ms)
[----------] 20 tests from ResourcesTest (1 ms total)

[----------] 3 tests from ReplicaTest
[ RUN      ] ReplicaTest.Promise
2012-02-01 17:50:37,253:30685(0x2b2d1f1b9700):ZOO_ERROR@handle_socket_error_msg@1579: Socket
[127.0.0.1:55991] zk retcode=-4, errno=111(Connection refused): server refused to accept the
client
2012-02-01 17:50:37,346:30685(0x2b2d1fdbf700):ZOO_ERROR@handle_socket_error_msg@1579: Socket
[127.0.0.1:40450] zk retcode=-4, errno=111(Connection refused): server refused to accept the
client
[       OK ] ReplicaTest.Promise (154 ms)
[ RUN      ] ReplicaTest.Append
2012-02-01 17:50:37,476:30685(0x2b2d24301700):ZOO_ERROR@handle_socket_error_msg@1579: Socket
[127.0.0.1:34406] zk retcode=-4, errno=111(Connection refused): server refused to accept the
client
[       OK ] ReplicaTest.Append (84 ms)
[ RUN      ] ReplicaTest.Recover
[       OK ] ReplicaTest.Recover (176 ms)
[----------] 3 tests from ReplicaTest (414 ms total)

[----------] 16 tests from CoordinatorTest
[ RUN      ] CoordinatorTest.Elect
[       OK ] CoordinatorTest.Elect (171 ms)
[ RUN      ] CoordinatorTest.AppendRead
[       OK ] CoordinatorTest.AppendRead (179 ms)
[ RUN      ] CoordinatorTest.AppendReadError
[       OK ] CoordinatorTest.AppendReadError (200 ms)
[ RUN      ] CoordinatorTest.Failover
[       OK ] CoordinatorTest.Failover (215 ms)
[ RUN      ] CoordinatorTest.Demoted
[       OK ] CoordinatorTest.Demoted (240 ms)
[ RUN      ] CoordinatorTest.Fill
[       OK ] CoordinatorTest.Fill (307 ms)
[ RUN      ] CoordinatorTest.NotLearnedFill
2012-02-01 17:50:39,073:30685(0x2b2d1f5bb700):ZOO_ERROR@handle_socket_error_msg@1579: Socket
[127.0.0.1:53995] zk retcode=-4, errno=111(Connection refused): server refused to accept the
client
2012-02-01 17:50:39,174:30685(0x2b2d1fbbe700):ZOO_ERROR@handle_socket_error_msg@1579: Socket
[127.0.0.1:47123] zk retcode=-4, errno=111(Connection refused): server refused to accept the
client
[       OK ] CoordinatorTest.NotLearnedFill (259 ms)
[ RUN      ] CoordinatorTest.MultipleAppends
2012-02-01 17:50:39,254:30685(0x2b2d1f1b9700):ZOO_ERROR@handle_socket_error_msg@1579: Socket
[127.0.0.1:55991] zk retcode=-4, errno=111(Connection refused): server refused to accept the
client
2012-02-01 17:50:39,348:30685(0x2b2d1fdbf700):ZOO_ERROR@handle_socket_error_msg@1579: Socket
[127.0.0.1:40450] zk retcode=-4, errno=111(Connection refused): server refused to accept the
client
2012-02-01 17:50:39,478:30685(0x2b2d24301700):ZOO_ERROR@handle_socket_error_msg@1579: Socket
[127.0.0.1:34406] zk retcode=-4, errno=111(Connection refused): server refused to accept the
client
[       OK ] CoordinatorTest.MultipleAppends (350 ms)
[ RUN      ] CoordinatorTest.MultipleAppendsNotLearnedFill
[       OK ] CoordinatorTest.MultipleAppendsNotLearnedFill (654 ms)
[ RUN      ] CoordinatorTest.Truncate
[       OK ] CoordinatorTest.Truncate (462 ms)
[ RUN      ] CoordinatorTest.TruncateNotLearnedFill
2012-02-01 17:50:41,075:30685(0x2b2d1f5bb700):ZOO_ERROR@handle_socket_error_msg@1579: Socket
[127.0.0.1:53995] zk retcode=-4, errno=111(Connection refused): server refused to accept the
client
2012-02-01 17:50:41,176:30685(0x2b2d1fbbe700):ZOO_ERROR@handle_socket_error_msg@1579: Socket
[127.0.0.1:47123] zk retcode=-4, errno=111(Connection refused): server refused to accept the
client
2012-02-01 17:50:41,256:30685(0x2b2d1f1b9700):ZOO_ERROR@handle_socket_error_msg@1579: Socket
[127.0.0.1:55991] zk retcode=-4, errno=111(Connection refused): server refused to accept the
client
2012-02-01 17:50:41,351:30685(0x2b2d1fdbf700):ZOO_ERROR@handle_socket_error_msg@1579: Socket
[127.0.0.1:40450] zk retcode=-4, errno=111(Connection refused): server refused to accept the
client
2012-02-01 17:50:41,480:30685(0x2b2d24301700):ZOO_ERROR@handle_socket_error_msg@1579: Socket
[127.0.0.1:34406] zk retcode=-4, errno=111(Connection refused): server refused to accept the
client
[       OK ] CoordinatorTest.TruncateNotLearnedFill (796 ms)
[ RUN      ] CoordinatorTest.RacingElect
[       OK ] CoordinatorTest.RacingElect (0 ms)
[ RUN      ] CoordinatorTest.FillNoQuorum
[       OK ] CoordinatorTest.FillNoQuorum (0 ms)
[ RUN      ] CoordinatorTest.FillInconsistent
[       OK ] CoordinatorTest.FillInconsistent (0 ms)
[ RUN      ] CoordinatorTest.LearnedOnOneReplica_NotLearnedOnAnother
[       OK ] CoordinatorTest.LearnedOnOneReplica_NotLearnedOnAnother (0 ms)
[ RUN      ] CoordinatorTest.LearnedOnOneReplica_NotLearnedOnAnother_AnotherFailsAndRecovers
[       OK ] CoordinatorTest.LearnedOnOneReplica_NotLearnedOnAnother_AnotherFailsAndRecovers
(0 ms)
[----------] 16 tests from CoordinatorTest (3833 ms total)

[----------] 2 tests from LogTest
[ RUN      ] LogTest.WriteRead
[       OK ] LogTest.WriteRead (220 ms)
[ RUN      ] LogTest.Position
[       OK ] LogTest.Position (308 ms)
[----------] 2 tests from LogTest (528 ms total)

[----------] 9 tests from FaultToleranceTest
[ RUN      ] FaultToleranceTest.SlaveLost
[       OK ] FaultToleranceTest.SlaveLost (1 ms)
[ RUN      ] FaultToleranceTest.SlavePartitioned
[       OK ] FaultToleranceTest.SlavePartitioned (10 ms)
[ RUN      ] FaultToleranceTest.SchedulerFailover
[       OK ] FaultToleranceTest.SchedulerFailover (1 ms)
[ RUN      ] FaultToleranceTest.FrameworkReliableRegistration
[       OK ] FaultToleranceTest.FrameworkReliableRegistration (1004 ms)
[ RUN      ] FaultToleranceTest.FrameworkReregister
[       OK ] FaultToleranceTest.FrameworkReregister (1 ms)
[ RUN      ] FaultToleranceTest.SchedulerFailoverStatusUpdate
2012-02-01 17:50:43,078:30685(0x2b2d1f5bb700):ZOO_ERROR@handle_socket_error_msg@1579: Socket
[127.0.0.1:53995] zk retcode=-4, errno=111(Connection refused): server refused to accept the
client
[       OK ] FaultToleranceTest.SchedulerFailoverStatusUpdate (62 ms)
[ RUN      ] FaultToleranceTest.SchedulerFailoverFrameworkMessage
[       OK ] FaultToleranceTest.SchedulerFailoverFrameworkMessage (4 ms)
[ RUN      ] FaultToleranceTest.SlaveReliableRegistration
2012-02-01 17:50:43,178:30685(0x2b2d1fbbe700):ZOO_ERROR@handle_socket_error_msg@1579: Socket
[127.0.0.1:47123] zk retcode=-4, errno=111(Connection refused): server refused to accept the
client
2012-02-01 17:50:43,256:30685(0x2b2d1f1b9700):ZOO_ERROR@handle_socket_error_msg@1579: Socket
[127.0.0.1:55991] zk retcode=-4, errno=111(Connection refused): server refused to accept the
client
2012-02-01 17:50:43,353:30685(0x2b2d1fdbf700):ZOO_ERROR@handle_socket_error_msg@1579: Socket
[127.0.0.1:40450] zk retcode=-4, errno=111(Connection refused): server refused to accept the
client
2012-02-01 17:50:43,481:30685(0x2b2d24301700):ZOO_ERROR@handle_socket_error_msg@1579: Socket
[127.0.0.1:34406] zk retcode=-4, errno=111(Connection refused): server refused to accept the
client
[       OK ] FaultToleranceTest.SlaveReliableRegistration (1002 ms)
[ RUN      ] FaultToleranceTest.SlaveReregister
[       OK ] FaultToleranceTest.SlaveReregister (2 ms)
[----------] 9 tests from FaultToleranceTest (2087 ms total)

[----------] 7 tests from ResourceOffersTest
[ RUN      ] ResourceOffersTest.ResourceOfferWithMultipleSlaves
[       OK ] ResourceOffersTest.ResourceOfferWithMultipleSlaves (2 ms)
[ RUN      ] ResourceOffersTest.TaskUsesNoResources
[       OK ] ResourceOffersTest.TaskUsesNoResources (3 ms)
[ RUN      ] ResourceOffersTest.TaskUsesInvalidResources
[       OK ] ResourceOffersTest.TaskUsesInvalidResources (2 ms)
[ RUN      ] ResourceOffersTest.TaskUsesMoreResourcesThanOffered
[       OK ] ResourceOffersTest.TaskUsesMoreResourcesThanOffered (2 ms)
[ RUN      ] ResourceOffersTest.ResourcesGetReofferedWhenUnused
[       OK ] ResourceOffersTest.ResourcesGetReofferedWhenUnused (2 ms)
[ RUN      ] ResourceOffersTest.ResourcesGetReofferedAfterTaskDescriptionError
[       OK ] ResourceOffersTest.ResourcesGetReofferedAfterTaskDescriptionError (3 ms)
[ RUN      ] ResourceOffersTest.ResourceRequest
[       OK ] ResourceOffersTest.ResourceRequest (1 ms)
[----------] 7 tests from ResourceOffersTest (15 ms total)

[----------] 4 tests from MasterTest
[ RUN      ] MasterTest.TaskRunning
[       OK ] MasterTest.TaskRunning (5 ms)
[ RUN      ] MasterTest.KillTask
[       OK ] MasterTest.KillTask (4 ms)
[ RUN      ] MasterTest.FrameworkMessage
[       OK ] MasterTest.FrameworkMessage (5 ms)
[ RUN      ] MasterTest.MultipleExecutors
[       OK ] MasterTest.MultipleExecutors (6 ms)
[----------] 4 tests from MasterTest (20 ms total)

[----------] 5 tests from FrameworksManagerTestFixture
[ RUN      ] FrameworksManagerTestFixture.AddFramework
[       OK ] FrameworksManagerTestFixture.AddFramework (2 ms)
[ RUN      ] FrameworksManagerTestFixture.RemoveFramework
[       OK ] FrameworksManagerTestFixture.RemoveFramework (2 ms)
[ RUN      ] FrameworksManagerTestFixture.ResurrectFramework
[       OK ] FrameworksManagerTestFixture.ResurrectFramework (1 ms)
[ RUN      ] FrameworksManagerTestFixture.ResurrectExpiringFramework
[       OK ] FrameworksManagerTestFixture.ResurrectExpiringFramework (1 ms)
[ RUN      ] FrameworksManagerTestFixture.ResurrectInterspersedExpiringFrameworks
[       OK ] FrameworksManagerTestFixture.ResurrectInterspersedExpiringFrameworks (2 ms)
[----------] 5 tests from FrameworksManagerTestFixture (8 ms total)

[----------] 1 test from FrameworksManagerTest
[ RUN      ] FrameworksManagerTest.CacheFailure
E0201 17:50:44.147624 30705 frameworks_manager.cpp:213] Error getting framework info from
underlying storage: Fake Caching Error.
E0201 17:50:44.148408 30705 frameworks_manager.cpp:213] Error getting framework info from
underlying storage: Fake Caching Error.
[       OK ] FrameworksManagerTest.CacheFailure (1 ms)
[----------] 1 test from FrameworksManagerTest (1 ms total)

[----------] Global test environment tear-down
[==========] 120 tests from 21 test cases ran. (37166 ms total)
[  PASSED  ] 118 tests.
[  FAILED  ] 2 tests, listed below:
[  FAILED  ] SampleFrameworks.JavaFramework
[  FAILED  ] SampleFrameworks.JavaExceptionFramework

 2 FAILED TESTS
  YOU HAVE 6 DISABLED TESTS

FAIL: mesos-tests
==================
1 of 1 test failed
==================
make[3]: *** [check-TESTS] Error 1
make[3]: Leaving directory `<https://builds.apache.org/job/Mesos-Trunk-Ubuntu-Build-In-Src-Set-JAVA_HOME/ws/src'>
make[2]: *** [check-am] Error 2
make[2]: Leaving directory `<https://builds.apache.org/job/Mesos-Trunk-Ubuntu-Build-In-Src-Set-JAVA_HOME/ws/src'>
make[1]: *** [check] Error 2
make[1]: Leaving directory `<https://builds.apache.org/job/Mesos-Trunk-Ubuntu-Build-In-Src-Set-JAVA_HOME/ws/src'>
make: *** [check-recursive] Error 1
Build step 'Execute shell' marked build as failure


Mime
View raw message