mesos-dev mailing list archives

Site index · List index
Message view « Date » · « Thread »
Top « Date » · « Thread »
From Apache Jenkins Server <jenk...@builds.apache.org>
Subject Build failed in Jenkins: Mesos-Trunk-Ubuntu-Build-Out-Of-Src-Disable-Java-Disable-Python-Disable-Webui #35
Date Wed, 01 Feb 2012 17:42:34 GMT
See <https://builds.apache.org/job/Mesos-Trunk-Ubuntu-Build-Out-Of-Src-Disable-Java-Disable-Python-Disable-Webui/35/changes>

Changes:

[benh] Changed jobject to jweak where necessary.

------------------------------------------
[...truncated 1521 lines...]
libtool: link: ar cru .libs/libhashtable.a  hashtable_itr.o hashtable.o
libtool: link: ranlib .libs/libhashtable.a
libtool: link: ( cd ".libs" && rm -f "libhashtable.la" && ln -s "../libhashtable.la" "libhashtable.la" )
/bin/bash ./libtool --tag=CC   --mode=link gcc -Wall -Werror  -g -O2 -D_GNU_SOURCE -no-undefined -version-info 2 -export-symbols-regex '(zoo_|zookeeper_|zhandle|Z|format_log_message|log_message|logLevel|deallocate_|zerror|is_unrecoverable)'  -o libzookeeper_st.la -rpath /usr/local/lib  libzkst.la libhashtable.la 
libtool: link: (cd .libs/libzookeeper_st.lax/libzkst.a && ar x "/x1/jenkins/jenkins-slave/workspace/Mesos-Trunk-Ubuntu-Build-Out-Of-Src-Disable-Java-Disable-Python-Disable-Webui/build/third_party/zookeeper-3.3.1/src/c/./.libs/libzkst.a")
libtool: link: (cd .libs/libzookeeper_st.lax/libhashtable.a && ar x "/x1/jenkins/jenkins-slave/workspace/Mesos-Trunk-Ubuntu-Build-Out-Of-Src-Disable-Java-Disable-Python-Disable-Webui/build/third_party/zookeeper-3.3.1/src/c/./.libs/libhashtable.a")
libtool: link: ar cru .libs/libzookeeper_st.a   .libs/libzookeeper_st.lax/libzkst.a/zookeeper.o .libs/libzookeeper_st.lax/libzkst.a/zookeeper.jute.o .libs/libzookeeper_st.lax/libzkst.a/zk_hashtable.o .libs/libzookeeper_st.lax/libzkst.a/zk_log.o .libs/libzookeeper_st.lax/libzkst.a/recordio.o .libs/libzookeeper_st.lax/libzkst.a/st_adaptor.o  .libs/libzookeeper_st.lax/libhashtable.a/hashtable_itr.o .libs/libzookeeper_st.lax/libhashtable.a/hashtable.o 
libtool: link: ranlib .libs/libzookeeper_st.a
libtool: link: rm -fr .libs/libzookeeper_st.lax
libtool: link: ( cd ".libs" && rm -f "libzookeeper_st.la" && ln -s "../libzookeeper_st.la" "libzookeeper_st.la" )
/bin/bash ./libtool  --tag=CC   --mode=compile gcc -DHAVE_CONFIG_H -I. -I../../../../../third_party/zookeeper-3.3.1/src/c  -I../../../../../third_party/zookeeper-3.3.1/src/c/include -I../../../../../third_party/zookeeper-3.3.1/src/c/tests -I../../../../../third_party/zookeeper-3.3.1/src/c/generated  -DTHREADED -g -O2 -D_GNU_SOURCE -MT libzkmt_la-zookeeper.lo -MD -MP -MF .deps/libzkmt_la-zookeeper.Tpo -c -o libzkmt_la-zookeeper.lo `test -f 'src/zookeeper.c' || echo '../../../../../third_party/zookeeper-3.3.1/src/c/'`src/zookeeper.c
libtool: compile:  gcc -DHAVE_CONFIG_H -I. -I../../../../../third_party/zookeeper-3.3.1/src/c -I../../../../../third_party/zookeeper-3.3.1/src/c/include -I../../../../../third_party/zookeeper-3.3.1/src/c/tests -I../../../../../third_party/zookeeper-3.3.1/src/c/generated -DTHREADED -g -O2 -D_GNU_SOURCE -MT libzkmt_la-zookeeper.lo -MD -MP -MF .deps/libzkmt_la-zookeeper.Tpo -c ../../../../../third_party/zookeeper-3.3.1/src/c/src/zookeeper.c  -fPIC -DPIC -o libzkmt_la-zookeeper.o
mv -f .deps/libzkmt_la-zookeeper.Tpo .deps/libzkmt_la-zookeeper.Plo
/bin/bash ./libtool  --tag=CC   --mode=compile gcc -DHAVE_CONFIG_H -I. -I../../../../../third_party/zookeeper-3.3.1/src/c  -I../../../../../third_party/zookeeper-3.3.1/src/c/include -I../../../../../third_party/zookeeper-3.3.1/src/c/tests -I../../../../../third_party/zookeeper-3.3.1/src/c/generated  -DTHREADED -g -O2 -D_GNU_SOURCE -MT libzkmt_la-recordio.lo -MD -MP -MF .deps/libzkmt_la-recordio.Tpo -c -o libzkmt_la-recordio.lo `test -f 'src/recordio.c' || echo '../../../../../third_party/zookeeper-3.3.1/src/c/'`src/recordio.c
libtool: compile:  gcc -DHAVE_CONFIG_H -I. -I../../../../../third_party/zookeeper-3.3.1/src/c -I../../../../../third_party/zookeeper-3.3.1/src/c/include -I../../../../../third_party/zookeeper-3.3.1/src/c/tests -I../../../../../third_party/zookeeper-3.3.1/src/c/generated -DTHREADED -g -O2 -D_GNU_SOURCE -MT libzkmt_la-recordio.lo -MD -MP -MF .deps/libzkmt_la-recordio.Tpo -c ../../../../../third_party/zookeeper-3.3.1/src/c/src/recordio.c  -fPIC -DPIC -o libzkmt_la-recordio.o
mv -f .deps/libzkmt_la-recordio.Tpo .deps/libzkmt_la-recordio.Plo
/bin/bash ./libtool  --tag=CC   --mode=compile gcc -DHAVE_CONFIG_H -I. -I../../../../../third_party/zookeeper-3.3.1/src/c  -I../../../../../third_party/zookeeper-3.3.1/src/c/include -I../../../../../third_party/zookeeper-3.3.1/src/c/tests -I../../../../../third_party/zookeeper-3.3.1/src/c/generated  -DTHREADED -g -O2 -D_GNU_SOURCE -MT libzkmt_la-zookeeper.jute.lo -MD -MP -MF .deps/libzkmt_la-zookeeper.jute.Tpo -c -o libzkmt_la-zookeeper.jute.lo `test -f 'generated/zookeeper.jute.c' || echo '../../../../../third_party/zookeeper-3.3.1/src/c/'`generated/zookeeper.jute.c
libtool: compile:  gcc -DHAVE_CONFIG_H -I. -I../../../../../third_party/zookeeper-3.3.1/src/c -I../../../../../third_party/zookeeper-3.3.1/src/c/include -I../../../../../third_party/zookeeper-3.3.1/src/c/tests -I../../../../../third_party/zookeeper-3.3.1/src/c/generated -DTHREADED -g -O2 -D_GNU_SOURCE -MT libzkmt_la-zookeeper.jute.lo -MD -MP -MF .deps/libzkmt_la-zookeeper.jute.Tpo -c ../../../../../third_party/zookeeper-3.3.1/src/c/generated/zookeeper.jute.c  -fPIC -DPIC -o libzkmt_la-zookeeper.jute.o
mv -f .deps/libzkmt_la-zookeeper.jute.Tpo .deps/libzkmt_la-zookeeper.jute.Plo
/bin/bash ./libtool  --tag=CC   --mode=compile gcc -DHAVE_CONFIG_H -I. -I../../../../../third_party/zookeeper-3.3.1/src/c  -I../../../../../third_party/zookeeper-3.3.1/src/c/include -I../../../../../third_party/zookeeper-3.3.1/src/c/tests -I../../../../../third_party/zookeeper-3.3.1/src/c/generated  -DTHREADED -g -O2 -D_GNU_SOURCE -MT libzkmt_la-zk_log.lo -MD -MP -MF .deps/libzkmt_la-zk_log.Tpo -c -o libzkmt_la-zk_log.lo `test -f 'src/zk_log.c' || echo '../../../../../third_party/zookeeper-3.3.1/src/c/'`src/zk_log.c
libtool: compile:  gcc -DHAVE_CONFIG_H -I. -I../../../../../third_party/zookeeper-3.3.1/src/c -I../../../../../third_party/zookeeper-3.3.1/src/c/include -I../../../../../third_party/zookeeper-3.3.1/src/c/tests -I../../../../../third_party/zookeeper-3.3.1/src/c/generated -DTHREADED -g -O2 -D_GNU_SOURCE -MT libzkmt_la-zk_log.lo -MD -MP -MF .deps/libzkmt_la-zk_log.Tpo -c ../../../../../third_party/zookeeper-3.3.1/src/c/src/zk_log.c  -fPIC -DPIC -o libzkmt_la-zk_log.o
mv -f .deps/libzkmt_la-zk_log.Tpo .deps/libzkmt_la-zk_log.Plo
/bin/bash ./libtool  --tag=CC   --mode=compile gcc -DHAVE_CONFIG_H -I. -I../../../../../third_party/zookeeper-3.3.1/src/c  -I../../../../../third_party/zookeeper-3.3.1/src/c/include -I../../../../../third_party/zookeeper-3.3.1/src/c/tests -I../../../../../third_party/zookeeper-3.3.1/src/c/generated  -DTHREADED -g -O2 -D_GNU_SOURCE -MT libzkmt_la-zk_hashtable.lo -MD -MP -MF .deps/libzkmt_la-zk_hashtable.Tpo -c -o libzkmt_la-zk_hashtable.lo `test -f 'src/zk_hashtable.c' || echo '../../../../../third_party/zookeeper-3.3.1/src/c/'`src/zk_hashtable.c
libtool: compile:  gcc -DHAVE_CONFIG_H -I. -I../../../../../third_party/zookeeper-3.3.1/src/c -I../../../../../third_party/zookeeper-3.3.1/src/c/include -I../../../../../third_party/zookeeper-3.3.1/src/c/tests -I../../../../../third_party/zookeeper-3.3.1/src/c/generated -DTHREADED -g -O2 -D_GNU_SOURCE -MT libzkmt_la-zk_hashtable.lo -MD -MP -MF .deps/libzkmt_la-zk_hashtable.Tpo -c ../../../../../third_party/zookeeper-3.3.1/src/c/src/zk_hashtable.c  -fPIC -DPIC -o libzkmt_la-zk_hashtable.o
mv -f .deps/libzkmt_la-zk_hashtable.Tpo .deps/libzkmt_la-zk_hashtable.Plo
/bin/bash ./libtool  --tag=CC   --mode=compile gcc -DHAVE_CONFIG_H -I. -I../../../../../third_party/zookeeper-3.3.1/src/c  -I../../../../../third_party/zookeeper-3.3.1/src/c/include -I../../../../../third_party/zookeeper-3.3.1/src/c/tests -I../../../../../third_party/zookeeper-3.3.1/src/c/generated  -DTHREADED -g -O2 -D_GNU_SOURCE -MT libzkmt_la-mt_adaptor.lo -MD -MP -MF .deps/libzkmt_la-mt_adaptor.Tpo -c -o libzkmt_la-mt_adaptor.lo `test -f 'src/mt_adaptor.c' || echo '../../../../../third_party/zookeeper-3.3.1/src/c/'`src/mt_adaptor.c
libtool: compile:  gcc -DHAVE_CONFIG_H -I. -I../../../../../third_party/zookeeper-3.3.1/src/c -I../../../../../third_party/zookeeper-3.3.1/src/c/include -I../../../../../third_party/zookeeper-3.3.1/src/c/tests -I../../../../../third_party/zookeeper-3.3.1/src/c/generated -DTHREADED -g -O2 -D_GNU_SOURCE -MT libzkmt_la-mt_adaptor.lo -MD -MP -MF .deps/libzkmt_la-mt_adaptor.Tpo -c ../../../../../third_party/zookeeper-3.3.1/src/c/src/mt_adaptor.c  -fPIC -DPIC -o libzkmt_la-mt_adaptor.o
mv -f .deps/libzkmt_la-mt_adaptor.Tpo .deps/libzkmt_la-mt_adaptor.Plo
/bin/bash ./libtool --tag=CC   --mode=link gcc -DTHREADED -g -O2 -D_GNU_SOURCE   -o libzkmt.la  libzkmt_la-zookeeper.lo libzkmt_la-recordio.lo libzkmt_la-zookeeper.jute.lo libzkmt_la-zk_log.lo libzkmt_la-zk_hashtable.lo libzkmt_la-mt_adaptor.lo -lm 
libtool: link: ar cru .libs/libzkmt.a  libzkmt_la-zookeeper.o libzkmt_la-recordio.o libzkmt_la-zookeeper.jute.o libzkmt_la-zk_log.o libzkmt_la-zk_hashtable.o libzkmt_la-mt_adaptor.o
libtool: link: ranlib .libs/libzkmt.a
libtool: link: ( cd ".libs" && rm -f "libzkmt.la" && ln -s "../libzkmt.la" "libzkmt.la" )
/bin/bash ./libtool --tag=CC   --mode=link gcc -Wall -Werror  -g -O2 -D_GNU_SOURCE -no-undefined -version-info 2 -export-symbols-regex '(zoo_|zookeeper_|zhandle|Z|format_log_message|log_message|logLevel|deallocate_|zerror|is_unrecoverable)'  -o libzookeeper_mt.la -rpath /usr/local/lib  libzkmt.la libhashtable.la -lpthread 
libtool: link: (cd .libs/libzookeeper_mt.lax/libzkmt.a && ar x "/x1/jenkins/jenkins-slave/workspace/Mesos-Trunk-Ubuntu-Build-Out-Of-Src-Disable-Java-Disable-Python-Disable-Webui/build/third_party/zookeeper-3.3.1/src/c/./.libs/libzkmt.a")
libtool: link: (cd .libs/libzookeeper_mt.lax/libhashtable.a && ar x "/x1/jenkins/jenkins-slave/workspace/Mesos-Trunk-Ubuntu-Build-Out-Of-Src-Disable-Java-Disable-Python-Disable-Webui/build/third_party/zookeeper-3.3.1/src/c/./.libs/libhashtable.a")
libtool: link: ar cru .libs/libzookeeper_mt.a   .libs/libzookeeper_mt.lax/libzkmt.a/libzkmt_la-zookeeper.jute.o .libs/libzookeeper_mt.lax/libzkmt.a/libzkmt_la-zk_log.o .libs/libzookeeper_mt.lax/libzkmt.a/libzkmt_la-zookeeper.o .libs/libzookeeper_mt.lax/libzkmt.a/libzkmt_la-recordio.o .libs/libzookeeper_mt.lax/libzkmt.a/libzkmt_la-zk_hashtable.o .libs/libzookeeper_mt.lax/libzkmt.a/libzkmt_la-mt_adaptor.o  .libs/libzookeeper_mt.lax/libhashtable.a/hashtable_itr.o .libs/libzookeeper_mt.lax/libhashtable.a/hashtable.o 
libtool: link: ranlib .libs/libzookeeper_mt.a
libtool: link: rm -fr .libs/libzookeeper_mt.lax
libtool: link: ( cd ".libs" && rm -f "libzookeeper_mt.la" && ln -s "../libzookeeper_mt.la" "libzookeeper_mt.la" )
gcc -DHAVE_CONFIG_H -I. -I../../../../../third_party/zookeeper-3.3.1/src/c  -I../../../../../third_party/zookeeper-3.3.1/src/c/include -I../../../../../third_party/zookeeper-3.3.1/src/c/tests -I../../../../../third_party/zookeeper-3.3.1/src/c/generated  -Wall -Werror  -g -O2 -D_GNU_SOURCE -MT cli.o -MD -MP -MF .deps/cli.Tpo -c -o cli.o `test -f 'src/cli.c' || echo '../../../../../third_party/zookeeper-3.3.1/src/c/'`src/cli.c
mv -f .deps/cli.Tpo .deps/cli.Po
/bin/bash ./libtool --tag=CC   --mode=link gcc -Wall -Werror  -g -O2 -D_GNU_SOURCE   -o cli_st cli.o libzookeeper_st.la 
libtool: link: gcc -Wall -Werror -g -O2 -D_GNU_SOURCE -o cli_st cli.o  ./.libs/libzookeeper_st.a -lm
gcc -DHAVE_CONFIG_H -I. -I../../../../../third_party/zookeeper-3.3.1/src/c  -I../../../../../third_party/zookeeper-3.3.1/src/c/include -I../../../../../third_party/zookeeper-3.3.1/src/c/tests -I../../../../../third_party/zookeeper-3.3.1/src/c/generated  -DTHREADED -g -O2 -D_GNU_SOURCE -MT cli_mt-cli.o -MD -MP -MF .deps/cli_mt-cli.Tpo -c -o cli_mt-cli.o `test -f 'src/cli.c' || echo '../../../../../third_party/zookeeper-3.3.1/src/c/'`src/cli.c
mv -f .deps/cli_mt-cli.Tpo .deps/cli_mt-cli.Po
/bin/bash ./libtool --tag=CC   --mode=link gcc -DTHREADED -g -O2 -D_GNU_SOURCE   -o cli_mt cli_mt-cli.o libzookeeper_mt.la 
libtool: link: gcc -DTHREADED -g -O2 -D_GNU_SOURCE -o cli_mt cli_mt-cli.o  ./.libs/libzookeeper_mt.a -lm -lpthread
gcc -DHAVE_CONFIG_H -I. -I../../../../../third_party/zookeeper-3.3.1/src/c  -I../../../../../third_party/zookeeper-3.3.1/src/c/include -I../../../../../third_party/zookeeper-3.3.1/src/c/tests -I../../../../../third_party/zookeeper-3.3.1/src/c/generated  -DTHREADED -g -O2 -D_GNU_SOURCE -MT load_gen-load_gen.o -MD -MP -MF .deps/load_gen-load_gen.Tpo -c -o load_gen-load_gen.o `test -f 'src/load_gen.c' || echo '../../../../../third_party/zookeeper-3.3.1/src/c/'`src/load_gen.c
mv -f .deps/load_gen-load_gen.Tpo .deps/load_gen-load_gen.Po
/bin/bash ./libtool --tag=CC   --mode=link gcc -DTHREADED -g -O2 -D_GNU_SOURCE   -o load_gen load_gen-load_gen.o libzookeeper_mt.la 
libtool: link: gcc -DTHREADED -g -O2 -D_GNU_SOURCE -o load_gen load_gen-load_gen.o  ./.libs/libzookeeper_mt.a -lm -lpthread
make[3]: Leaving directory `/x1/jenkins/jenkins-slave/workspace/Mesos-Trunk-Ubuntu-Build-Out-Of-Src-Disable-Java-Disable-Python-Disable-Webui/build/third_party/zookeeper-3.3.1/src/c'
make[2]: Leaving directory `/x1/jenkins/jenkins-slave/workspace/Mesos-Trunk-Ubuntu-Build-Out-Of-Src-Disable-Java-Disable-Python-Disable-Webui/build/third_party/zookeeper-3.3.1/src/c'
make[2]: Entering directory `/x1/jenkins/jenkins-slave/workspace/Mesos-Trunk-Ubuntu-Build-Out-Of-Src-Disable-Java-Disable-Python-Disable-Webui/build/third_party/libprocess'
make -C third_party/glog-0.3.1
make[3]: Entering directory `/x1/jenkins/jenkins-slave/workspace/Mesos-Trunk-Ubuntu-Build-Out-Of-Src-Disable-Java-Disable-Python-Disable-Webui/build/third_party/libprocess/third_party/glog-0.3.1'
/bin/bash ./libtool --tag=CXX   --mode=compile g++ -DHAVE_CONFIG_H -I. -I../../../../../third_party/libprocess/third_party/glog-0.3.1 -I./src  -I../../../../../third_party/libprocess/third_party/glog-0.3.1/src    -Wall -Wwrite-strings -Woverloaded-virtual -Wno-sign-compare  -DNO_FRAME_POINTER -DNDEBUG -g -O2 -MT libglog_la-logging.lo -MD -MP -MF .deps/libglog_la-logging.Tpo -c -o libglog_la-logging.lo `test -f 'src/logging.cc' || echo '../../../../../third_party/libprocess/third_party/glog-0.3.1/'`src/logging.cc
 g++ -DHAVE_CONFIG_H -I. -I../../../../../third_party/libprocess/third_party/glog-0.3.1 -I./src -I../../../../../third_party/libprocess/third_party/glog-0.3.1/src -Wall -Wwrite-strings -Woverloaded-virtual -Wno-sign-compare -DNO_FRAME_POINTER -DNDEBUG -g -O2 -MT libglog_la-logging.lo -MD -MP -MF .deps/libglog_la-logging.Tpo -c ../../../../../third_party/libprocess/third_party/glog-0.3.1/src/logging.cc  -fPIC -DPIC -o libglog_la-logging.o
../../../../../third_party/libprocess/third_party/glog-0.3.1/src/logging.cc: In function 'void google::WriteToStderr(const char*, size_t)':
../../../../../third_party/libprocess/third_party/glog-0.3.1/src/logging.cc:506: warning: ignoring return value of 'ssize_t write(int, const void*, size_t)', declared with attribute warn_unused_result
../../../../../third_party/libprocess/third_party/glog-0.3.1/src/logging.cc: In member function 'bool google::<unnamed>::LogFileObject::CreateLogfile(const char*)':
../../../../../third_party/libprocess/third_party/glog-0.3.1/src/logging.cc:722: warning: ignoring return value of 'int symlink(const char*, const char*)', declared with attribute warn_unused_result
../../../../../third_party/libprocess/third_party/glog-0.3.1/src/logging.cc:729: warning: ignoring return value of 'int symlink(const char*, const char*)', declared with attribute warn_unused_result
../../../../../third_party/libprocess/third_party/glog-0.3.1/src/logging.cc: In member function 'void google::LogMessage::SendToLog()':
../../../../../third_party/libprocess/third_party/glog-0.3.1/src/logging.cc:1215: warning: ignoring return value of 'ssize_t write(int, const void*, size_t)', declared with attribute warn_unused_result
mv -f .deps/libglog_la-logging.Tpo .deps/libglog_la-logging.Plo
/bin/bash ./libtool --tag=CXX   --mode=compile g++ -DHAVE_CONFIG_H -I. -I../../../../../third_party/libprocess/third_party/glog-0.3.1 -I./src  -I../../../../../third_party/libprocess/third_party/glog-0.3.1/src    -Wall -Wwrite-strings -Woverloaded-virtual -Wno-sign-compare  -DNO_FRAME_POINTER -DNDEBUG -g -O2 -MT libglog_la-raw_logging.lo -MD -MP -MF .deps/libglog_la-raw_logging.Tpo -c -o libglog_la-raw_logging.lo `test -f 'src/raw_logging.cc' || echo '../../../../../third_party/libprocess/third_party/glog-0.3.1/'`src/raw_logging.cc
 g++ -DHAVE_CONFIG_H -I. -I../../../../../third_party/libprocess/third_party/glog-0.3.1 -I./src -I../../../../../third_party/libprocess/third_party/glog-0.3.1/src -Wall -Wwrite-strings -Woverloaded-virtual -Wno-sign-compare -DNO_FRAME_POINTER -DNDEBUG -g -O2 -MT libglog_la-raw_logging.lo -MD -MP -MF .deps/libglog_la-raw_logging.Tpo -c ../../../../../third_party/libprocess/third_party/glog-0.3.1/src/raw_logging.cc  -fPIC -DPIC -o libglog_la-raw_logging.o
mv -f .deps/libglog_la-raw_logging.Tpo .deps/libglog_la-raw_logging.Plo
/bin/bash ./libtool --tag=CXX   --mode=compile g++ -DHAVE_CONFIG_H -I. -I../../../../../third_party/libprocess/third_party/glog-0.3.1 -I./src  -I../../../../../third_party/libprocess/third_party/glog-0.3.1/src    -Wall -Wwrite-strings -Woverloaded-virtual -Wno-sign-compare  -DNO_FRAME_POINTER -DNDEBUG -g -O2 -MT libglog_la-vlog_is_on.lo -MD -MP -MF .deps/libglog_la-vlog_is_on.Tpo -c -o libglog_la-vlog_is_on.lo `test -f 'src/vlog_is_on.cc' || echo '../../../../../third_party/libprocess/third_party/glog-0.3.1/'`src/vlog_is_on.cc
 g++ -DHAVE_CONFIG_H -I. -I../../../../../third_party/libprocess/third_party/glog-0.3.1 -I./src -I../../../../../third_party/libprocess/third_party/glog-0.3.1/src -Wall -Wwrite-strings -Woverloaded-virtual -Wno-sign-compare -DNO_FRAME_POINTER -DNDEBUG -g -O2 -MT libglog_la-vlog_is_on.lo -MD -MP -MF .deps/libglog_la-vlog_is_on.Tpo -c ../../../../../third_party/libprocess/third_party/glog-0.3.1/src/vlog_is_on.cc  -fPIC -DPIC -o libglog_la-vlog_is_on.o
mv -f .deps/libglog_la-vlog_is_on.Tpo .deps/libglog_la-vlog_is_on.Plo
/bin/bash ./libtool --tag=CXX   --mode=compile g++ -DHAVE_CONFIG_H -I. -I../../../../../third_party/libprocess/third_party/glog-0.3.1 -I./src  -I../../../../../third_party/libprocess/third_party/glog-0.3.1/src    -Wall -Wwrite-strings -Woverloaded-virtual -Wno-sign-compare  -DNO_FRAME_POINTER -DNDEBUG -g -O2 -MT libglog_la-utilities.lo -MD -MP -MF .deps/libglog_la-utilities.Tpo -c -o libglog_la-utilities.lo `test -f 'src/utilities.cc' || echo '../../../../../third_party/libprocess/third_party/glog-0.3.1/'`src/utilities.cc
 g++ -DHAVE_CONFIG_H -I. -I../../../../../third_party/libprocess/third_party/glog-0.3.1 -I./src -I../../../../../third_party/libprocess/third_party/glog-0.3.1/src -Wall -Wwrite-strings -Woverloaded-virtual -Wno-sign-compare -DNO_FRAME_POINTER -DNDEBUG -g -O2 -MT libglog_la-utilities.lo -MD -MP -MF .deps/libglog_la-utilities.Tpo -c ../../../../../third_party/libprocess/third_party/glog-0.3.1/src/utilities.cc  -fPIC -DPIC -o libglog_la-utilities.o
../../../../../third_party/libprocess/third_party/glog-0.3.1/src/utilities.cc: In function 'void google::DebugWriteToStderr(const char*, void*)':
../../../../../third_party/libprocess/third_party/glog-0.3.1/src/utilities.cc:82: warning: ignoring return value of 'ssize_t write(int, const void*, size_t)', declared with attribute warn_unused_result
mv -f .deps/libglog_la-utilities.Tpo .deps/libglog_la-utilities.Plo
/bin/bash ./libtool --tag=CXX   --mode=compile g++ -DHAVE_CONFIG_H -I. -I../../../../../third_party/libprocess/third_party/glog-0.3.1 -I./src  -I../../../../../third_party/libprocess/third_party/glog-0.3.1/src    -Wall -Wwrite-strings -Woverloaded-virtual -Wno-sign-compare  -DNO_FRAME_POINTER -DNDEBUG -g -O2 -MT libglog_la-demangle.lo -MD -MP -MF .deps/libglog_la-demangle.Tpo -c -o libglog_la-demangle.lo `test -f 'src/demangle.cc' || echo '../../../../../third_party/libprocess/third_party/glog-0.3.1/'`src/demangle.cc
 g++ -DHAVE_CONFIG_H -I. -I../../../../../third_party/libprocess/third_party/glog-0.3.1 -I./src -I../../../../../third_party/libprocess/third_party/glog-0.3.1/src -Wall -Wwrite-strings -Woverloaded-virtual -Wno-sign-compare -DNO_FRAME_POINTER -DNDEBUG -g -O2 -MT libglog_la-demangle.lo -MD -MP -MF .deps/libglog_la-demangle.Tpo -c ../../../../../third_party/libprocess/third_party/glog-0.3.1/src/demangle.cc  -fPIC -DPIC -o libglog_la-demangle.o
mv -f .deps/libglog_la-demangle.Tpo .deps/libglog_la-demangle.Plo
/bin/bash ./libtool --tag=CXX   --mode=compile g++ -DHAVE_CONFIG_H -I. -I../../../../../third_party/libprocess/third_party/glog-0.3.1 -I./src  -I../../../../../third_party/libprocess/third_party/glog-0.3.1/src    -Wall -Wwrite-strings -Woverloaded-virtual -Wno-sign-compare  -DNO_FRAME_POINTER -DNDEBUG -g -O2 -MT libglog_la-symbolize.lo -MD -MP -MF .deps/libglog_la-symbolize.Tpo -c -o libglog_la-symbolize.lo `test -f 'src/symbolize.cc' || echo '../../../../../third_party/libprocess/third_party/glog-0.3.1/'`src/symbolize.cc
 g++ -DHAVE_CONFIG_H -I. -I../../../../../third_party/libprocess/third_party/glog-0.3.1 -I./src -I../../../../../third_party/libprocess/third_party/glog-0.3.1/src -Wall -Wwrite-strings -Woverloaded-virtual -Wno-sign-compare -DNO_FRAME_POINTER -DNDEBUG -g -O2 -MT libglog_la-symbolize.lo -MD -MP -MF .deps/libglog_la-symbolize.Tpo -c ../../../../../third_party/libprocess/third_party/glog-0.3.1/src/symbolize.cc  -fPIC -DPIC -o libglog_la-symbolize.o
mv -f .deps/libglog_la-symbolize.Tpo .deps/libglog_la-symbolize.Plo
/bin/bash ./libtool --tag=CXX   --mode=compile g++ -DHAVE_CONFIG_H -I. -I../../../../../third_party/libprocess/third_party/glog-0.3.1 -I./src  -I../../../../../third_party/libprocess/third_party/glog-0.3.1/src    -Wall -Wwrite-strings -Woverloaded-virtual -Wno-sign-compare  -DNO_FRAME_POINTER -DNDEBUG -g -O2 -MT libglog_la-signalhandler.lo -MD -MP -MF .deps/libglog_la-signalhandler.Tpo -c -o libglog_la-signalhandler.lo `test -f 'src/signalhandler.cc' || echo '../../../../../third_party/libprocess/third_party/glog-0.3.1/'`src/signalhandler.cc
 g++ -DHAVE_CONFIG_H -I. -I../../../../../third_party/libprocess/third_party/glog-0.3.1 -I./src -I../../../../../third_party/libprocess/third_party/glog-0.3.1/src -Wall -Wwrite-strings -Woverloaded-virtual -Wno-sign-compare -DNO_FRAME_POINTER -DNDEBUG -g -O2 -MT libglog_la-signalhandler.lo -MD -MP -MF .deps/libglog_la-signalhandler.Tpo -c ../../../../../third_party/libprocess/third_party/glog-0.3.1/src/signalhandler.cc  -fPIC -DPIC -o libglog_la-signalhandler.o
../../../../../third_party/libprocess/third_party/glog-0.3.1/src/signalhandler.cc: In function 'void google::<unnamed>::WriteToStderr(const char*, int)':
../../../../../third_party/libprocess/third_party/glog-0.3.1/src/signalhandler.cc:145: warning: ignoring return value of 'ssize_t write(int, const void*, size_t)', declared with attribute warn_unused_result
mv -f .deps/libglog_la-signalhandler.Tpo .deps/libglog_la-signalhandler.Plo
/bin/bash ./libtool --tag=CXX   --mode=link g++   -Wall -Wwrite-strings -Woverloaded-virtual -Wno-sign-compare  -DNO_FRAME_POINTER -DNDEBUG -g -O2    -o libglog.la -rpath /usr/local/lib  libglog_la-logging.lo libglog_la-raw_logging.lo libglog_la-vlog_is_on.lo libglog_la-utilities.lo libglog_la-demangle.lo libglog_la-symbolize.lo libglog_la-signalhandler.lo     -lpthread 
mkdir .libs
ar cru .libs/libglog.a  libglog_la-logging.o libglog_la-raw_logging.o libglog_la-vlog_is_on.o libglog_la-utilities.o libglog_la-demangle.o libglog_la-symbolize.o libglog_la-signalhandler.o
ranlib .libs/libglog.a
creating libglog.la
(cd .libs && rm -f libglog.la && ln -s ../libglog.la libglog.la)
g++ -DHAVE_CONFIG_H -I. -I../../../../../third_party/libprocess/third_party/glog-0.3.1 -I./src  -I../../../../../third_party/libprocess/third_party/glog-0.3.1/src  -pthread    -Wall -Wwrite-strings -Woverloaded-virtual -Wno-sign-compare  -DNO_FRAME_POINTER -g -O2 -MT logging_unittest-logging_unittest.o -MD -MP -MF .deps/logging_unittest-logging_unittest.Tpo -c -o logging_unittest-logging_unittest.o `test -f 'src/logging_unittest.cc' || echo '../../../../../third_party/libprocess/third_party/glog-0.3.1/'`src/logging_unittest.cc
mv -f .deps/logging_unittest-logging_unittest.Tpo .deps/logging_unittest-logging_unittest.Po
/bin/bash ./libtool --tag=CXX   --mode=link g++ -pthread    -Wall -Wwrite-strings -Woverloaded-virtual -Wno-sign-compare  -DNO_FRAME_POINTER -g -O2 -pthread  -o logging_unittest  logging_unittest-logging_unittest.o  libglog.la       -lpthread 
g++ -pthread -Wall -Wwrite-strings -Woverloaded-virtual -Wno-sign-compare -DNO_FRAME_POINTER -g -O2 -pthread -o logging_unittest logging_unittest-logging_unittest.o  ./.libs/libglog.a -lpthread  
g++ -DHAVE_CONFIG_H -I. -I../../../../../third_party/libprocess/third_party/glog-0.3.1 -I./src  -I../../../../../third_party/libprocess/third_party/glog-0.3.1/src  -pthread    -Wall -Wwrite-strings -Woverloaded-virtual -Wno-sign-compare  -DNO_FRAME_POINTER -g -O2 -MT demangle_unittest-demangle_unittest.o -MD -MP -MF .deps/demangle_unittest-demangle_unittest.Tpo -c -o demangle_unittest-demangle_unittest.o `test -f 'src/demangle_unittest.cc' || echo '../../../../../third_party/libprocess/third_party/glog-0.3.1/'`src/demangle_unittest.cc
mv -f .deps/demangle_unittest-demangle_unittest.Tpo .deps/demangle_unittest-demangle_unittest.Po
/bin/bash ./libtool --tag=CXX   --mode=link g++ -pthread    -Wall -Wwrite-strings -Woverloaded-virtual -Wno-sign-compare  -DNO_FRAME_POINTER -g -O2 -pthread  -o demangle_unittest  demangle_unittest-demangle_unittest.o  libglog.la       -lpthread 
g++ -pthread -Wall -Wwrite-strings -Woverloaded-virtual -Wno-sign-compare -DNO_FRAME_POINTER -g -O2 -pthread -o demangle_unittest demangle_unittest-demangle_unittest.o  ./.libs/libglog.a -lpthread  
g++ -DHAVE_CONFIG_H -I. -I../../../../../third_party/libprocess/third_party/glog-0.3.1 -I./src  -I../../../../../third_party/libprocess/third_party/glog-0.3.1/src  -pthread    -Wall -Wwrite-strings -Woverloaded-virtual -Wno-sign-compare  -DNO_FRAME_POINTER -g -O2 -MT stacktrace_unittest-stacktrace_unittest.o -MD -MP -MF .deps/stacktrace_unittest-stacktrace_unittest.Tpo -c -o stacktrace_unittest-stacktrace_unittest.o `test -f 'src/stacktrace_unittest.cc' || echo '../../../../../third_party/libprocess/third_party/glog-0.3.1/'`src/stacktrace_unittest.cc
mv -f .deps/stacktrace_unittest-stacktrace_unittest.Tpo .deps/stacktrace_unittest-stacktrace_unittest.Po
/bin/bash ./libtool --tag=CXX   --mode=link g++ -pthread    -Wall -Wwrite-strings -Woverloaded-virtual -Wno-sign-compare  -DNO_FRAME_POINTER -g -O2 -pthread  -o stacktrace_unittest  stacktrace_unittest-stacktrace_unittest.o  libglog.la    -lpthread 
g++ -pthread -Wall -Wwrite-strings -Woverloaded-virtual -Wno-sign-compare -DNO_FRAME_POINTER -g -O2 -pthread -o stacktrace_unittest stacktrace_unittest-stacktrace_unittest.o  ./.libs/libglog.a -lpthread  
g++ -DHAVE_CONFIG_H -I. -I../../../../../third_party/libprocess/third_party/glog-0.3.1 -I./src  -I../../../../../third_party/libprocess/third_party/glog-0.3.1/src  -pthread    -Wall -Wwrite-strings -Woverloaded-virtual -Wno-sign-compare  -DNO_FRAME_POINTER -g -O2 -MT symbolize_unittest-symbolize_unittest.o -MD -MP -MF .deps/symbolize_unittest-symbolize_unittest.Tpo -c -o symbolize_unittest-symbolize_unittest.o `test -f 'src/symbolize_unittest.cc' || echo '../../../../../third_party/libprocess/third_party/glog-0.3.1/'`src/symbolize_unittest.cc
mv -f .deps/symbolize_unittest-symbolize_unittest.Tpo .deps/symbolize_unittest-symbolize_unittest.Po
/bin/bash ./libtool --tag=CXX   --mode=link g++ -pthread    -Wall -Wwrite-strings -Woverloaded-virtual -Wno-sign-compare  -DNO_FRAME_POINTER -g -O2 -pthread  -o symbolize_unittest  symbolize_unittest-symbolize_unittest.o  libglog.la       -lpthread 
g++ -pthread -Wall -Wwrite-strings -Woverloaded-virtual -Wno-sign-compare -DNO_FRAME_POINTER -g -O2 -pthread -o symbolize_unittest symbolize_unittest-symbolize_unittest.o  ./.libs/libglog.a -lpthread  
g++ -DHAVE_CONFIG_H -I. -I../../../../../third_party/libprocess/third_party/glog-0.3.1 -I./src  -I../../../../../third_party/libprocess/third_party/glog-0.3.1/src  -pthread    -Wall -Wwrite-strings -Woverloaded-virtual -Wno-sign-compare  -DNO_FRAME_POINTER -g -O2 -MT stl_logging_unittest-stl_logging_unittest.o -MD -MP -MF .deps/stl_logging_unittest-stl_logging_unittest.Tpo -c -o stl_logging_unittest-stl_logging_unittest.o `test -f 'src/stl_logging_unittest.cc' || echo '../../../../../third_party/libprocess/third_party/glog-0.3.1/'`src/stl_logging_unittest.cc
mv -f .deps/stl_logging_unittest-stl_logging_unittest.Tpo .deps/stl_logging_unittest-stl_logging_unittest.Po
/bin/bash ./libtool --tag=CXX   --mode=link g++ -pthread    -Wall -Wwrite-strings -Woverloaded-virtual -Wno-sign-compare  -DNO_FRAME_POINTER -g -O2 -pthread  -o stl_logging_unittest  stl_logging_unittest-stl_logging_unittest.o  libglog.la       -lpthread 
g++ -pthread -Wall -Wwrite-strings -Woverloaded-virtual -Wno-sign-compare -DNO_FRAME_POINTER -g -O2 -pthread -o stl_logging_unittest stl_logging_unittest-stl_logging_unittest.o  ./.libs/libglog.a -lpthread  
g++ -DHAVE_CONFIG_H -I. -I../../../../../third_party/libprocess/third_party/glog-0.3.1 -I./src  -I../../../../../third_party/libprocess/third_party/glog-0.3.1/src  -pthread    -Wall -Wwrite-strings -Woverloaded-virtual -Wno-sign-compare  -DNO_FRAME_POINTER -g -O2 -MT utilities_unittest-utilities_unittest.o -MD -MP -MF .deps/utilities_unittest-utilities_unittest.Tpo -c -o utilities_unittest-utilities_unittest.o `test -f 'src/utilities_unittest.cc' || echo '../../../../../third_party/libprocess/third_party/glog-0.3.1/'`src/utilities_unittest.cc
mv -f .deps/utilities_unittest-utilities_unittest.Tpo .deps/utilities_unittest-utilities_unittest.Po
/bin/bash ./libtool --tag=CXX   --mode=link g++ -pthread    -Wall -Wwrite-strings -Woverloaded-virtual -Wno-sign-compare  -DNO_FRAME_POINTER -g -O2 -pthread  -o utilities_unittest  utilities_unittest-utilities_unittest.o  libglog.la       -lpthread 
g++ -pthread -Wall -Wwrite-strings -Woverloaded-virtual -Wno-sign-compare -DNO_FRAME_POINTER -g -O2 -pthread -o utilities_unittest utilities_unittest-utilities_unittest.o  ./.libs/libglog.a -lpthread  
g++ -DHAVE_CONFIG_H -I. -I../../../../../third_party/libprocess/third_party/glog-0.3.1 -I./src  -I../../../../../third_party/libprocess/third_party/glog-0.3.1/src  -pthread    -Wall -Wwrite-strings -Woverloaded-virtual -Wno-sign-compare  -DNO_FRAME_POINTER -g -O2 -MT logging_striptest0-logging_striptest_main.o -MD -MP -MF .deps/logging_striptest0-logging_striptest_main.Tpo -c -o logging_striptest0-logging_striptest_main.o `test -f 'src/logging_striptest_main.cc' || echo '../../../../../third_party/libprocess/third_party/glog-0.3.1/'`src/logging_striptest_main.cc
mv -f .deps/logging_striptest0-logging_striptest_main.Tpo .deps/logging_striptest0-logging_striptest_main.Po
/bin/bash ./libtool --tag=CXX   --mode=link g++ -pthread    -Wall -Wwrite-strings -Woverloaded-virtual -Wno-sign-compare  -DNO_FRAME_POINTER -g -O2 -pthread  -o logging_striptest0  logging_striptest0-logging_striptest_main.o  libglog.la    -lpthread 
g++ -pthread -Wall -Wwrite-strings -Woverloaded-virtual -Wno-sign-compare -DNO_FRAME_POINTER -g -O2 -pthread -o logging_striptest0 logging_striptest0-logging_striptest_main.o  ./.libs/libglog.a -lpthread  
g++ -DHAVE_CONFIG_H -I. -I../../../../../third_party/libprocess/third_party/glog-0.3.1 -I./src  -I../../../../../third_party/libprocess/third_party/glog-0.3.1/src  -pthread    -Wall -Wwrite-strings -Woverloaded-virtual -Wno-sign-compare  -DNO_FRAME_POINTER -g -O2 -MT logging_striptest2-logging_striptest2.o -MD -MP -MF .deps/logging_striptest2-logging_striptest2.Tpo -c -o logging_striptest2-logging_striptest2.o `test -f 'src/logging_striptest2.cc' || echo '../../../../../third_party/libprocess/third_party/glog-0.3.1/'`src/logging_striptest2.cc
mv -f .deps/logging_striptest2-logging_striptest2.Tpo .deps/logging_striptest2-logging_striptest2.Po
/bin/bash ./libtool --tag=CXX   --mode=link g++ -pthread    -Wall -Wwrite-strings -Woverloaded-virtual -Wno-sign-compare  -DNO_FRAME_POINTER -g -O2 -pthread  -o logging_striptest2  logging_striptest2-logging_striptest2.o  libglog.la    -lpthread 
g++ -pthread -Wall -Wwrite-strings -Woverloaded-virtual -Wno-sign-compare -DNO_FRAME_POINTER -g -O2 -pthread -o logging_striptest2 logging_striptest2-logging_striptest2.o  ./.libs/libglog.a -lpthread  
g++ -DHAVE_CONFIG_H -I. -I../../../../../third_party/libprocess/third_party/glog-0.3.1 -I./src  -I../../../../../third_party/libprocess/third_party/glog-0.3.1/src  -pthread    -Wall -Wwrite-strings -Woverloaded-virtual -Wno-sign-compare  -DNO_FRAME_POINTER -g -O2 -MT logging_striptest10-logging_striptest10.o -MD -MP -MF .deps/logging_striptest10-logging_striptest10.Tpo -c -o logging_striptest10-logging_striptest10.o `test -f 'src/logging_striptest10.cc' || echo '../../../../../third_party/libprocess/third_party/glog-0.3.1/'`src/logging_striptest10.cc
mv -f .deps/logging_striptest10-logging_striptest10.Tpo .deps/logging_striptest10-logging_striptest10.Po
/bin/bash ./libtool --tag=CXX   --mode=link g++ -pthread    -Wall -Wwrite-strings -Woverloaded-virtual -Wno-sign-compare  -DNO_FRAME_POINTER -g -O2 -pthread  -o logging_striptest10  logging_striptest10-logging_striptest10.o  libglog.la    -lpthread 
g++ -pthread -Wall -Wwrite-strings -Woverloaded-virtual -Wno-sign-compare -DNO_FRAME_POINTER -g -O2 -pthread -o logging_striptest10 logging_striptest10-logging_striptest10.o  ./.libs/libglog.a -lpthread  
g++ -DHAVE_CONFIG_H -I. -I../../../../../third_party/libprocess/third_party/glog-0.3.1 -I./src  -I../../../../../third_party/libprocess/third_party/glog-0.3.1/src  -pthread    -Wall -Wwrite-strings -Woverloaded-virtual -Wno-sign-compare  -DNO_FRAME_POINTER -g -O2 -MT signalhandler_unittest-signalhandler_unittest.o -MD -MP -MF .deps/signalhandler_unittest-signalhandler_unittest.Tpo -c -o signalhandler_unittest-signalhandler_unittest.o `test -f 'src/signalhandler_unittest.cc' || echo '../../../../../third_party/libprocess/third_party/glog-0.3.1/'`src/signalhandler_unittest.cc
../../../../../third_party/libprocess/third_party/glog-0.3.1/src/signalhandler_unittest.cc: In function 'void WriteToStdout(const char*, int)':
../../../../../third_party/libprocess/third_party/glog-0.3.1/src/signalhandler_unittest.cc:61: warning: ignoring return value of 'ssize_t write(int, const void*, size_t)', declared with attribute warn_unused_result
mv -f .deps/signalhandler_unittest-signalhandler_unittest.Tpo .deps/signalhandler_unittest-signalhandler_unittest.Po
/bin/bash ./libtool --tag=CXX   --mode=link g++ -pthread    -Wall -Wwrite-strings -Woverloaded-virtual -Wno-sign-compare  -DNO_FRAME_POINTER -g -O2 -pthread  -o signalhandler_unittest  signalhandler_unittest-signalhandler_unittest.o  libglog.la       -lpthread 
g++ -pthread -Wall -Wwrite-strings -Woverloaded-virtual -Wno-sign-compare -DNO_FRAME_POINTER -g -O2 -pthread -o signalhandler_unittest signalhandler_unittest-signalhandler_unittest.o  ./.libs/libglog.a -lpthread  
make[3]: Leaving directory `/x1/jenkins/jenkins-slave/workspace/Mesos-Trunk-Ubuntu-Build-Out-Of-Src-Disable-Java-Disable-Python-Disable-Webui/build/third_party/libprocess/third_party/glog-0.3.1'
make -C third_party/libev-3.8
make[3]: Entering directory `/x1/jenkins/jenkins-slave/workspace/Mesos-Trunk-Ubuntu-Build-Out-Of-Src-Disable-Java-Disable-Python-Disable-Webui/build/third_party/libprocess/third_party/libev-3.8'
make  all-am
make[4]: Entering directory `/x1/jenkins/jenkins-slave/workspace/Mesos-Trunk-Ubuntu-Build-Out-Of-Src-Disable-Java-Disable-Python-Disable-Webui/build/third_party/libprocess/third_party/libev-3.8'
/bin/bash ./libtool --tag=CC   --mode=compile gcc -DHAVE_CONFIG_H -I. -I../../../../../third_party/libprocess/third_party/libev-3.8     -g -O2 -O3 -c -o ev.lo ../../../../../third_party/libprocess/third_party/libev-3.8/ev.c
 gcc -DHAVE_CONFIG_H -I. -I../../../../../third_party/libprocess/third_party/libev-3.8 -g -O2 -O3 -c ../../../../../third_party/libprocess/third_party/libev-3.8/ev.c  -fPIC -DPIC -o ev.o
../../../../../third_party/libprocess/third_party/libev-3.8/ev.c: In function 'evpipe_write':
../../../../../third_party/libprocess/third_party/libev-3.8/ev.c:1205: warning: ignoring return value of 'write', declared with attribute warn_unused_result
../../../../../third_party/libprocess/third_party/libev-3.8/ev.c:1209: warning: ignoring return value of 'write', declared with attribute warn_unused_result
../../../../../third_party/libprocess/third_party/libev-3.8/ev.c: In function 'pipecb':
../../../../../third_party/libprocess/third_party/libev-3.8/ev.c:1226: warning: ignoring return value of 'read', declared with attribute warn_unused_result
../../../../../third_party/libprocess/third_party/libev-3.8/ev.c:1232: warning: ignoring return value of 'read', declared with attribute warn_unused_result
/bin/bash ./libtool --tag=CC   --mode=compile gcc -DHAVE_CONFIG_H -I. -I../../../../../third_party/libprocess/third_party/libev-3.8     -g -O2 -O3 -c -o event.lo ../../../../../third_party/libprocess/third_party/libev-3.8/event.c
 gcc -DHAVE_CONFIG_H -I. -I../../../../../third_party/libprocess/third_party/libev-3.8 -g -O2 -O3 -c ../../../../../third_party/libprocess/third_party/libev-3.8/event.c  -fPIC -DPIC -o event.o
/bin/bash ./libtool --tag=CC   --mode=link gcc  -g -O2 -O3 -version-info 3:0  -o libev.la -rpath /usr/local/lib ev.lo event.lo  -lm 
mkdir .libs
ar cru .libs/libev.a  ev.o event.o
ranlib .libs/libev.a
creating libev.la
(cd .libs && rm -f libev.la && ln -s ../libev.la libev.la)
make[4]: Leaving directory `/x1/jenkins/jenkins-slave/workspace/Mesos-Trunk-Ubuntu-Build-Out-Of-Src-Disable-Java-Disable-Python-Disable-Webui/build/third_party/libprocess/third_party/libev-3.8'
make[3]: Leaving directory `/x1/jenkins/jenkins-slave/workspace/Mesos-Trunk-Ubuntu-Build-Out-Of-Src-Disable-Java-Disable-Python-Disable-Webui/build/third_party/libprocess/third_party/libev-3.8'
cc -c -fPIC -O3 -g -Wall -Wextra -Werror -I../../../third_party/libprocess/third_party/ry-http-parser-1c3624a -o http_parser.o ../../../third_party/libprocess/third_party/ry-http-parser-1c3624a/http_parser.c
mkdir -p src
g++ -c -g -O2 -g -I../../../third_party/libprocess/include -I../../../third_party/libprocess -I../../../third_party/libprocess/third_party/libev-3.8 -I../../../third_party/libprocess/third_party/boost-1.37.0 -I../../../third_party/libprocess/third_party/glog-0.3.1/src -Ithird_party/glog-0.3.1/src -I../../../third_party/libprocess/third_party/ry-http-parser-1c3624a -I../../../third_party/libprocess/third_party/gmock-1.6.0/include -I../../../third_party/libprocess/third_party/gmock-1.6.0/gtest/include -fPIC -D_XOPEN_SOURCE -MMD -MP -o src/process.o ../../../third_party/libprocess/src/process.cpp
g++ -c -g -O2 -g -I../../../third_party/libprocess/include -I../../../third_party/libprocess -I../../../third_party/libprocess/third_party/libev-3.8 -I../../../third_party/libprocess/third_party/boost-1.37.0 -I../../../third_party/libprocess/third_party/glog-0.3.1/src -Ithird_party/glog-0.3.1/src -I../../../third_party/libprocess/third_party/ry-http-parser-1c3624a -I../../../third_party/libprocess/third_party/gmock-1.6.0/include -I../../../third_party/libprocess/third_party/gmock-1.6.0/gtest/include -fPIC -D_XOPEN_SOURCE -MMD -MP -o src/pid.o ../../../third_party/libprocess/src/pid.cpp
g++ -c -g -O2 -g -I../../../third_party/libprocess/include -I../../../third_party/libprocess -I../../../third_party/libprocess/third_party/libev-3.8 -I../../../third_party/libprocess/third_party/boost-1.37.0 -I../../../third_party/libprocess/third_party/glog-0.3.1/src -Ithird_party/glog-0.3.1/src -I../../../third_party/libprocess/third_party/ry-http-parser-1c3624a -I../../../third_party/libprocess/third_party/gmock-1.6.0/include -I../../../third_party/libprocess/third_party/gmock-1.6.0/gtest/include -fPIC -D_XOPEN_SOURCE -MMD -MP -o src/latch.o ../../../third_party/libprocess/src/latch.cpp
ar rcs libprocess.a http_parser.o src/process.o src/pid.o src/latch.o
make[2]: Leaving directory `/x1/jenkins/jenkins-slave/workspace/Mesos-Trunk-Ubuntu-Build-Out-Of-Src-Disable-Java-Disable-Python-Disable-Webui/build/third_party/libprocess'
make[2]: Entering directory `/x1/jenkins/jenkins-slave/workspace/Mesos-Trunk-Ubuntu-Build-Out-Of-Src-Disable-Java-Disable-Python-Disable-Webui/build/third_party/leveldb'
g++ -c -I. -I./include -fno-builtin-memcmp -DLEVELDB_PLATFORM_POSIX -DLEVELDB_CSTDATOMIC_PRESENT -std=c++0x -pthread -DOS_LINUX -fPIC -O2 -DNDEBUG         db/builder.cc -o db/builder.o
g++ -c -I. -I./include -fno-builtin-memcmp -DLEVELDB_PLATFORM_POSIX -DLEVELDB_CSTDATOMIC_PRESENT -std=c++0x -pthread -DOS_LINUX -fPIC -O2 -DNDEBUG         db/c.cc -o db/c.o
g++ -c -I. -I./include -fno-builtin-memcmp -DLEVELDB_PLATFORM_POSIX -DLEVELDB_CSTDATOMIC_PRESENT -std=c++0x -pthread -DOS_LINUX -fPIC -O2 -DNDEBUG         db/db_impl.cc -o db/db_impl.o
g++ -c -I. -I./include -fno-builtin-memcmp -DLEVELDB_PLATFORM_POSIX -DLEVELDB_CSTDATOMIC_PRESENT -std=c++0x -pthread -DOS_LINUX -fPIC -O2 -DNDEBUG         db/db_iter.cc -o db/db_iter.o
g++ -c -I. -I./include -fno-builtin-memcmp -DLEVELDB_PLATFORM_POSIX -DLEVELDB_CSTDATOMIC_PRESENT -std=c++0x -pthread -DOS_LINUX -fPIC -O2 -DNDEBUG         db/filename.cc -o db/filename.o
g++ -c -I. -I./include -fno-builtin-memcmp -DLEVELDB_PLATFORM_POSIX -DLEVELDB_CSTDATOMIC_PRESENT -std=c++0x -pthread -DOS_LINUX -fPIC -O2 -DNDEBUG         db/dbformat.cc -o db/dbformat.o
g++ -c -I. -I./include -fno-builtin-memcmp -DLEVELDB_PLATFORM_POSIX -DLEVELDB_CSTDATOMIC_PRESENT -std=c++0x -pthread -DOS_LINUX -fPIC -O2 -DNDEBUG         db/log_reader.cc -o db/log_reader.o
g++ -c -I. -I./include -fno-builtin-memcmp -DLEVELDB_PLATFORM_POSIX -DLEVELDB_CSTDATOMIC_PRESENT -std=c++0x -pthread -DOS_LINUX -fPIC -O2 -DNDEBUG         db/log_writer.cc -o db/log_writer.o
g++ -c -I. -I./include -fno-builtin-memcmp -DLEVELDB_PLATFORM_POSIX -DLEVELDB_CSTDATOMIC_PRESENT -std=c++0x -pthread -DOS_LINUX -fPIC -O2 -DNDEBUG         db/memtable.cc -o db/memtable.o
g++ -c -I. -I./include -fno-builtin-memcmp -DLEVELDB_PLATFORM_POSIX -DLEVELDB_CSTDATOMIC_PRESENT -std=c++0x -pthread -DOS_LINUX -fPIC -O2 -DNDEBUG         db/repair.cc -o db/repair.o
g++ -c -I. -I./include -fno-builtin-memcmp -DLEVELDB_PLATFORM_POSIX -DLEVELDB_CSTDATOMIC_PRESENT -std=c++0x -pthread -DOS_LINUX -fPIC -O2 -DNDEBUG         db/table_cache.cc -o db/table_cache.o
g++ -c -I. -I./include -fno-builtin-memcmp -DLEVELDB_PLATFORM_POSIX -DLEVELDB_CSTDATOMIC_PRESENT -std=c++0x -pthread -DOS_LINUX -fPIC -O2 -DNDEBUG         db/version_edit.cc -o db/version_edit.o
g++ -c -I. -I./include -fno-builtin-memcmp -DLEVELDB_PLATFORM_POSIX -DLEVELDB_CSTDATOMIC_PRESENT -std=c++0x -pthread -DOS_LINUX -fPIC -O2 -DNDEBUG         db/version_set.cc -o db/version_set.o
g++ -c -I. -I./include -fno-builtin-memcmp -DLEVELDB_PLATFORM_POSIX -DLEVELDB_CSTDATOMIC_PRESENT -std=c++0x -pthread -DOS_LINUX -fPIC -O2 -DNDEBUG         db/write_batch.cc -o db/write_batch.o
g++ -c -I. -I./include -fno-builtin-memcmp -DLEVELDB_PLATFORM_POSIX -DLEVELDB_CSTDATOMIC_PRESENT -std=c++0x -pthread -DOS_LINUX -fPIC -O2 -DNDEBUG         port/port_posix.cc -o port/port_posix.o
g++ -c -I. -I./include -fno-builtin-memcmp -DLEVELDB_PLATFORM_POSIX -DLEVELDB_CSTDATOMIC_PRESENT -std=c++0x -pthread -DOS_LINUX -fPIC -O2 -DNDEBUG         table/block.cc -o table/block.o
g++ -c -I. -I./include -fno-builtin-memcmp -DLEVELDB_PLATFORM_POSIX -DLEVELDB_CSTDATOMIC_PRESENT -std=c++0x -pthread -DOS_LINUX -fPIC -O2 -DNDEBUG         table/block_builder.cc -o table/block_builder.o
g++ -c -I. -I./include -fno-builtin-memcmp -DLEVELDB_PLATFORM_POSIX -DLEVELDB_CSTDATOMIC_PRESENT -std=c++0x -pthread -DOS_LINUX -fPIC -O2 -DNDEBUG         table/format.cc -o table/format.o
g++ -c -I. -I./include -fno-builtin-memcmp -DLEVELDB_PLATFORM_POSIX -DLEVELDB_CSTDATOMIC_PRESENT -std=c++0x -pthread -DOS_LINUX -fPIC -O2 -DNDEBUG         table/iterator.cc -o table/iterator.o
g++ -c -I. -I./include -fno-builtin-memcmp -DLEVELDB_PLATFORM_POSIX -DLEVELDB_CSTDATOMIC_PRESENT -std=c++0x -pthread -DOS_LINUX -fPIC -O2 -DNDEBUG         table/merger.cc -o table/merger.o
g++ -c -I. -I./include -fno-builtin-memcmp -DLEVELDB_PLATFORM_POSIX -DLEVELDB_CSTDATOMIC_PRESENT -std=c++0x -pthread -DOS_LINUX -fPIC -O2 -DNDEBUG         table/table.cc -o table/table.o
g++ -c -I. -I./include -fno-builtin-memcmp -DLEVELDB_PLATFORM_POSIX -DLEVELDB_CSTDATOMIC_PRESENT -std=c++0x -pthread -DOS_LINUX -fPIC -O2 -DNDEBUG         table/table_builder.cc -o table/table_builder.o
g++ -c -I. -I./include -fno-builtin-memcmp -DLEVELDB_PLATFORM_POSIX -DLEVELDB_CSTDATOMIC_PRESENT -std=c++0x -pthread -DOS_LINUX -fPIC -O2 -DNDEBUG         table/two_level_iterator.cc -o table/two_level_iterator.o
g++ -c -I. -I./include -fno-builtin-memcmp -DLEVELDB_PLATFORM_POSIX -DLEVELDB_CSTDATOMIC_PRESENT -std=c++0x -pthread -DOS_LINUX -fPIC -O2 -DNDEBUG         util/arena.cc -o util/arena.o
g++ -c -I. -I./include -fno-builtin-memcmp -DLEVELDB_PLATFORM_POSIX -DLEVELDB_CSTDATOMIC_PRESENT -std=c++0x -pthread -DOS_LINUX -fPIC -O2 -DNDEBUG         util/cache.cc -o util/cache.o
g++ -c -I. -I./include -fno-builtin-memcmp -DLEVELDB_PLATFORM_POSIX -DLEVELDB_CSTDATOMIC_PRESENT -std=c++0x -pthread -DOS_LINUX -fPIC -O2 -DNDEBUG         util/coding.cc -o util/coding.o
g++ -c -I. -I./include -fno-builtin-memcmp -DLEVELDB_PLATFORM_POSIX -DLEVELDB_CSTDATOMIC_PRESENT -std=c++0x -pthread -DOS_LINUX -fPIC -O2 -DNDEBUG         util/comparator.cc -o util/comparator.o
g++ -c -I. -I./include -fno-builtin-memcmp -DLEVELDB_PLATFORM_POSIX -DLEVELDB_CSTDATOMIC_PRESENT -std=c++0x -pthread -DOS_LINUX -fPIC -O2 -DNDEBUG         util/crc32c.cc -o util/crc32c.o
g++ -c -I. -I./include -fno-builtin-memcmp -DLEVELDB_PLATFORM_POSIX -DLEVELDB_CSTDATOMIC_PRESENT -std=c++0x -pthread -DOS_LINUX -fPIC -O2 -DNDEBUG         util/env.cc -o util/env.o
g++ -c -I. -I./include -fno-builtin-memcmp -DLEVELDB_PLATFORM_POSIX -DLEVELDB_CSTDATOMIC_PRESENT -std=c++0x -pthread -DOS_LINUX -fPIC -O2 -DNDEBUG         util/env_posix.cc -o util/env_posix.o
g++ -c -I. -I./include -fno-builtin-memcmp -DLEVELDB_PLATFORM_POSIX -DLEVELDB_CSTDATOMIC_PRESENT -std=c++0x -pthread -DOS_LINUX -fPIC -O2 -DNDEBUG         util/hash.cc -o util/hash.o
g++ -c -I. -I./include -fno-builtin-memcmp -DLEVELDB_PLATFORM_POSIX -DLEVELDB_CSTDATOMIC_PRESENT -std=c++0x -pthread -DOS_LINUX -fPIC -O2 -DNDEBUG         util/histogram.cc -o util/histogram.o
g++ -c -I. -I./include -fno-builtin-memcmp -DLEVELDB_PLATFORM_POSIX -DLEVELDB_CSTDATOMIC_PRESENT -std=c++0x -pthread -DOS_LINUX -fPIC -O2 -DNDEBUG         util/logging.cc -o util/logging.o
g++ -c -I. -I./include -fno-builtin-memcmp -DLEVELDB_PLATFORM_POSIX -DLEVELDB_CSTDATOMIC_PRESENT -std=c++0x -pthread -DOS_LINUX -fPIC -O2 -DNDEBUG         util/options.cc -o util/options.o
g++ -c -I. -I./include -fno-builtin-memcmp -DLEVELDB_PLATFORM_POSIX -DLEVELDB_CSTDATOMIC_PRESENT -std=c++0x -pthread -DOS_LINUX -fPIC -O2 -DNDEBUG         util/status.cc -o util/status.o
rm -f libleveldb.a
ar -rs libleveldb.a ./db/builder.o ./db/c.o ./db/db_impl.o ./db/db_iter.o ./db/filename.o ./db/dbformat.o ./db/log_reader.o ./db/log_writer.o ./db/memtable.o ./db/repair.o ./db/table_cache.o ./db/version_edit.o ./db/version_set.o ./db/write_batch.o ./port/port_posix.o ./table/block.o ./table/block_builder.o ./table/format.o ./table/iterator.o ./table/merger.o ./table/table.o ./table/table_builder.o ./table/two_level_iterator.o ./util/arena.o ./util/cache.o ./util/coding.o ./util/comparator.o ./util/crc32c.o ./util/env.o ./util/env_posix.o ./util/hash.o ./util/histogram.o ./util/logging.o ./util/options.o ./util/status.o
ar: creating libleveldb.a
make[2]: Leaving directory `/x1/jenkins/jenkins-slave/workspace/Mesos-Trunk-Ubuntu-Build-Out-Of-Src-Disable-Java-Disable-Python-Disable-Webui/build/third_party/leveldb'
make[1]: Leaving directory `/x1/jenkins/jenkins-slave/workspace/Mesos-Trunk-Ubuntu-Build-Out-Of-Src-Disable-Java-Disable-Python-Disable-Webui/build'
Making all in src
make[1]: Entering directory `/x1/jenkins/jenkins-slave/workspace/Mesos-Trunk-Ubuntu-Build-Out-Of-Src-Disable-Java-Disable-Python-Disable-Webui/build/src'
make  all-am
make[2]: Entering directory `/x1/jenkins/jenkins-slave/workspace/Mesos-Trunk-Ubuntu-Build-Out-Of-Src-Disable-Java-Disable-Python-Disable-Webui/build/src'
/bin/bash ../libtool  --tag=CXX   --mode=compile g++ -DPACKAGE_NAME=\"mesos\" -DPACKAGE_TARNAME=\"mesos\" -DPACKAGE_VERSION=\"0.0.1\" -DPACKAGE_STRING=\"mesos\ 0.0.1\" -DPACKAGE_BUGREPORT=\"\" -DPACKAGE_URL=\"\" -DPACKAGE=\"mesos\" -DVERSION=\"0.0.1\" -DSTDC_HEADERS=1 -DHAVE_SYS_TYPES_H=1 -DHAVE_SYS_STAT_H=1 -DHAVE_STDLIB_H=1 -DHAVE_STRING_H=1 -DHAVE_MEMORY_H=1 -DHAVE_STRINGS_H=1 -DHAVE_INTTYPES_H=1 -DHAVE_STDINT_H=1 -DHAVE_UNISTD_H=1 -DHAVE_DLFCN_H=1 -DLT_OBJDIR=\".libs/\" -DHAVE_PTHREAD=1 -I. -I../../src   -DMESOS_WEBUI_DIR=\"/usr/local/share/mesos/webui\" -DMESOS_LIBEXECDIR=\"/usr/local/libexec/mesos\" -I../../include -I../../third_party/boost-1.37.0 -I../../third_party/protobuf-2.3.0/src -I../../third_party/glog-0.3.1/src -I../third_party/glog-0.3.1/src -I../../third_party/libprocess/include -I../../third_party/zookeeper-3.3.1/src/c/include -I../../third_party/zookeeper-3.3.1/src/c/generated   -g2 -O2 -MT sched/libmesos_no_third_party_la-sched.lo -MD -MP -MF sched/.deps/libmesos_no_third_party_la-sched.Tpo -c -o sched/libmesos_no_third_party_la-sched.lo `test -f 'sched/sched.cpp' || echo '../../src/'`sched/sched.cpp
libtool: compile:  g++ -DPACKAGE_NAME=\"mesos\" -DPACKAGE_TARNAME=\"mesos\" -DPACKAGE_VERSION=\"0.0.1\" "-DPACKAGE_STRING=\"mesos 0.0.1\"" -DPACKAGE_BUGREPORT=\"\" -DPACKAGE_URL=\"\" -DPACKAGE=\"mesos\" -DVERSION=\"0.0.1\" -DSTDC_HEADERS=1 -DHAVE_SYS_TYPES_H=1 -DHAVE_SYS_STAT_H=1 -DHAVE_STDLIB_H=1 -DHAVE_STRING_H=1 -DHAVE_MEMORY_H=1 -DHAVE_STRINGS_H=1 -DHAVE_INTTYPES_H=1 -DHAVE_STDINT_H=1 -DHAVE_UNISTD_H=1 -DHAVE_DLFCN_H=1 -DLT_OBJDIR=\".libs/\" -DHAVE_PTHREAD=1 -I. -I../../src -DMESOS_WEBUI_DIR=\"/usr/local/share/mesos/webui\" -DMESOS_LIBEXECDIR=\"/usr/local/libexec/mesos\" -I../../include -I../../third_party/boost-1.37.0 -I../../third_party/protobuf-2.3.0/src -I../../third_party/glog-0.3.1/src -I../third_party/glog-0.3.1/src -I../../third_party/libprocess/include -I../../third_party/zookeeper-3.3.1/src/c/include -I../../third_party/zookeeper-3.3.1/src/c/generated -g2 -O2 -MT sched/libmesos_no_third_party_la-sched.lo -MD -MP -MF sched/.deps/libmesos_no_third_party_la-sched.Tpo -c ../../src/sched/sched.cpp  -fPIC -DPIC -o sched/.libs/libmesos_no_third_party_la-sched.o
In file included from ../../third_party/boost-1.37.0/boost/uuid/random_generator.hpp:12,
                 from ../../third_party/boost-1.37.0/boost/uuid/uuid_generators.hpp:17,
                 from ../../src/common/uuid.hpp:29,
                 from ../../src/sched/sched.cpp:47:
../../third_party/boost-1.37.0/boost/uuid/seed_rng.hpp: In member function 'void boost::uuids::detail::seed_rng::sha1_random_digest_()':
../../third_party/boost-1.37.0/boost/uuid/seed_rng.hpp:153: warning: ignoring return value of 'size_t fread(void*, size_t, size_t, FILE*)', declared with attribute warn_unused_result
libtool: compile:  g++ -DPACKAGE_NAME=\"mesos\" -DPACKAGE_TARNAME=\"mesos\" -DPACKAGE_VERSION=\"0.0.1\" "-DPACKAGE_STRING=\"mesos 0.0.1\"" -DPACKAGE_BUGREPORT=\"\" -DPACKAGE_URL=\"\" -DPACKAGE=\"mesos\" -DVERSION=\"0.0.1\" -DSTDC_HEADERS=1 -DHAVE_SYS_TYPES_H=1 -DHAVE_SYS_STAT_H=1 -DHAVE_STDLIB_H=1 -DHAVE_STRING_H=1 -DHAVE_MEMORY_H=1 -DHAVE_STRINGS_H=1 -DHAVE_INTTYPES_H=1 -DHAVE_STDINT_H=1 -DHAVE_UNISTD_H=1 -DHAVE_DLFCN_H=1 -DLT_OBJDIR=\".libs/\" -DHAVE_PTHREAD=1 -I. -I../../src -DMESOS_WEBUI_DIR=\"/usr/local/share/mesos/webui\" -DMESOS_LIBEXECDIR=\"/usr/local/libexec/mesos\" -I../../include -I../../third_party/boost-1.37.0 -I../../third_party/protobuf-2.3.0/src -I../../third_party/glog-0.3.1/src -I../third_party/glog-0.3.1/src -I../../third_party/libprocess/include -I../../third_party/zookeeper-3.3.1/src/c/include -I../../third_party/zookeeper-3.3.1/src/c/generated -g2 -O2 -MT sched/libmesos_no_third_party_la-sched.lo -MD -MP -MF sched/.deps/libmesos_no_third_party_la-sched.Tpo -c ../../src/sched/sched.cpp -o sched/libmesos_no_third_party_la-sched.o >/dev/null 2>&1
mv -f sched/.deps/libmesos_no_third_party_la-sched.Tpo sched/.deps/libmesos_no_third_party_la-sched.Plo
/bin/bash ../libtool  --tag=CXX   --mode=compile g++ -DPACKAGE_NAME=\"mesos\" -DPACKAGE_TARNAME=\"mesos\" -DPACKAGE_VERSION=\"0.0.1\" -DPACKAGE_STRING=\"mesos\ 0.0.1\" -DPACKAGE_BUGREPORT=\"\" -DPACKAGE_URL=\"\" -DPACKAGE=\"mesos\" -DVERSION=\"0.0.1\" -DSTDC_HEADERS=1 -DHAVE_SYS_TYPES_H=1 -DHAVE_SYS_STAT_H=1 -DHAVE_STDLIB_H=1 -DHAVE_STRING_H=1 -DHAVE_MEMORY_H=1 -DHAVE_STRINGS_H=1 -DHAVE_INTTYPES_H=1 -DHAVE_STDINT_H=1 -DHAVE_UNISTD_H=1 -DHAVE_DLFCN_H=1 -DLT_OBJDIR=\".libs/\" -DHAVE_PTHREAD=1 -I. -I../../src   -DMESOS_WEBUI_DIR=\"/usr/local/share/mesos/webui\" -DMESOS_LIBEXECDIR=\"/usr/local/libexec/mesos\" -I../../include -I../../third_party/boost-1.37.0 -I../../third_party/protobuf-2.3.0/src -I../../third_party/glog-0.3.1/src -I../third_party/glog-0.3.1/src -I../../third_party/libprocess/include -I../../third_party/zookeeper-3.3.1/src/c/include -I../../third_party/zookeeper-3.3.1/src/c/generated   -g2 -O2 -MT local/libmesos_no_third_party_la-local.lo -MD -MP -MF local/.deps/libmesos_no_third_party_la-local.Tpo -c -o local/libmesos_no_third_party_la-local.lo `test -f 'local/local.cpp' || echo '../../src/'`local/local.cpp
libtool: compile:  g++ -DPACKAGE_NAME=\"mesos\" -DPACKAGE_TARNAME=\"mesos\" -DPACKAGE_VERSION=\"0.0.1\" "-DPACKAGE_STRING=\"mesos 0.0.1\"" -DPACKAGE_BUGREPORT=\"\" -DPACKAGE_URL=\"\" -DPACKAGE=\"mesos\" -DVERSION=\"0.0.1\" -DSTDC_HEADERS=1 -DHAVE_SYS_TYPES_H=1 -DHAVE_SYS_STAT_H=1 -DHAVE_STDLIB_H=1 -DHAVE_STRING_H=1 -DHAVE_MEMORY_H=1 -DHAVE_STRINGS_H=1 -DHAVE_INTTYPES_H=1 -DHAVE_STDINT_H=1 -DHAVE_UNISTD_H=1 -DHAVE_DLFCN_H=1 -DLT_OBJDIR=\".libs/\" -DHAVE_PTHREAD=1 -I. -I../../src -DMESOS_WEBUI_DIR=\"/usr/local/share/mesos/webui\" -DMESOS_LIBEXECDIR=\"/usr/local/libexec/mesos\" -I../../include -I../../third_party/boost-1.37.0 -I../../third_party/protobuf-2.3.0/src -I../../third_party/glog-0.3.1/src -I../third_party/glog-0.3.1/src -I../../third_party/libprocess/include -I../../third_party/zookeeper-3.3.1/src/c/include -I../../third_party/zookeeper-3.3.1/src/c/generated -g2 -O2 -MT local/libmesos_no_third_party_la-local.lo -MD -MP -MF local/.deps/libmesos_no_third_party_la-local.Tpo -c ../../src/local/local.cpp  -fPIC -DPIC -o local/.libs/libmesos_no_third_party_la-local.o
In file included from ../../third_party/boost-1.37.0/boost/uuid/random_generator.hpp:12,
                 from ../../third_party/boost-1.37.0/boost/uuid/uuid_generators.hpp:17,
                 from ../../src/common/uuid.hpp:29,
                 from ../../src/slave/slave.hpp:33,
                 from ../../src/slave/process_based_isolation_module.hpp:28,
                 from ../../src/local/local.cpp:37:
../../third_party/boost-1.37.0/boost/uuid/seed_rng.hpp: In member function 'void boost::uuids::detail::seed_rng::sha1_random_digest_()':
../../third_party/boost-1.37.0/boost/uuid/seed_rng.hpp:153: warning: ignoring return value of 'size_t fread(void*, size_t, size_t, FILE*)', declared with attribute warn_unused_result
libtool: compile:  g++ -DPACKAGE_NAME=\"mesos\" -DPACKAGE_TARNAME=\"mesos\" -DPACKAGE_VERSION=\"0.0.1\" "-DPACKAGE_STRING=\"mesos 0.0.1\"" -DPACKAGE_BUGREPORT=\"\" -DPACKAGE_URL=\"\" -DPACKAGE=\"mesos\" -DVERSION=\"0.0.1\" -DSTDC_HEADERS=1 -DHAVE_SYS_TYPES_H=1 -DHAVE_SYS_STAT_H=1 -DHAVE_STDLIB_H=1 -DHAVE_STRING_H=1 -DHAVE_MEMORY_H=1 -DHAVE_STRINGS_H=1 -DHAVE_INTTYPES_H=1 -DHAVE_STDINT_H=1 -DHAVE_UNISTD_H=1 -DHAVE_DLFCN_H=1 -DLT_OBJDIR=\".libs/\" -DHAVE_PTHREAD=1 -I. -I../../src -DMESOS_WEBUI_DIR=\"/usr/local/share/mesos/webui\" -DMESOS_LIBEXECDIR=\"/usr/local/libexec/mesos\" -I../../include -I../../third_party/boost-1.37.0 -I../../third_party/protobuf-2.3.0/src -I../../third_party/glog-0.3.1/src -I../third_party/glog-0.3.1/src -I../../third_party/libprocess/include -I../../third_party/zookeeper-3.3.1/src/c/include -I../../third_party/zookeeper-3.3.1/src/c/generated -g2 -O2 -MT local/libmesos_no_third_party_la-local.lo -MD -MP -MF local/.deps/libmesos_no_third_party_la-local.Tpo -c ../../src/local/local.cpp -o local/libmesos_no_third_party_la-local.o >/dev/null 2>&1
mv -f local/.deps/libmesos_no_third_party_la-local.Tpo local/.deps/libmesos_no_third_party_la-local.Plo
/bin/bash ../libtool  --tag=CXX   --mode=compile g++ -DPACKAGE_NAME=\"mesos\" -DPACKAGE_TARNAME=\"mesos\" -DPACKAGE_VERSION=\"0.0.1\" -DPACKAGE_STRING=\"mesos\ 0.0.1\" -DPACKAGE_BUGREPORT=\"\" -DPACKAGE_URL=\"\" -DPACKAGE=\"mesos\" -DVERSION=\"0.0.1\" -DSTDC_HEADERS=1 -DHAVE_SYS_TYPES_H=1 -DHAVE_SYS_STAT_H=1 -DHAVE_STDLIB_H=1 -DHAVE_STRING_H=1 -DHAVE_MEMORY_H=1 -DHAVE_STRINGS_H=1 -DHAVE_INTTYPES_H=1 -DHAVE_STDINT_H=1 -DHAVE_UNISTD_H=1 -DHAVE_DLFCN_H=1 -DLT_OBJDIR=\".libs/\" -DHAVE_PTHREAD=1 -I. -I../../src   -DMESOS_WEBUI_DIR=\"/usr/local/share/mesos/webui\" -DMESOS_LIBEXECDIR=\"/usr/local/libexec/mesos\" -I../../include -I../../third_party/boost-1.37.0 -I../../third_party/protobuf-2.3.0/src -I../../third_party/glog-0.3.1/src -I../third_party/glog-0.3.1/src -I../../third_party/libprocess/include -I../../third_party/zookeeper-3.3.1/src/c/include -I../../third_party/zookeeper-3.3.1/src/c/generated   -g2 -O2 -MT master/libmesos_no_third_party_la-master.lo -MD -MP -MF master/.deps/libmesos_no_third_party_la-master.Tpo -c -o master/libmesos_no_third_party_la-master.lo `test -f 'master/master.cpp' || echo '../../src/'`master/master.cpp
libtool: compile:  g++ -DPACKAGE_NAME=\"mesos\" -DPACKAGE_TARNAME=\"mesos\" -DPACKAGE_VERSION=\"0.0.1\" "-DPACKAGE_STRING=\"mesos 0.0.1\"" -DPACKAGE_BUGREPORT=\"\" -DPACKAGE_URL=\"\" -DPACKAGE=\"mesos\" -DVERSION=\"0.0.1\" -DSTDC_HEADERS=1 -DHAVE_SYS_TYPES_H=1 -DHAVE_SYS_STAT_H=1 -DHAVE_STDLIB_H=1 -DHAVE_STRING_H=1 -DHAVE_MEMORY_H=1 -DHAVE_STRINGS_H=1 -DHAVE_INTTYPES_H=1 -DHAVE_STDINT_H=1 -DHAVE_UNISTD_H=1 -DHAVE_DLFCN_H=1 -DLT_OBJDIR=\".libs/\" -DHAVE_PTHREAD=1 -I. -I../../src -DMESOS_WEBUI_DIR=\"/usr/local/share/mesos/webui\" -DMESOS_LIBEXECDIR=\"/usr/local/libexec/mesos\" -I../../include -I../../third_party/boost-1.37.0 -I../../third_party/protobuf-2.3.0/src -I../../third_party/glog-0.3.1/src -I../third_party/glog-0.3.1/src -I../../third_party/libprocess/include -I../../third_party/zookeeper-3.3.1/src/c/include -I../../third_party/zookeeper-3.3.1/src/c/generated -g2 -O2 -MT master/libmesos_no_third_party_la-master.lo -MD -MP -MF master/.deps/libmesos_no_third_party_la-master.Tpo -c ../../src/master/master.cpp  -fPIC -DPIC -o master/.libs/libmesos_no_third_party_la-master.o
In file included from ../../src/master/master.cpp:29:
./config/config.hpp:24:5: error: #if with no expression
In file included from ../../third_party/boost-1.37.0/boost/uuid/random_generator.hpp:12,
                 from ../../third_party/boost-1.37.0/boost/uuid/uuid_generators.hpp:17,
                 from ../../src/common/uuid.hpp:29,
                 from ../../src/master/master.cpp:34:
../../third_party/boost-1.37.0/boost/uuid/seed_rng.hpp: In member function 'void boost::uuids::detail::seed_rng::sha1_random_digest_()':
../../third_party/boost-1.37.0/boost/uuid/seed_rng.hpp:153: warning: ignoring return value of 'size_t fread(void*, size_t, size_t, FILE*)', declared with attribute warn_unused_result
make[2]: *** [master/libmesos_no_third_party_la-master.lo] Error 1
make[2]: Leaving directory `/x1/jenkins/jenkins-slave/workspace/Mesos-Trunk-Ubuntu-Build-Out-Of-Src-Disable-Java-Disable-Python-Disable-Webui/build/src'
make[1]: *** [all] Error 2
make[1]: Leaving directory `/x1/jenkins/jenkins-slave/workspace/Mesos-Trunk-Ubuntu-Build-Out-Of-Src-Disable-Java-Disable-Python-Disable-Webui/build/src'
make: *** [all-recursive] Error 1
Build step 'Execute shell' marked build as failure


Mime
View raw message