mesos-builds mailing list archives

Site index · List index
Message view « Date » · « Thread »
Top « Date » · « Thread »
From Apache Jenkins Server <jenk...@builds.apache.org>
Subject Branch: origin/1.9.x Mesos-Buildbot - Build # 6800 - Still Failing
Date Thu, 10 Oct 2019 00:54:46 GMT
Branch: origin/1.9.x

The Apache Jenkins build system has built Mesos-Buildbot (build #6800)

Status: Still Failing

Check console output at https://builds.apache.org/job/Mesos-Buildbot/6800/ to view the results.

6 tests failed.
FAILED:  FaultToleranceTest.UpdateFrameworkInfoOnMasterFailover

Error Message:
/tmp/SRC/src/tests/fault_tolerance_tests.cpp:2278
      Expected: TASK_RUNNING
To be equal to: runningStatus->state()
      Which is: TASK_STARTING

Stack Trace:
/tmp/SRC/src/tests/fault_tolerance_tests.cpp:2278
      Expected: TASK_RUNNING
To be equal to: runningStatus->state()
      Which is: TASK_STARTING

FAILED:  GarbageCollectorIntegrationTest.Restart

Error Message:
/tmp/SRC/src/tests/gc_tests.cpp:353
Failed to wait 1mins for status

Stack Trace:
/tmp/SRC/src/tests/gc_tests.cpp:353
Failed to wait 1mins for status

FAILED:  CoordinatorTest.MultipleAppendsNotLearnedFill

Error Message:
/tmp/SRC/src/tests/log_tests.cpp:1268
Failed to wait 1mins for electing

Stack Trace:
/tmp/SRC/src/tests/log_tests.cpp:1268
Failed to wait 1mins for electing

FAILED:  MasterQuotaTest.InsufficientResourcesMultipleAgents

Error Message:
/tmp/SRC/src/tests/master_quota_tests.cpp:1242
Failed to wait 1mins for agent1TotalResources

Stack Trace:
/tmp/SRC/src/tests/master_quota_tests.cpp:1242
Failed to wait 1mins for agent1TotalResources

FAILED:  EnvironmentSecretIsolatorTest.ResolveSecret

Error Message:
/tmp/SRC/src/tests/containerizer/environment_secret_isolator_tests.cpp:84
Failed to wait 1mins for offers

Stack Trace:
/tmp/SRC/src/tests/containerizer/environment_secret_isolator_tests.cpp:84
Failed to wait 1mins for offers

FAILED:  ContentType/AgentAPITest.GetLoggingLevel/1

Error Message:
/tmp/SRC/src/tests/api_tests.cpp:5704
Failed to wait 1mins for __recover

Stack Trace:
/tmp/SRC/src/tests/api_tests.cpp:5704
Failed to wait 1mins for __recover
Mime
  • Unnamed multipart/mixed (inline, None, 0 bytes)
View raw message