mesos-builds mailing list archives

Site index · List index
Message view « Date » · « Thread »
Top « Date » · « Thread »
From Apache Jenkins Server <jenk...@builds.apache.org>
Subject Branch: origin/master Mesos-Buildbot - Build # 6799 - Still Failing
Date Wed, 09 Oct 2019 23:10:27 GMT
Branch: origin/master

The Apache Jenkins build system has built Mesos-Buildbot (build #6799)

Status: Still Failing

Check console output at https://builds.apache.org/job/Mesos-Buildbot/6799/ to view the results.

8 tests failed.
FAILED:  DefaultExecutorCheckTest.MultipleTasksWithChecks

Error Message:
../../../src/tests/check_tests.cpp:2492
Failed to wait 1mins for updates[i]

Stack Trace:
../../../src/tests/check_tests.cpp:2492
Failed to wait 1mins for updates[i]

FAILED:  MasterSlaveReconciliationTest.SlaveReregisterFrameworks

Error Message:
../../../src/tests/master_slave_reconciliation_tests.cpp:929
Failed to wait 1mins for offers

Stack Trace:
../../../src/tests/master_slave_reconciliation_tests.cpp:929
Failed to wait 1mins for offers

FAILED:  ParentChildContainerTypeAndContentType/AgentContainerAPITest.GetContainers/2

Error Message:
../../../src/tests/agent_container_api_tests.cpp:870
parentContainerId: Failed to launch parent container

Stack Trace:
../../../src/tests/agent_container_api_tests.cpp:870
parentContainerId: Failed to launch parent container

FAILED:  CSIVersion/StorageLocalResourceProviderTest.RetryRpcWithExponentialBackoff/v1

Error Message:
../../../src/tests/utils.cpp:64
Failed to wait 1mins for response

Stack Trace:
../../../src/tests/utils.cpp:64
Failed to wait 1mins for response

FAILED:  GarbageCollectorIntegrationTest.DiskUsage

Error Message:
/tmp/SRC/src/tests/gc_tests.cpp:1137
Failed to wait 1mins for slaveRegisteredMessage

Stack Trace:
/tmp/SRC/src/tests/gc_tests.cpp:1137
Failed to wait 1mins for slaveRegisteredMessage

FAILED:  SlaveTest.UnregisterThenUnreachableRace

Error Message:
/tmp/SRC/src/tests/slave_tests.cpp:4077
Failed to wait 1mins for resourceOffers

Stack Trace:
/tmp/SRC/src/tests/slave_tests.cpp:4077
Failed to wait 1mins for resourceOffers

FAILED:  FetcherCacheTest.LocalCachedMissing

Error Message:
/tmp/SRC/src/tests/fetcher_cache_tests.cpp:344
Failed to wait 1mins for slaveRegisteredMessage

Stack Trace:
/tmp/SRC/src/tests/fetcher_cache_tests.cpp:344
Failed to wait 1mins for slaveRegisteredMessage

FAILED:  ContentType/AgentAPITest.DefaultAccept/0

Error Message:
/tmp/SRC/src/tests/api_tests.cpp:8671
Failed to wait 1mins for __recover

Stack Trace:
/tmp/SRC/src/tests/api_tests.cpp:8671
Failed to wait 1mins for __recover
Mime
  • Unnamed multipart/mixed (inline, None, 0 bytes)
View raw message