mesos-builds mailing list archives

Site index · List index
Message view « Date » · « Thread »
Top « Date » · « Thread »
From Apache Jenkins Server <jenk...@builds.apache.org>
Subject Build failed in Jenkins: Mesos-Reviewbot #22907
Date Tue, 24 Jul 2018 00:59:48 GMT
See <https://builds.apache.org/job/Mesos-Reviewbot/22907/display/redirect?page=changes>

Changes:

[bmahler] Added a helper for capability filtering in the allocator.

------------------------------------------
[...truncated 37.58 MB...]
I0724 00:59:34.774999 18133 task_status_update_manager.cpp:207] Recovering task status update
manager
I0724 00:59:34.775482 18129 containerizer.cpp:718] Recovering Mesos containers
I0724 00:59:34.775883 18129 containerizer.cpp:1025] Recovering isolators
I0724 00:59:34.776599 18129 containerizer.cpp:1064] Recovering provisioner
I0724 00:59:34.777505 18129 provisioner.cpp:494] Provisioner recovery complete
I0724 00:59:34.778486 18135 composing.cpp:339] Finished recovering all containerizers
I0724 00:59:34.778734 18132 slave.cpp:7156] Recovering executors
I0724 00:59:34.779021 18132 slave.cpp:7309] Finished recovery
I0724 00:59:34.785055 18132 process.cpp:3569] Handling HTTP event for process 'slave(1009)'
with path: '/slave(1009)/containers'
I0724 00:59:34.787178 18132 http.cpp:1099] HTTP GET for /slave(1009)/containers from 172.17.0.2:46300
I0724 00:59:34.787449 18132 http.cpp:936] Authorizing principal 'test-principal' to GET the
'/containers' endpoint
I0724 00:59:34.792584 18127 slave.cpp:931] Agent terminating
[       OK ] Endpoint/SlaveEndpointTest.AuthorizedRequest/2 (86 ms)
[ RUN      ] Endpoint/SlaveEndpointTest.UnauthorizedRequest/0
I0724 00:59:34.843400 18127 containerizer.cpp:300] Using isolation { environment_secret, posix/cpu,
posix/mem, filesystem/posix, network/cni }
W0724 00:59:34.846701 18127 backend.cpp:76] Failed to create 'aufs' backend: AufsBackend requires
root privileges
W0724 00:59:34.846774 18127 backend.cpp:76] Failed to create 'bind' backend: BindBackend requires
root privileges
I0724 00:59:34.846848 18127 provisioner.cpp:298] Using default backend 'copy'
I0724 00:59:34.856062 18129 slave.cpp:268] Mesos agent started on (1010)@172.17.0.2:42126
I0724 00:59:34.856093 18129 slave.cpp:269] Flags at startup: --acls="" --appc_simple_discovery_uri_prefix="http://"
--appc_store_dir="/tmp/Endpoint_SlaveEndpointTest_UnauthorizedRequest_0_FyVEgr/store/appc"
--authenticate_http_readonly="true" --authenticate_http_readwrite="false" --authenticatee="crammd5"
--authentication_backoff_factor="1secs" --authorizer="local" --cgroups_cpu_enable_pids_and_tids_count="false"
--cgroups_enable_cfs="false" --cgroups_hierarchy="/sys/fs/cgroup" --cgroups_limit_swap="false"
--cgroups_root="mesos" --container_disk_watch_interval="15secs" --containerizers="mesos" --credential="/tmp/Endpoint_SlaveEndpointTest_UnauthorizedRequest_0_FyVEgr/credential"
--default_role="*" --disallow_sharing_agent_pid_namespace="false" --disk_watch_interval="1mins"
--docker="docker" --docker_kill_orphans="true" --docker_registry="https://registry-1.docker.io"
--docker_remove_delay="6hrs" --docker_socket="/var/run/docker.sock" --docker_stop_timeout="0ns"
--docker_store_dir="/tmp/Endpoint_SlaveEndpointTest_UnauthorizedRequest_0_FyVEgr/store/docker"
--docker_volume_checkpoint_dir="/var/run/mesos/isolators/docker/volume" --enforce_container_disk_quota="false"
--executor_registration_timeout="1mins" --executor_reregistration_timeout="2secs" --executor_shutdown_grace_period="5secs"
--fetcher_cache_dir="/tmp/Endpoint_SlaveEndpointTest_UnauthorizedRequest_0_FyVEgr/fetch" --fetcher_cache_size="2GB"
--fetcher_stall_timeout="1mins" --frameworks_home="" --gc_delay="1weeks" --gc_disk_headroom="0.1"
--help="false" --hostname_lookup="true" --http_command_executor="false" --http_credentials="/tmp/Endpoint_SlaveEndpointTest_UnauthorizedRequest_0_FyVEgr/http_credentials"
--http_heartbeat_interval="30secs" --initialize_driver_logging="true" --isolation="posix/cpu,posix/mem"
--launcher="posix" --launcher_dir="/tmp/SRC/build/mesos-1.7.0/_build/sub/src" --logbufsecs="0"
--logging_level="INFO" --max_completed_executors_per_framework="150" --memory_profiling="false"
--oversubscribed_resources_interval="15secs" --perf_duration="10secs" --perf_interval="1mins"
--port="5051" --qos_correction_interval_min="0ns" --quiet="false" --reconfiguration_policy="equal"
--recover="reconnect" --recovery_timeout="15mins" --registration_backoff_factor="10ms" --resources="cpus:2;gpus:0;mem:1024;disk:1024;ports:[31000-32000]"
--revocable_cpu_low_priority="true" --runtime_dir="/tmp/Endpoint_SlaveEndpointTest_UnauthorizedRequest_0_FyVEgr"
--sandbox_directory="/mnt/mesos/sandbox" --strict="true" --switch_user="true" --systemd_enable_support="true"
--systemd_runtime_directory="/run/systemd/system" --version="false" --work_dir="/tmp/Endpoint_SlaveEndpointTest_UnauthorizedRequest_0_wOXscA"
--zk_session_timeout="10secs"
I0724 00:59:34.856534 18129 credentials.hpp:86] Loading credential for authentication from
'/tmp/Endpoint_SlaveEndpointTest_UnauthorizedRequest_0_FyVEgr/credential'
I0724 00:59:34.856788 18129 slave.cpp:301] Agent using credential for: test-principal
I0724 00:59:34.856817 18129 credentials.hpp:37] Loading credentials for authentication from
'/tmp/Endpoint_SlaveEndpointTest_UnauthorizedRequest_0_FyVEgr/http_credentials'
I0724 00:59:34.857147 18129 http.cpp:959] Creating default 'basic' HTTP authenticator for
realm 'mesos-agent-readonly'
I0724 00:59:34.857632 18129 disk_profile_adaptor.cpp:80] Creating default disk profile adaptor
module
I0724 00:59:34.858831 18129 slave.cpp:616] Agent resources: [{"name":"cpus","scalar":{"value":2.0},"type":"SCALAR"},{"name":"mem","scalar":{"value":1024.0},"type":"SCALAR"},{"name":"disk","scalar":{"value":1024.0},"type":"SCALAR"},{"name":"ports","ranges":{"range":[{"begin":31000,"end":32000}]},"type":"RANGES"}]
I0724 00:59:34.859055 18129 slave.cpp:624] Agent attributes: [  ]
I0724 00:59:34.859112 18129 slave.cpp:633] Agent hostname: 8ede208b7797
I0724 00:59:34.859517 18130 task_status_update_manager.cpp:181] Pausing sending task status
updates
I0724 00:59:34.861176 18129 state.cpp:66] Recovering state from '/tmp/Endpoint_SlaveEndpointTest_UnauthorizedRequest_0_wOXscA/meta'
I0724 00:59:34.861922 18129 slave.cpp:6927] Finished recovering checkpointed state from '/tmp/Endpoint_SlaveEndpointTest_UnauthorizedRequest_0_wOXscA/meta',
beginning agent recovery
I0724 00:59:34.866211 18135 task_status_update_manager.cpp:207] Recovering task status update
manager
I0724 00:59:34.866724 18131 containerizer.cpp:718] Recovering Mesos containers
I0724 00:59:34.867202 18131 containerizer.cpp:1025] Recovering isolators
I0724 00:59:34.868002 18135 containerizer.cpp:1064] Recovering provisioner
I0724 00:59:34.868736 18129 provisioner.cpp:494] Provisioner recovery complete
I0724 00:59:34.869726 18130 composing.cpp:339] Finished recovering all containerizers
I0724 00:59:34.870147 18135 slave.cpp:7156] Recovering executors
I0724 00:59:34.870406 18135 slave.cpp:7309] Finished recovery
I0724 00:59:34.876392 18135 process.cpp:3569] Handling HTTP event for process 'slave(1010)'
with path: '/slave(1010)/monitor/statistics'
I0724 00:59:34.878654 18128 http.cpp:1099] HTTP GET for /slave(1010)/monitor/statistics from
172.17.0.2:46306
I0724 00:59:34.878921 18128 http.cpp:936] Authorizing principal 'test-principal' to GET the
'/monitor/statistics' endpoint
I0724 00:59:34.893141 18127 slave.cpp:931] Agent terminating
[       OK ] Endpoint/SlaveEndpointTest.UnauthorizedRequest/0 (84 ms)
[ RUN      ] Endpoint/SlaveEndpointTest.UnauthorizedRequest/1
I0724 00:59:34.925313 18127 containerizer.cpp:300] Using isolation { environment_secret, posix/cpu,
posix/mem, filesystem/posix, network/cni }
W0724 00:59:34.925973 18127 backend.cpp:76] Failed to create 'aufs' backend: AufsBackend requires
root privileges
W0724 00:59:34.926386 18127 backend.cpp:76] Failed to create 'bind' backend: BindBackend requires
root privileges
I0724 00:59:34.926432 18127 provisioner.cpp:298] Using default backend 'copy'
I0724 00:59:34.933950 18129 slave.cpp:268] Mesos agent started on (1011)@172.17.0.2:42126
I0724 00:59:34.933990 18129 slave.cpp:269] Flags at startup: --acls="" --appc_simple_discovery_uri_prefix="http://"
--appc_store_dir="/tmp/Endpoint_SlaveEndpointTest_UnauthorizedRequest_1_5lo3dS/store/appc"
--authenticate_http_readonly="true" --authenticate_http_readwrite="false" --authenticatee="crammd5"
--authentication_backoff_factor="1secs" --authorizer="local" --cgroups_cpu_enable_pids_and_tids_count="false"
--cgroups_enable_cfs="false" --cgroups_hierarchy="/sys/fs/cgroup" --cgroups_limit_swap="false"
--cgroups_root="mesos" --container_disk_watch_interval="15secs" --containerizers="mesos" --credential="/tmp/Endpoint_SlaveEndpointTest_UnauthorizedRequest_1_5lo3dS/credential"
--default_role="*" --disallow_sharing_agent_pid_namespace="false" --disk_watch_interval="1mins"
--docker="docker" --docker_kill_orphans="true" --docker_registry="https://registry-1.docker.io"
--docker_remove_delay="6hrs" --docker_socket="/var/run/docker.sock" --docker_stop_timeout="0ns"
--docker_store_dir="/tmp/Endpoint_SlaveEndpointTest_UnauthorizedRequest_1_5lo3dS/store/docker"
--docker_volume_checkpoint_dir="/var/run/mesos/isolators/docker/volume" --enforce_container_disk_quota="false"
--executor_registration_timeout="1mins" --executor_reregistration_timeout="2secs" --executor_shutdown_grace_period="5secs"
--fetcher_cache_dir="/tmp/Endpoint_SlaveEndpointTest_UnauthorizedRequest_1_5lo3dS/fetch" --fetcher_cache_size="2GB"
--fetcher_stall_timeout="1mins" --frameworks_home="" --gc_delay="1weeks" --gc_disk_headroom="0.1"
--help="false" --hostname_lookup="true" --http_command_executor="false" --http_credentials="/tmp/Endpoint_SlaveEndpointTest_UnauthorizedRequest_1_5lo3dS/http_credentials"
--http_heartbeat_interval="30secs" --initialize_driver_logging="true" --isolation="posix/cpu,posix/mem"
--launcher="posix" --launcher_dir="/tmp/SRC/build/mesos-1.7.0/_build/sub/src" --logbufsecs="0"
--logging_level="INFO" --max_completed_executors_per_framework="150" --memory_profiling="false"
--oversubscribed_resources_interval="15secs" --perf_duration="10secs" --perf_interval="1mins"
--port="5051" --qos_correction_interval_min="0ns" --quiet="false" --reconfiguration_policy="equal"
--recover="reconnect" --recovery_timeout="15mins" --registration_backoff_factor="10ms" --resources="cpus:2;gpus:0;mem:1024;disk:1024;ports:[31000-32000]"
--revocable_cpu_low_priority="true" --runtime_dir="/tmp/Endpoint_SlaveEndpointTest_UnauthorizedRequest_1_5lo3dS"
--sandbox_directory="/mnt/mesos/sandbox" --strict="true" --switch_user="true" --systemd_enable_support="true"
--systemd_runtime_directory="/run/systemd/system" --version="false" --work_dir="/tmp/Endpoint_SlaveEndpointTest_UnauthorizedRequest_1_1kJ5W0"
--zk_session_timeout="10secs"
I0724 00:59:34.934445 18129 credentials.hpp:86] Loading credential for authentication from
'/tmp/Endpoint_SlaveEndpointTest_UnauthorizedRequest_1_5lo3dS/credential'
I0724 00:59:34.934728 18129 slave.cpp:301] Agent using credential for: test-principal
I0724 00:59:34.934756 18129 credentials.hpp:37] Loading credentials for authentication from
'/tmp/Endpoint_SlaveEndpointTest_UnauthorizedRequest_1_5lo3dS/http_credentials'
I0724 00:59:34.935101 18129 http.cpp:959] Creating default 'basic' HTTP authenticator for
realm 'mesos-agent-readonly'
I0724 00:59:34.935611 18129 disk_profile_adaptor.cpp:80] Creating default disk profile adaptor
module
I0724 00:59:34.936869 18129 slave.cpp:616] Agent resources: [{"name":"cpus","scalar":{"value":2.0},"type":"SCALAR"},{"name":"mem","scalar":{"value":1024.0},"type":"SCALAR"},{"name":"disk","scalar":{"value":1024.0},"type":"SCALAR"},{"name":"ports","ranges":{"range":[{"begin":31000,"end":32000}]},"type":"RANGES"}]
I0724 00:59:34.937091 18129 slave.cpp:624] Agent attributes: [  ]
I0724 00:59:34.937116 18129 slave.cpp:633] Agent hostname: 8ede208b7797
I0724 00:59:34.937456 18134 task_status_update_manager.cpp:181] Pausing sending task status
updates
I0724 00:59:34.939715 18132 state.cpp:66] Recovering state from '/tmp/Endpoint_SlaveEndpointTest_UnauthorizedRequest_1_1kJ5W0/meta'
I0724 00:59:34.940270 18132 slave.cpp:6927] Finished recovering checkpointed state from '/tmp/Endpoint_SlaveEndpointTest_UnauthorizedRequest_1_1kJ5W0/meta',
beginning agent recovery
I0724 00:59:34.940835 18132 task_status_update_manager.cpp:207] Recovering task status update
manager
I0724 00:59:34.941390 18131 containerizer.cpp:718] Recovering Mesos containers
I0724 00:59:34.941999 18131 containerizer.cpp:1025] Recovering isolators
I0724 00:59:34.943101 18129 containerizer.cpp:1064] Recovering provisioner
I0724 00:59:34.943874 18134 provisioner.cpp:494] Provisioner recovery complete
I0724 00:59:34.944710 18130 composing.cpp:339] Finished recovering all containerizers
I0724 00:59:34.945189 18135 slave.cpp:7156] Recovering executors
I0724 00:59:34.945444 18135 slave.cpp:7309] Finished recovery
I0724 00:59:34.950294 18133 process.cpp:3569] Handling HTTP event for process 'slave(1011)'
with path: '/slave(1011)/monitor/statistics.json'
I0724 00:59:34.954648 18133 http.cpp:1099] HTTP GET for /slave(1011)/monitor/statistics.json
from 172.17.0.2:46310
I0724 00:59:34.954957 18133 http.cpp:936] Authorizing principal 'test-principal' to GET the
'/monitor/statistics.json' endpoint
I0724 00:59:34.957958 18127 slave.cpp:931] Agent terminating
[       OK ] Endpoint/SlaveEndpointTest.UnauthorizedRequest/1 (81 ms)
[ RUN      ] Endpoint/SlaveEndpointTest.UnauthorizedRequest/2
I0724 00:59:35.006419 18127 containerizer.cpp:300] Using isolation { environment_secret, posix/cpu,
posix/mem, filesystem/posix, network/cni }
W0724 00:59:35.010717 18127 backend.cpp:76] Failed to create 'aufs' backend: AufsBackend requires
root privileges
W0724 00:59:35.010759 18127 backend.cpp:76] Failed to create 'bind' backend: BindBackend requires
root privileges
I0724 00:59:35.010888 18127 provisioner.cpp:298] Using default backend 'copy'
I0724 00:59:35.015206 18129 slave.cpp:268] Mesos agent started on (1012)@172.17.0.2:42126
I0724 00:59:35.015235 18129 slave.cpp:269] Flags at startup: --acls="" --appc_simple_discovery_uri_prefix="http://"
--appc_store_dir="/tmp/Endpoint_SlaveEndpointTest_UnauthorizedRequest_2_mwJ2Yj/store/appc"
--authenticate_http_readonly="true" --authenticate_http_readwrite="false" --authenticatee="crammd5"
--authentication_backoff_factor="1secs" --authorizer="local" --cgroups_cpu_enable_pids_and_tids_count="false"
--cgroups_enable_cfs="false" --cgroups_hierarchy="/sys/fs/cgroup" --cgroups_limit_swap="false"
--cgroups_root="mesos" --container_disk_watch_interval="15secs" --containerizers="mesos" --credential="/tmp/Endpoint_SlaveEndpointTest_UnauthorizedRequest_2_mwJ2Yj/credential"
--default_role="*" --disallow_sharing_agent_pid_namespace="false" --disk_watch_interval="1mins"
--docker="docker" --docker_kill_orphans="true" --docker_registry="https://registry-1.docker.io"
--docker_remove_delay="6hrs" --docker_socket="/var/run/docker.sock" --docker_stop_timeout="0ns"
--docker_store_dir="/tmp/Endpoint_SlaveEndpointTest_UnauthorizedRequest_2_mwJ2Yj/store/docker"
--docker_volume_checkpoint_dir="/var/run/mesos/isolators/docker/volume" --enforce_container_disk_quota="false"
--executor_registration_timeout="1mins" --executor_reregistration_timeout="2secs" --executor_shutdown_grace_period="5secs"
--fetcher_cache_dir="/tmp/Endpoint_SlaveEndpointTest_UnauthorizedRequest_2_mwJ2Yj/fetch" --fetcher_cache_size="2GB"
--fetcher_stall_timeout="1mins" --frameworks_home="" --gc_delay="1weeks" --gc_disk_headroom="0.1"
--help="false" --hostname_lookup="true" --http_command_executor="false" --http_credentials="/tmp/Endpoint_SlaveEndpointTest_UnauthorizedRequest_2_mwJ2Yj/http_credentials"
--http_heartbeat_interval="30secs" --initialize_driver_logging="true" --isolation="posix/cpu,posix/mem"
--launcher="posix" --launcher_dir="/tmp/SRC/build/mesos-1.7.0/_build/sub/src" --logbufsecs="0"
--logging_level="INFO" --max_completed_executors_per_framework="150" --memory_profiling="false"
--oversubscribed_resources_interval="15secs" --perf_duration="10secs" --perf_interval="1mins"
--port="5051" --qos_correction_interval_min="0ns" --quiet="false" --reconfiguration_policy="equal"
--recover="reconnect" --recovery_timeout="15mins" --registration_backoff_factor="10ms" --resources="cpus:2;gpus:0;mem:1024;disk:1024;ports:[31000-32000]"
--revocable_cpu_low_priority="true" --runtime_dir="/tmp/Endpoint_SlaveEndpointTest_UnauthorizedRequest_2_mwJ2Yj"
--sandbox_directory="/mnt/mesos/sandbox" --strict="true" --switch_user="true" --systemd_enable_support="true"
--systemd_runtime_directory="/run/systemd/system" --version="false" --work_dir="/tmp/Endpoint_SlaveEndpointTest_UnauthorizedRequest_2_sEUrvs"
--zk_session_timeout="10secs"
I0724 00:59:35.018471 18129 credentials.hpp:86] Loading credential for authentication from
'/tmp/Endpoint_SlaveEndpointTest_UnauthorizedRequest_2_mwJ2Yj/credential'
I0724 00:59:35.018729 18129 slave.cpp:301] Agent using credential for: test-principal
I0724 00:59:35.018767 18129 credentials.hpp:37] Loading credentials for authentication from
'/tmp/Endpoint_SlaveEndpointTest_UnauthorizedRequest_2_mwJ2Yj/http_credentials'
I0724 00:59:35.019129 18129 http.cpp:959] Creating default 'basic' HTTP authenticator for
realm 'mesos-agent-readonly'
I0724 00:59:35.019634 18129 disk_profile_adaptor.cpp:80] Creating default disk profile adaptor
module
I0724 00:59:35.020766 18129 slave.cpp:616] Agent resources: [{"name":"cpus","scalar":{"value":2.0},"type":"SCALAR"},{"name":"mem","scalar":{"value":1024.0},"type":"SCALAR"},{"name":"disk","scalar":{"value":1024.0},"type":"SCALAR"},{"name":"ports","ranges":{"range":[{"begin":31000,"end":32000}]},"type":"RANGES"}]
I0724 00:59:35.020964 18129 slave.cpp:624] Agent attributes: [  ]
I0724 00:59:35.021031 18129 slave.cpp:633] Agent hostname: 8ede208b7797
I0724 00:59:35.021387 18128 task_status_update_manager.cpp:181] Pausing sending task status
updates
I0724 00:59:35.023650 18129 state.cpp:66] Recovering state from '/tmp/Endpoint_SlaveEndpointTest_UnauthorizedRequest_2_sEUrvs/meta'
I0724 00:59:35.024000 18131 slave.cpp:6927] Finished recovering checkpointed state from '/tmp/Endpoint_SlaveEndpointTest_UnauthorizedRequest_2_sEUrvs/meta',
beginning agent recovery
I0724 00:59:35.024369 18131 task_status_update_manager.cpp:207] Recovering task status update
manager
I0724 00:59:35.024981 18131 containerizer.cpp:718] Recovering Mesos containers
I0724 00:59:35.025485 18131 containerizer.cpp:1025] Recovering isolators
I0724 00:59:35.026399 18128 containerizer.cpp:1064] Recovering provisioner
I0724 00:59:35.027185 18133 provisioner.cpp:494] Provisioner recovery complete
I0724 00:59:35.028478 18135 composing.cpp:339] Finished recovering all containerizers
I0724 00:59:35.028856 18135 slave.cpp:7156] Recovering executors
I0724 00:59:35.029089 18135 slave.cpp:7309] Finished recovery
I0724 00:59:35.038086 18129 process.cpp:3569] Handling HTTP event for process 'slave(1012)'
with path: '/slave(1012)/containers'
I0724 00:59:35.040522 18129 http.cpp:1099] HTTP GET for /slave(1012)/containers from 172.17.0.2:46316
I0724 00:59:35.040666 18129 http.cpp:936] Authorizing principal 'test-principal' to GET the
'/containers' endpoint
I0724 00:59:35.058166 18127 slave.cpp:931] Agent terminating
[       OK ] Endpoint/SlaveEndpointTest.UnauthorizedRequest/2 (105 ms)
[ RUN      ] Endpoint/SlaveEndpointTest.NoAuthorizer/0
I0724 00:59:35.112540 18127 containerizer.cpp:300] Using isolation { environment_secret, posix/cpu,
posix/mem, filesystem/posix, network/cni }
W0724 00:59:35.117727 18127 backend.cpp:76] Failed to create 'aufs' backend: AufsBackend requires
root privileges
W0724 00:59:35.117764 18127 backend.cpp:76] Failed to create 'bind' backend: BindBackend requires
root privileges
I0724 00:59:35.117880 18127 provisioner.cpp:298] Using default backend 'copy'
I0724 00:59:35.120298 18127 cluster.cpp:479] Creating default 'local' authorizer
I0724 00:59:35.126708 18133 slave.cpp:268] Mesos agent started on (1013)@172.17.0.2:42126
I0724 00:59:35.126767 18133 slave.cpp:269] Flags at startup: --acls="" --appc_simple_discovery_uri_prefix="http://"
--appc_store_dir="/tmp/Endpoint_SlaveEndpointTest_NoAuthorizer_0_PGy8JM/store/appc" --authenticate_http_readonly="true"
--authenticate_http_readwrite="false" --authenticatee="crammd5" --authentication_backoff_factor="1secs"
--authorizer="local" --cgroups_cpu_enable_pids_and_tids_count="false" --cgroups_enable_cfs="false"
--cgroups_hierarchy="/sys/fs/cgroup" --cgroups_limit_swap="false" --cgroups_root="mesos" --container_disk_watch_interval="15secs"
--containerizers="mesos" --credential="/tmp/Endpoint_SlaveEndpointTest_NoAuthorizer_0_PGy8JM/credential"
--default_role="*" --disallow_sharing_agent_pid_namespace="false" --disk_watch_interval="1mins"
--docker="docker" --docker_kill_orphans="true" --docker_registry="https://registry-1.docker.io"
--docker_remove_delay="6hrs" --docker_socket="/var/run/docker.sock" --docker_stop_timeout="0ns"
--docker_store_dir="/tmp/Endpoint_SlaveEndpointTest_NoAuthorizer_0_PGy8JM/store/docker" --docker_volume_checkpoint_dir="/var/run/mesos/isolators/docker/volume"
--enforce_container_disk_quota="false" --executor_registration_timeout="1mins" --executor_reregistration_timeout="2secs"
--executor_shutdown_grace_period="5secs" --fetcher_cache_dir="/tmp/Endpoint_SlaveEndpointTest_NoAuthorizer_0_PGy8JM/fetch"
--fetcher_cache_size="2GB" --fetcher_stall_timeout="1mins" --frameworks_home="" --gc_delay="1weeks"
--gc_disk_headroom="0.1" --help="false" --hostname_lookup="true" --http_command_executor="false"
--http_credentials="/tmp/Endpoint_SlaveEndpointTest_NoAuthorizer_0_PGy8JM/http_credentials"
--http_heartbeat_interval="30secs" --initialize_driver_logging="true" --isolation="posix/cpu,posix/mem"
--launcher="posix" --launcher_dir="/tmp/SRC/build/mesos-1.7.0/_build/sub/src" --logbufsecs="0"
--logging_level="INFO" --max_completed_executors_per_framework="150" --memory_profiling="false"
--oversubscribed_resources_interval="15secs" --perf_duration="10secs" --perf_interval="1mins"
--port="5051" --qos_correction_interval_min="0ns" --quiet="false" --reconfiguration_policy="equal"
--recover="reconnect" --recovery_timeout="15mins" --registration_backoff_factor="10ms" --resources="cpus:2;gpus:0;mem:1024;disk:1024;ports:[31000-32000]"
--revocable_cpu_low_priority="true" --runtime_dir="/tmp/Endpoint_SlaveEndpointTest_NoAuthorizer_0_PGy8JM"
--sandbox_directory="/mnt/mesos/sandbox" --strict="true" --switch_user="true" --systemd_enable_support="true"
--systemd_runtime_directory="/run/systemd/system" --version="false" --work_dir="/tmp/Endpoint_SlaveEndpointTest_NoAuthorizer_0_5Reb0U"
--zk_session_timeout="10secs"
I0724 00:59:35.127291 18133 credentials.hpp:86] Loading credential for authentication from
'/tmp/Endpoint_SlaveEndpointTest_NoAuthorizer_0_PGy8JM/credential'
I0724 00:59:35.127765 18133 slave.cpp:301] Agent using credential for: test-principal
I0724 00:59:35.127813 18133 credentials.hpp:37] Loading credentials for authentication from
'/tmp/Endpoint_SlaveEndpointTest_NoAuthorizer_0_PGy8JM/http_credentials'
I0724 00:59:35.128343 18133 http.cpp:959] Creating default 'basic' HTTP authenticator for
realm 'mesos-agent-readonly'
I0724 00:59:35.128935 18133 disk_profile_adaptor.cpp:80] Creating default disk profile adaptor
module
I0724 00:59:35.130388 18133 slave.cpp:616] Agent resources: [{"name":"cpus","scalar":{"value":2.0},"type":"SCALAR"},{"name":"mem","scalar":{"value":1024.0},"type":"SCALAR"},{"name":"disk","scalar":{"value":1024.0},"type":"SCALAR"},{"name":"ports","ranges":{"range":[{"begin":31000,"end":32000}]},"type":"RANGES"}]
I0724 00:59:35.130646 18133 slave.cpp:624] Agent attributes: [  ]
I0724 00:59:35.130858 18133 slave.cpp:633] Agent hostname: 8ede208b7797
I0724 00:59:35.132026 18135 task_status_update_manager.cpp:181] Pausing sending task status
updates
I0724 00:59:35.133733 18133 state.cpp:66] Recovering state from '/tmp/Endpoint_SlaveEndpointTest_NoAuthorizer_0_5Reb0U/meta'
I0724 00:59:35.134073 18135 slave.cpp:6927] Finished recovering checkpointed state from '/tmp/Endpoint_SlaveEndpointTest_NoAuthorizer_0_5Reb0U/meta',
beginning agent recovery
I0724 00:59:35.134398 18128 task_status_update_manager.cpp:207] Recovering task status update
manager
I0724 00:59:35.140794 18130 containerizer.cpp:718] Recovering Mesos containers
I0724 00:59:35.141208 18130 containerizer.cpp:1025] Recovering isolators
I0724 00:59:35.141960 18134 containerizer.cpp:1064] Recovering provisioner
I0724 00:59:35.142869 18135 provisioner.cpp:494] Provisioner recovery complete
I0724 00:59:35.143635 18131 composing.cpp:339] Finished recovering all containerizers
I0724 00:59:35.143997 18128 slave.cpp:7156] Recovering executors
I0724 00:59:35.144330 18128 slave.cpp:7309] Finished recovery
I0724 00:59:35.153002 18131 process.cpp:3569] Handling HTTP event for process 'slave(1013)'
with path: '/slave(1013)/monitor/statistics'
I0724 00:59:35.155071 18128 http.cpp:1099] HTTP GET for /slave(1013)/monitor/statistics from
172.17.0.2:46322
I0724 00:59:35.155329 18128 http.cpp:936] Authorizing principal 'test-principal' to GET the
'/monitor/statistics' endpoint
I0724 00:59:35.159680 18127 slave.cpp:931] Agent terminating
[       OK ] Endpoint/SlaveEndpointTest.NoAuthorizer/0 (92 ms)
[ RUN      ] Endpoint/SlaveEndpointTest.NoAuthorizer/1
I0724 00:59:35.208284 18127 containerizer.cpp:300] Using isolation { environment_secret, posix/cpu,
posix/mem, filesystem/posix, network/cni }
W0724 00:59:35.208948 18127 backend.cpp:76] Failed to create 'aufs' backend: AufsBackend requires
root privileges
W0724 00:59:35.209022 18127 backend.cpp:76] Failed to create 'bind' backend: BindBackend requires
root privileges
I0724 00:59:35.209095 18127 provisioner.cpp:298] Using default backend 'copy'
I0724 00:59:35.211673 18127 cluster.cpp:479] Creating default 'local' authorizer
I0724 00:59:35.213919 18128 slave.cpp:268] Mesos agent started on (1014)@172.17.0.2:42126
I0724 00:59:35.215162 18128 slave.cpp:269] Flags at startup: --acls="" --appc_simple_discovery_uri_prefix="http://"
--appc_store_dir="/tmp/Endpoint_SlaveEndpointTest_NoAuthorizer_1_3mP4tg/store/appc" --authenticate_http_readonly="true"
--authenticate_http_readwrite="false" --authenticatee="crammd5" --authentication_backoff_factor="1secs"
--authorizer="local" --cgroups_cpu_enable_pids_and_tids_count="false" --cgroups_enable_cfs="false"
--cgroups_hierarchy="/sys/fs/cgroup" --cgroups_limit_swap="false" --cgroups_root="mesos" --container_disk_watch_interval="15secs"
--containerizers="mesos" --credential="/tmp/Endpoint_SlaveEndpointTest_NoAuthorizer_1_3mP4tg/credential"
--default_role="*" --disallow_sharing_agent_pid_namespace="false" --disk_watch_interval="1mins"
--docker="docker" --docker_kill_orphans="true" --docker_registry="https://registry-1.docker.io"
--docker_remove_delay="6hrs" --docker_socket="/var/run/docker.sock" --docker_stop_timeout="0ns"
--docker_store_dir="/tmp/Endpoint_SlaveEndpointTest_NoAuthorizer_1_3mP4tg/store/docker" --docker_volume_checkpoint_dir="/var/run/mesos/isolators/docker/volume"
--enforce_container_disk_quota="false" --executor_registration_timeout="1mins" --executor_reregistration_timeout="2secs"
--executor_shutdown_grace_period="5secs" --fetcher_cache_dir="/tmp/Endpoint_SlaveEndpointTest_NoAuthorizer_1_3mP4tg/fetch"
--fetcher_cache_size="2GB" --fetcher_stall_timeout="1mins" --frameworks_home="" --gc_delay="1weeks"
--gc_disk_headroom="0.1" --help="false" --hostname_lookup="true" --http_command_executor="false"
--http_credentials="/tmp/Endpoint_SlaveEndpointTest_NoAuthorizer_1_3mP4tg/http_credentials"
--http_heartbeat_interval="30secs" --initialize_driver_logging="true" --isolation="posix/cpu,posix/mem"
--launcher="posix" --launcher_dir="/tmp/SRC/build/mesos-1.7.0/_build/sub/src" --logbufsecs="0"
--logging_level="INFO" --max_completed_executors_per_framework="150" --memory_profiling="false"
--oversubscribed_resources_interval="15secs" --perf_duration="10secs" --perf_interval="1mins"
--port="5051" --qos_correction_interval_min="0ns" --quiet="false" --reconfiguration_policy="equal"
--recover="reconnect" --recovery_timeout="15mins" --registration_backoff_factor="10ms" --resources="cpus:2;gpus:0;mem:1024;disk:1024;ports:[31000-32000]"
--revocable_cpu_low_priority="true" --runtime_dir="/tmp/Endpoint_SlaveEndpointTest_NoAuthorizer_1_3mP4tg"
--sandbox_directory="/mnt/mesos/sandbox" --strict="true" --switch_user="true" --systemd_enable_support="true"
--systemd_runtime_directory="/run/systemd/system" --version="false" --work_dir="/tmp/Endpoint_SlaveEndpointTest_NoAuthorizer_1_wr4Ovo"
--zk_session_timeout="10secs"
I0724 00:59:35.215696 18128 credentials.hpp:86] Loading credential for authentication from
'/tmp/Endpoint_SlaveEndpointTest_NoAuthorizer_1_3mP4tg/credential'
I0724 00:59:35.216112 18128 slave.cpp:301] Agent using credential for: test-principal
I0724 00:59:35.216163 18128 credentials.hpp:37] Loading credentials for authentication from
'/tmp/Endpoint_SlaveEndpointTest_NoAuthorizer_1_3mP4tg/http_credentials'
I0724 00:59:35.216653 18128 http.cpp:959] Creating default 'basic' HTTP authenticator for
realm 'mesos-agent-readonly'
I0724 00:59:35.217176 18128 disk_profile_adaptor.cpp:80] Creating default disk profile adaptor
module
I0724 00:59:35.218545 18128 slave.cpp:616] Agent resources: [{"name":"cpus","scalar":{"value":2.0},"type":"SCALAR"},{"name":"mem","scalar":{"value":1024.0},"type":"SCALAR"},{"name":"disk","scalar":{"value":1024.0},"type":"SCALAR"},{"name":"ports","ranges":{"range":[{"begin":31000,"end":32000}]},"type":"RANGES"}]
I0724 00:59:35.220835 18128 slave.cpp:624] Agent attributes: [  ]
I0724 00:59:35.221009 18128 slave.cpp:633] Agent hostname: 8ede208b7797
I0724 00:59:35.221912 18132 task_status_update_manager.cpp:181] Pausing sending task status
updates
I0724 00:59:35.227844 18128 state.cpp:66] Recovering state from '/tmp/Endpoint_SlaveEndpointTest_NoAuthorizer_1_wr4Ovo/meta'
I0724 00:59:35.228314 18132 slave.cpp:6927] Finished recovering checkpointed state from '/tmp/Endpoint_SlaveEndpointTest_NoAuthorizer_1_wr4Ovo/meta',
beginning agent recovery
I0724 00:59:35.228663 18129 task_status_update_manager.cpp:207] Recovering task status update
manager
I0724 00:59:35.229101 18130 containerizer.cpp:718] Recovering Mesos containers
I0724 00:59:35.229472 18130 containerizer.cpp:1025] Recovering isolators
I0724 00:59:35.234335 18132 containerizer.cpp:1064] Recovering provisioner
I0724 00:59:35.235239 18135 provisioner.cpp:494] Provisioner recovery complete
I0724 00:59:35.236078 18131 composing.cpp:339] Finished recovering all containerizers
I0724 00:59:35.236361 18133 slave.cpp:7156] Recovering executors
I0724 00:59:35.236676 18133 slave.cpp:7309] Finished recovery
I0724 00:59:35.244240 18132 process.cpp:3569] Handling HTTP event for process 'slave(1014)'
with path: '/slave(1014)/monitor/statistics.json'
I0724 00:59:35.246392 18131 http.cpp:1099] HTTP GET for /slave(1014)/monitor/statistics.json
from 172.17.0.2:46328
I0724 00:59:35.246615 18131 http.cpp:936] Authorizing principal 'test-principal' to GET the
'/monitor/statistics.json' endpoint
I0724 00:59:35.250495 18135 slave.cpp:931] Agent terminating
[       OK ] Endpoint/SlaveEndpointTest.NoAuthorizer/1 (101 ms)
[ RUN      ] Endpoint/SlaveEndpointTest.NoAuthorizer/2
I0724 00:59:35.305882 18127 containerizer.cpp:300] Using isolation { environment_secret, posix/cpu,
posix/mem, filesystem/posix, network/cni }
W0724 00:59:35.307392 18127 backend.cpp:76] Failed to create 'aufs' backend: AufsBackend requires
root privileges
W0724 00:59:35.307428 18127 backend.cpp:76] Failed to create 'bind' backend: BindBackend requires
root privileges
I0724 00:59:35.310151 18127 provisioner.cpp:298] Using default backend 'copy'
I0724 00:59:35.312345 18127 cluster.cpp:479] Creating default 'local' authorizer
I0724 00:59:35.314486 18129 slave.cpp:268] Mesos agent started on (1015)@172.17.0.2:42126
I0724 00:59:35.314513 18129 slave.cpp:269] Flags at startup: --acls="" --appc_simple_discovery_uri_prefix="http://"
--appc_store_dir="/tmp/Endpoint_SlaveEndpointTest_NoAuthorizer_2_BzQCdL/store/appc" --authenticate_http_readonly="true"
--authenticate_http_readwrite="false" --authenticatee="crammd5" --authentication_backoff_factor="1secs"
--authorizer="local" --cgroups_cpu_enable_pids_and_tids_count="false" --cgroups_enable_cfs="false"
--cgroups_hierarchy="/sys/fs/cgroup" --cgroups_limit_swap="false" --cgroups_root="mesos" --container_disk_watch_interval="15secs"
--containerizers="mesos" --credential="/tmp/Endpoint_SlaveEndpointTest_NoAuthorizer_2_BzQCdL/credential"
--default_role="*" --disallow_sharing_agent_pid_namespace="false" --disk_watch_interval="1mins"
--docker="docker" --docker_kill_orphans="true" --docker_registry="https://registry-1.docker.io"
--docker_remove_delay="6hrs" --docker_socket="/var/run/docker.sock" --docker_stop_timeout="0ns"
--docker_store_dir="/tmp/Endpoint_SlaveEndpointTest_NoAuthorizer_2_BzQCdL/store/docker" --docker_volume_checkpoint_dir="/var/run/mesos/isolators/docker/volume"
--enforce_container_disk_quota="false" --executor_registration_timeout="1mins" --executor_reregistration_timeout="2secs"
--executor_shutdown_grace_period="5secs" --fetcher_cache_dir="/tmp/Endpoint_SlaveEndpointTest_NoAuthorizer_2_BzQCdL/fetch"
--fetcher_cache_size="2GB" --fetcher_stall_timeout="1mins" --frameworks_home="" --gc_delay="1weeks"
--gc_disk_headroom="0.1" --help="false" --hostname_lookup="true" --http_command_executor="false"
--http_credentials="/tmp/Endpoint_SlaveEndpointTest_NoAuthorizer_2_BzQCdL/http_credentials"
--http_heartbeat_interval="30secs" --initialize_driver_logging="true" --isolation="posix/cpu,posix/mem"
--launcher="posix" --launcher_dir="/tmp/SRC/build/mesos-1.7.0/_build/sub/src" --logbufsecs="0"
--logging_level="INFO" --max_completed_executors_per_framework="150" --memory_profiling="false"
--oversubscribed_resources_interval="15secs" --perf_duration="10secs" --perf_interval="1mins"
--port="5051" --qos_correction_interval_min="0ns" --quiet="false" --reconfiguration_policy="equal"
--recover="reconnect" --recovery_timeout="15mins" --registration_backoff_factor="10ms" --resources="cpus:2;gpus:0;mem:1024;disk:1024;ports:[31000-32000]"
--revocable_cpu_low_priority="true" --runtime_dir="/tmp/Endpoint_SlaveEndpointTest_NoAuthorizer_2_BzQCdL"
--sandbox_directory="/mnt/mesos/sandbox" --strict="true" --switch_user="true" --systemd_enable_support="true"
--systemd_runtime_directory="/run/systemd/system" --version="false" --work_dir="/tmp/Endpoint_SlaveEndpointTest_NoAuthorizer_2_A7ACZS"
--zk_session_timeout="10secs"
I0724 00:59:35.315040 18129 credentials.hpp:86] Loading credential for authentication from
'/tmp/Endpoint_SlaveEndpointTest_NoAuthorizer_2_BzQCdL/credential'
I0724 00:59:35.315291 18129 slave.cpp:301] Agent using credential for: test-principal
I0724 00:59:35.315347 18129 credentials.hpp:37] Loading credentials for authentication from
'/tmp/Endpoint_SlaveEndpointTest_NoAuthorizer_2_BzQCdL/http_credentials'
I0724 00:59:35.315683 18129 http.cpp:959] Creating default 'basic' HTTP authenticator for
realm 'mesos-agent-readonly'
I0724 00:59:35.316195 18129 disk_profile_adaptor.cpp:80] Creating default disk profile adaptor
module
I0724 00:59:35.317338 18129 slave.cpp:616] Agent resources: [{"name":"cpus","scalar":{"value":2.0},"type":"SCALAR"},{"name":"mem","scalar":{"value":1024.0},"type":"SCALAR"},{"name":"disk","scalar":{"value":1024.0},"type":"SCALAR"},{"name":"ports","ranges":{"range":[{"begin":31000,"end":32000}]},"type":"RANGES"}]
I0724 00:59:35.319489 18129 slave.cpp:624] Agent attributes: [  ]
I0724 00:59:35.319525 18129 slave.cpp:633] Agent hostname: 8ede208b7797
I0724 00:59:35.319852 18134 task_status_update_manager.cpp:181] Pausing sending task status
updates
I0724 00:59:35.321555 18130 state.cpp:66] Recovering state from '/tmp/Endpoint_SlaveEndpointTest_NoAuthorizer_2_A7ACZS/meta'
I0724 00:59:35.321985 18130 slave.cpp:6927] Finished recovering checkpointed state from '/tmp/Endpoint_SlaveEndpointTest_NoAuthorizer_2_A7ACZS/meta',
beginning agent recovery
I0724 00:59:35.322266 18134 task_status_update_manager.cpp:207] Recovering task status update
manager
I0724 00:59:35.322846 18135 containerizer.cpp:718] Recovering Mesos containers
I0724 00:59:35.323249 18135 containerizer.cpp:1025] Recovering isolators
I0724 00:59:35.324096 18134 containerizer.cpp:1064] Recovering provisioner
I0724 00:59:35.324833 18135 provisioner.cpp:494] Provisioner recovery complete
I0724 00:59:35.325873 18132 composing.cpp:339] Finished recovering all containerizers
I0724 00:59:35.326282 18135 slave.cpp:7156] Recovering executors
I0724 00:59:35.326501 18135 slave.cpp:7309] Finished recovery
I0724 00:59:35.330970 18130 process.cpp:3569] Handling HTTP event for process 'slave(1015)'
with path: '/slave(1015)/containers'
I0724 00:59:35.332967 18135 http.cpp:1099] HTTP GET for /slave(1015)/containers from 172.17.0.2:46334
I0724 00:59:35.333128 18135 http.cpp:936] Authorizing principal 'test-principal' to GET the
'/containers' endpoint
I0724 00:59:35.338623 18134 slave.cpp:931] Agent terminating
[       OK ] Endpoint/SlaveEndpointTest.NoAuthorizer/2 (72 ms)
[----------] 9 tests from Endpoint/SlaveEndpointTest (798 ms total)

[----------] 2 tests from ContainerizerType/DefaultContainerDNSFlagTest
[ RUN      ] ContainerizerType/DefaultContainerDNSFlagTest.ValidateFlag/0
[       OK ] ContainerizerType/DefaultContainerDNSFlagTest.ValidateFlag/0 (14 ms)
[ RUN      ] ContainerizerType/DefaultContainerDNSFlagTest.ValidateFlag/1
[       OK ] ContainerizerType/DefaultContainerDNSFlagTest.ValidateFlag/1 (8 ms)
[----------] 2 tests from ContainerizerType/DefaultContainerDNSFlagTest (22 ms total)

[----------] Global test environment tear-down
[==========] 1974 tests from 201 test cases ran. (824325 ms total)
[  PASSED  ] 1973 tests.
[  FAILED  ] 1 test, listed below:
[  FAILED  ] PersistentVolumeEndpointsTest.EndpointCreateThenOfferRemove

 1 FAILED TEST
  YOU HAVE 21 DISABLED TESTS

I0724 00:59:35.433717 18136 process.cpp:926] Stopped the socket accept loop
Makefile:14821: recipe for target 'check-local' failed
make[4]: *** [check-local] Error 1
make[4]: Leaving directory '/tmp/SRC/build/mesos-1.7.0/_build/sub/src'
Makefile:13931: recipe for target 'check-am' failed
make[3]: *** [check-am] Error 2
make[3]: Leaving directory '/tmp/SRC/build/mesos-1.7.0/_build/sub/src'
Makefile:13935: recipe for target 'check' failed
make[2]: *** [check] Error 2
make[2]: Leaving directory '/tmp/SRC/build/mesos-1.7.0/_build/sub/src'
Makefile:776: recipe for target 'check-recursive' failed
make[1]: *** [check-recursive] Error 1
make[1]: Leaving directory '/tmp/SRC/build/mesos-1.7.0/_build/sub'
Makefile:982: recipe for target 'distcheck' failed
make: *** [distcheck] Error 1
Untagged: mesos/mesos-build:ubuntu-16.04
Untagged: mesos/mesos-build@sha256:8685ea3c3e17663e4a1764d08df701102b4e9286c6c1a7116afccbe382777290
Deleted: sha256:4ecb5a128921ae9aad805a57a0e4d24dbcfbe84b09304997c7e2798819aa155a
Deleted: sha256:91a3c8a13a99414ff67baa2d1c6a6a82b43c237327a78d7f815414e155578ac1
Deleted: sha256:d05373b7ffe6961840e0962d4b16df22a14b1bbba3416f5aee58b579f08a2bcd
Deleted: sha256:db96690681268d3c4fdd48cd5edc2ca128c6b2493c67333983b63119622cc485
Deleted: sha256:70f40beaddd4e8dc15479d4f78d75b121fd4428c7bb29319a0fae0babd257e37
Deleted: sha256:77e6ddba346d8ad1e436256f6373dede5af4002006981b7d4116c561c759cefa
Deleted: sha256:8db758ab2fdb54da0aec53aeac876934337e6170f5a8c8872b3d4171e3d465b7
Deleted: sha256:a7fc6b405fe8ef71edfa6163d1dc9f1cb1df426049eefaa7d388e9df21a061ad
Deleted: sha256:5a3e35538f7f2e2727c8ac92f08c30002b9e8a77737de0dab91244344d59f69b
Deleted: sha256:ff986b10a018b48074e6d3a68b39aad8ccc002cdad912d4148c0f92b3729323e
Error response from daemon: conflict: unable to delete e804ecae6ec0 (cannot be forced) - image
is being used by running container 624588c85729
Build step 'Execute shell' marked build as failure

Mime
View raw message