mesos-builds mailing list archives

Site index · List index
Message view « Date » · « Thread »
Top « Date » · « Thread »
From Apache Jenkins Server <jenk...@builds.apache.org>
Subject Build failed in Jenkins: Mesos-Tidybot » -DENABLE_LIBEVENT=OFF -DENABLE_SSL=OFF,(docker||Hadoop)&&(!ubuntu-us1)&&(!ubuntu-eu2) #1365
Date Thu, 26 Jul 2018 21:22:16 GMT
See <https://builds.apache.org/job/Mesos-Tidybot/CMAKE_ARGS=-DENABLE_LIBEVENT=OFF%20-DENABLE_SSL=OFF,label_exp=(docker%7C%7CHadoop)&&(!ubuntu-us1)&&(!ubuntu-eu2)/1365/display/redirect?page=changes>

Changes:

[chhsiao] Updated documentation for `CREATE_DISK` and `DESTROY_DISK`.

------------------------------------------
[...truncated 315.20 KB...]
[ 71%] Building C object libarchive/CMakeFiles/archive_static.dir/archive_write_add_filter_compress.c.o
[ 71%] Building C object libarchive/CMakeFiles/archive.dir/archive_write_set_format.c.o
[ 72%] Building C object libarchive/CMakeFiles/archive_static.dir/archive_write_add_filter_grzip.c.o
[ 73%] Building C object libarchive/CMakeFiles/archive.dir/archive_write_set_format_7zip.c.o
[ 73%] Building C object libarchive/CMakeFiles/archive_static.dir/archive_write_add_filter_gzip.c.o
[ 73%] Building C object libarchive/CMakeFiles/archive.dir/archive_write_set_format_ar.c.o
[ 73%] Building C object libarchive/CMakeFiles/archive_static.dir/archive_write_add_filter_lrzip.c.o
[ 74%] Building C object libarchive/CMakeFiles/archive_static.dir/archive_write_add_filter_lz4.c.o
[ 74%] Building C object libarchive/CMakeFiles/archive_static.dir/archive_write_add_filter_lzop.c.o
[ 75%] Building C object libarchive/CMakeFiles/archive_static.dir/archive_write_add_filter_none.c.o
[ 75%] Building C object libarchive/CMakeFiles/archive_static.dir/archive_write_add_filter_program.c.o
[ 76%] Building C object libarchive/CMakeFiles/archive.dir/archive_write_set_format_by_name.c.o
[ 76%] Building C object libarchive/CMakeFiles/archive_static.dir/archive_write_add_filter_uuencode.c.o
[ 76%] Building C object libarchive/CMakeFiles/archive.dir/archive_write_set_format_cpio.c.o
[ 76%] Building C object libarchive/CMakeFiles/archive.dir/archive_write_set_format_cpio_newc.c.o
[ 77%] Building C object libarchive/CMakeFiles/archive_static.dir/archive_write_add_filter_xz.c.o
[ 78%] Building C object libarchive/CMakeFiles/archive.dir/archive_write_set_format_filter_by_ext.c.o
[ 78%] Building C object libarchive/CMakeFiles/archive.dir/archive_write_set_format_gnutar.c.o
[ 78%] Building C object libarchive/CMakeFiles/archive_static.dir/archive_write_set_format.c.o
[ 79%] Building C object libarchive/CMakeFiles/archive_static.dir/archive_write_set_format_7zip.c.o
[ 79%] Building C object libarchive/CMakeFiles/archive_static.dir/archive_write_set_format_ar.c.o
[ 80%] Building C object libarchive/CMakeFiles/archive_static.dir/archive_write_set_format_by_name.c.o
[ 81%] Building C object libarchive/CMakeFiles/archive.dir/archive_write_set_format_iso9660.c.o
[ 81%] Building C object libarchive/CMakeFiles/archive.dir/archive_write_set_format_mtree.c.o
[ 81%] Building C object libarchive/CMakeFiles/archive.dir/archive_write_set_format_pax.c.o
[ 81%] Building C object libarchive/CMakeFiles/archive_static.dir/archive_write_set_format_cpio.c.o
[ 81%] Building C object libarchive/CMakeFiles/archive_static.dir/archive_write_set_format_cpio_newc.c.o
[ 82%] Building C object libarchive/CMakeFiles/archive.dir/archive_write_set_format_raw.c.o
[ 83%] Building C object libarchive/CMakeFiles/archive_static.dir/archive_write_set_format_filter_by_ext.c.o
[ 83%] Building C object libarchive/CMakeFiles/archive.dir/archive_write_set_format_shar.c.o
[ 84%] Building C object libarchive/CMakeFiles/archive.dir/archive_write_set_format_ustar.c.o
[ 84%] Building C object libarchive/CMakeFiles/archive.dir/archive_write_set_format_v7tar.c.o
[ 84%] Building C object libarchive/CMakeFiles/archive_static.dir/archive_write_set_format_gnutar.c.o
[ 85%] Building C object libarchive/CMakeFiles/archive.dir/archive_write_set_format_warc.c.o
[ 85%] Building C object libarchive/CMakeFiles/archive.dir/archive_write_set_format_xar.c.o
[ 85%] Building C object libarchive/CMakeFiles/archive.dir/archive_write_set_format_zip.c.o
[ 86%] Building C object libarchive/CMakeFiles/archive_static.dir/archive_write_set_format_iso9660.c.o
[ 87%] Building C object libarchive/CMakeFiles/archive.dir/archive_write_set_options.c.o
[ 87%] Building C object libarchive/CMakeFiles/archive_static.dir/archive_write_set_format_mtree.c.o
[ 87%] Building C object libarchive/CMakeFiles/archive_static.dir/archive_write_set_format_pax.c.o
[ 88%] Building C object libarchive/CMakeFiles/archive_static.dir/archive_write_set_format_raw.c.o
[ 88%] Building C object libarchive/CMakeFiles/archive.dir/archive_write_set_passphrase.c.o
[ 89%] Building C object libarchive/CMakeFiles/archive.dir/filter_fork_posix.c.o
[ 89%] Building C object libarchive/CMakeFiles/archive.dir/xxhash.c.o
[ 89%] Building C object libarchive/CMakeFiles/archive_static.dir/archive_write_set_format_shar.c.o
[ 90%] Building C object libarchive/CMakeFiles/archive_static.dir/archive_write_set_format_ustar.c.o
[ 90%] Building C object libarchive/CMakeFiles/archive_static.dir/archive_write_set_format_v7tar.c.o
[ 90%] Building C object libarchive/CMakeFiles/archive_static.dir/archive_write_set_format_warc.c.o
[ 91%] Building C object libarchive/CMakeFiles/archive_static.dir/archive_write_set_format_xar.c.o
[ 91%] Building C object libarchive/CMakeFiles/archive_static.dir/archive_write_set_format_zip.c.o
[ 92%] Building C object libarchive/CMakeFiles/archive_static.dir/archive_write_set_options.c.o
[ 92%] Building C object libarchive/CMakeFiles/archive_static.dir/archive_write_set_passphrase.c.o
[ 93%] Building C object libarchive/CMakeFiles/archive_static.dir/filter_fork_posix.c.o
[ 93%] Building C object libarchive/CMakeFiles/archive_static.dir/xxhash.c.o
[ 93%] Linking C shared library libarchive.so
make[6]: Leaving directory '/BUILD/3rdparty/libarchive-3.3.2/src/libarchive-3.3.2-build'
[ 93%] Built target archive
[ 93%] Linking C static library libarchive.a
make[6]: Leaving directory '/BUILD/3rdparty/libarchive-3.3.2/src/libarchive-3.3.2-build'
[ 93%] Built target archive_static
make[6]: Entering directory '/BUILD/3rdparty/libarchive-3.3.2/src/libarchive-3.3.2-build'
make[6]: Entering directory '/BUILD/3rdparty/libarchive-3.3.2/src/libarchive-3.3.2-build'
Scanning dependencies of target bsdcat
make[6]: Leaving directory '/BUILD/3rdparty/libarchive-3.3.2/src/libarchive-3.3.2-build'
make[6]: Entering directory '/BUILD/3rdparty/libarchive-3.3.2/src/libarchive-3.3.2-build'
[ 94%] Building C object cat/CMakeFiles/bsdcat.dir/bsdcat.c.o
[ 95%] Building C object cat/CMakeFiles/bsdcat.dir/cmdline.c.o
Scanning dependencies of target bsdtar
[ 95%] Building C object cat/CMakeFiles/bsdcat.dir/__/libarchive_fe/err.c.o
make[6]: Leaving directory '/BUILD/3rdparty/libarchive-3.3.2/src/libarchive-3.3.2-build'
make[6]: Entering directory '/BUILD/3rdparty/libarchive-3.3.2/src/libarchive-3.3.2-build'
[ 95%] Building C object tar/CMakeFiles/bsdtar.dir/bsdtar.c.o
[ 95%] Building C object tar/CMakeFiles/bsdtar.dir/creation_set.c.o
[ 95%] Building C object tar/CMakeFiles/bsdtar.dir/subst.c.o
[ 96%] Building C object tar/CMakeFiles/bsdtar.dir/util.c.o
[ 96%] Building C object tar/CMakeFiles/bsdtar.dir/__/libarchive_fe/line_reader.c.o
[ 97%] Building C object tar/CMakeFiles/bsdtar.dir/write.c.o
[ 98%] Building C object tar/CMakeFiles/bsdtar.dir/cmdline.c.o
[ 98%] Building C object tar/CMakeFiles/bsdtar.dir/__/libarchive_fe/passphrase.c.o
[ 98%] Building C object tar/CMakeFiles/bsdtar.dir/__/libarchive_fe/err.c.o
[ 99%] Building C object tar/CMakeFiles/bsdtar.dir/read.c.o
[ 99%] Linking C executable ../bin/bsdcat
make[6]: Leaving directory '/BUILD/3rdparty/libarchive-3.3.2/src/libarchive-3.3.2-build'
[ 99%] Built target bsdcat
[100%] Linking C executable ../bin/bsdtar
make[6]: Leaving directory '/BUILD/3rdparty/libarchive-3.3.2/src/libarchive-3.3.2-build'
[100%] Built target bsdtar
make[5]: Leaving directory '/BUILD/3rdparty/libarchive-3.3.2/src/libarchive-3.3.2-build'
make[4]: Leaving directory '/BUILD/3rdparty/libarchive-3.3.2/src/libarchive-3.3.2-build'
cd /BUILD/3rdparty/libarchive-3.3.2/src/libarchive-3.3.2-build && /usr/local/bin/cmake
-E touch /BUILD/3rdparty/libarchive-3.3.2/src/libarchive-3.3.2-stamp/libarchive-3.3.2-build
[ 57%] Performing install step for 'libarchive-3.3.2'
cd /BUILD/3rdparty/libarchive-3.3.2/src/libarchive-3.3.2-build && /usr/bin/make install
make[4]: Entering directory '/BUILD/3rdparty/libarchive-3.3.2/src/libarchive-3.3.2-build'
make[5]: Entering directory '/BUILD/3rdparty/libarchive-3.3.2/src/libarchive-3.3.2-build'
make[6]: Entering directory '/BUILD/3rdparty/libarchive-3.3.2/src/libarchive-3.3.2-build'
make[6]: Entering directory '/BUILD/3rdparty/libarchive-3.3.2/src/libarchive-3.3.2-build'
make[6]: Leaving directory '/BUILD/3rdparty/libarchive-3.3.2/src/libarchive-3.3.2-build'
make[6]: Leaving directory '/BUILD/3rdparty/libarchive-3.3.2/src/libarchive-3.3.2-build'
[ 81%] Built target archive
[ 93%] Built target archive_static
make[6]: Entering directory '/BUILD/3rdparty/libarchive-3.3.2/src/libarchive-3.3.2-build'
make[6]: Entering directory '/BUILD/3rdparty/libarchive-3.3.2/src/libarchive-3.3.2-build'
make[6]: Leaving directory '/BUILD/3rdparty/libarchive-3.3.2/src/libarchive-3.3.2-build'
make[6]: Leaving directory '/BUILD/3rdparty/libarchive-3.3.2/src/libarchive-3.3.2-build'
[ 95%] Built target bsdcat
[100%] Built target bsdtar
make[5]: Leaving directory '/BUILD/3rdparty/libarchive-3.3.2/src/libarchive-3.3.2-build'
Install the project...
-- Install configuration: "Release"
-- Installing: /BUILD/3rdparty/libarchive-3.3.2/src/libarchive-3.3.2-build/lib/pkgconfig/libarchive.pc
-- Installing: /BUILD/3rdparty/libarchive-3.3.2/src/libarchive-3.3.2-build/lib/libarchive.so.16
-- Installing: /BUILD/3rdparty/libarchive-3.3.2/src/libarchive-3.3.2-build/lib/libarchive.so
-- Installing: /BUILD/3rdparty/libarchive-3.3.2/src/libarchive-3.3.2-build/lib/libarchive.a
-- Installing: /BUILD/3rdparty/libarchive-3.3.2/src/libarchive-3.3.2-build/share/man/man3/archive_entry.3
-- Installing: /BUILD/3rdparty/libarchive-3.3.2/src/libarchive-3.3.2-build/share/man/man3/archive_entry_acl.3
-- Installing: /BUILD/3rdparty/libarchive-3.3.2/src/libarchive-3.3.2-build/share/man/man3/archive_entry_linkify.3
-- Installing: /BUILD/3rdparty/libarchive-3.3.2/src/libarchive-3.3.2-build/share/man/man3/archive_entry_paths.3
-- Installing: /BUILD/3rdparty/libarchive-3.3.2/src/libarchive-3.3.2-build/share/man/man3/archive_entry_perms.3
-- Installing: /BUILD/3rdparty/libarchive-3.3.2/src/libarchive-3.3.2-build/share/man/man3/archive_entry_stat.3
-- Installing: /BUILD/3rdparty/libarchive-3.3.2/src/libarchive-3.3.2-build/share/man/man3/archive_entry_time.3
-- Installing: /BUILD/3rdparty/libarchive-3.3.2/src/libarchive-3.3.2-build/share/man/man3/archive_read.3
-- Installing: /BUILD/3rdparty/libarchive-3.3.2/src/libarchive-3.3.2-build/share/man/man3/archive_read_add_passphrase.3
-- Installing: /BUILD/3rdparty/libarchive-3.3.2/src/libarchive-3.3.2-build/share/man/man3/archive_read_data.3
-- Installing: /BUILD/3rdparty/libarchive-3.3.2/src/libarchive-3.3.2-build/share/man/man3/archive_read_disk.3
-- Installing: /BUILD/3rdparty/libarchive-3.3.2/src/libarchive-3.3.2-build/share/man/man3/archive_read_extract.3
-- Installing: /BUILD/3rdparty/libarchive-3.3.2/src/libarchive-3.3.2-build/share/man/man3/archive_read_filter.3
-- Installing: /BUILD/3rdparty/libarchive-3.3.2/src/libarchive-3.3.2-build/share/man/man3/archive_read_format.3
-- Installing: /BUILD/3rdparty/libarchive-3.3.2/src/libarchive-3.3.2-build/share/man/man3/archive_read_free.3
-- Installing: /BUILD/3rdparty/libarchive-3.3.2/src/libarchive-3.3.2-build/share/man/man3/archive_read_header.3
-- Installing: /BUILD/3rdparty/libarchive-3.3.2/src/libarchive-3.3.2-build/share/man/man3/archive_read_new.3
-- Installing: /BUILD/3rdparty/libarchive-3.3.2/src/libarchive-3.3.2-build/share/man/man3/archive_read_open.3
-- Installing: /BUILD/3rdparty/libarchive-3.3.2/src/libarchive-3.3.2-build/share/man/man3/archive_read_set_options.3
-- Installing: /BUILD/3rdparty/libarchive-3.3.2/src/libarchive-3.3.2-build/share/man/man3/archive_util.3
-- Installing: /BUILD/3rdparty/libarchive-3.3.2/src/libarchive-3.3.2-build/share/man/man3/archive_write.3
-- Installing: /BUILD/3rdparty/libarchive-3.3.2/src/libarchive-3.3.2-build/share/man/man3/archive_write_blocksize.3
-- Installing: /BUILD/3rdparty/libarchive-3.3.2/src/libarchive-3.3.2-build/share/man/man3/archive_write_data.3
-- Installing: /BUILD/3rdparty/libarchive-3.3.2/src/libarchive-3.3.2-build/share/man/man3/archive_write_disk.3
-- Installing: /BUILD/3rdparty/libarchive-3.3.2/src/libarchive-3.3.2-build/share/man/man3/archive_write_filter.3
-- Installing: /BUILD/3rdparty/libarchive-3.3.2/src/libarchive-3.3.2-build/share/man/man3/archive_write_finish_entry.3
-- Installing: /BUILD/3rdparty/libarchive-3.3.2/src/libarchive-3.3.2-build/share/man/man3/archive_write_format.3
-- Installing: /BUILD/3rdparty/libarchive-3.3.2/src/libarchive-3.3.2-build/share/man/man3/archive_write_free.3
-- Installing: /BUILD/3rdparty/libarchive-3.3.2/src/libarchive-3.3.2-build/share/man/man3/archive_write_header.3
-- Installing: /BUILD/3rdparty/libarchive-3.3.2/src/libarchive-3.3.2-build/share/man/man3/archive_write_new.3
-- Installing: /BUILD/3rdparty/libarchive-3.3.2/src/libarchive-3.3.2-build/share/man/man3/archive_write_open.3
-- Installing: /BUILD/3rdparty/libarchive-3.3.2/src/libarchive-3.3.2-build/share/man/man3/archive_write_set_options.3
-- Installing: /BUILD/3rdparty/libarchive-3.3.2/src/libarchive-3.3.2-build/share/man/man3/archive_write_set_passphrase.3
-- Installing: /BUILD/3rdparty/libarchive-3.3.2/src/libarchive-3.3.2-build/share/man/man5/cpio.5
-- Installing: /BUILD/3rdparty/libarchive-3.3.2/src/libarchive-3.3.2-build/share/man/man3/libarchive.3
-- Installing: /BUILD/3rdparty/libarchive-3.3.2/src/libarchive-3.3.2-build/share/man/man3/libarchive_changes.3
-- Installing: /BUILD/3rdparty/libarchive-3.3.2/src/libarchive-3.3.2-build/share/man/man3/libarchive_internals.3
-- Installing: /BUILD/3rdparty/libarchive-3.3.2/src/libarchive-3.3.2-build/share/man/man5/libarchive-formats.5
-- Installing: /BUILD/3rdparty/libarchive-3.3.2/src/libarchive-3.3.2-build/share/man/man5/mtree.5
-- Installing: /BUILD/3rdparty/libarchive-3.3.2/src/libarchive-3.3.2-build/share/man/man5/tar.5
-- Installing: /BUILD/3rdparty/libarchive-3.3.2/src/libarchive-3.3.2-build/include/archive.h
-- Installing: /BUILD/3rdparty/libarchive-3.3.2/src/libarchive-3.3.2-build/include/archive_entry.h
-- Installing: /BUILD/3rdparty/libarchive-3.3.2/src/libarchive-3.3.2-build/share/man/man1/bsdcat.1
-- Installing: /BUILD/3rdparty/libarchive-3.3.2/src/libarchive-3.3.2-build/share/man/man1/bsdtar.1
make[4]: Leaving directory '/BUILD/3rdparty/libarchive-3.3.2/src/libarchive-3.3.2-build'
cd /BUILD/3rdparty/libarchive-3.3.2/src/libarchive-3.3.2-build && /usr/local/bin/cmake
-E touch /BUILD/3rdparty/libarchive-3.3.2/src/libarchive-3.3.2-stamp/libarchive-3.3.2-install
[ 57%] Completed 'libarchive-3.3.2'
cd /BUILD/3rdparty && /usr/local/bin/cmake -E make_directory /BUILD/3rdparty/CMakeFiles
cd /BUILD/3rdparty && /usr/local/bin/cmake -E touch /BUILD/3rdparty/CMakeFiles/libarchive-3.3.2-complete
cd /BUILD/3rdparty && /usr/local/bin/cmake -E touch /BUILD/3rdparty/libarchive-3.3.2/src/libarchive-3.3.2-stamp/libarchive-3.3.2-done
make[3]: Leaving directory '/BUILD'
[ 57%] Built target libarchive-3.3.2
/usr/bin/make -f 3rdparty/stout/tests/CMakeFiles/stout-tests.dir/build.make 3rdparty/stout/tests/CMakeFiles/stout-tests.dir/depend
make[3]: Entering directory '/BUILD'
[ 57%] Generating protobuf_tests.pb.h, protobuf_tests.pb.cc
cd /BUILD/3rdparty/stout/tests && ../../protobuf-3.5.0/src/protobuf-3.5.0-build/protoc
-I/tmp/SRC/3rdparty/stout/tests --cpp_out=/BUILD/3rdparty/stout/tests /tmp/SRC/3rdparty/stout/tests/protobuf_tests.proto
cd /BUILD && /usr/local/bin/cmake -E cmake_depends "Unix Makefiles" /tmp/SRC /tmp/SRC/3rdparty/stout/tests
/BUILD /BUILD/3rdparty/stout/tests /BUILD/3rdparty/stout/tests/CMakeFiles/stout-tests.dir/DependInfo.cmake
--color=
Scanning dependencies of target stout-tests
make[3]: Leaving directory '/BUILD'
/usr/bin/make -f 3rdparty/stout/tests/CMakeFiles/stout-tests.dir/build.make 3rdparty/stout/tests/CMakeFiles/stout-tests.dir/build
make[3]: Entering directory '/BUILD'
[ 57%] Building CXX object 3rdparty/stout/tests/CMakeFiles/stout-tests.dir/adaptor_tests.cpp.o
cd /BUILD/3rdparty/stout/tests && /usr/bin/c++  -DHAVE_LIBZ -DLIBDIR=\"/usr/local/libmesos\"
-DPKGDATADIR=\"/usr/local/share/mesos\" -DPKGLIBEXECDIR=\"/usr/local/libexec/mesos\" -DVERSION=\"1.7.0\"
-D__STDC_FORMAT_MACROS -I/BUILD/3rdparty/stout/tests -I/tmp/SRC/3rdparty/stout/include -isystem
/usr/include/apr-1.0 -I/BUILD/3rdparty/boost-1.65.0/src/boost-1.65.0 -I/BUILD/3rdparty/elfio-3.2/src/elfio-3.2
-isystem /BUILD/3rdparty/glog-0.3.3/src/glog-0.3.3-build/include -isystem /BUILD/3rdparty/libarchive-3.3.2/src/libarchive-3.3.2-build/include
-I/BUILD/3rdparty/picojson-1.3.0/src/picojson-1.3.0 -isystem /BUILD/3rdparty/protobuf-3.5.0/src/protobuf-3.5.0/src
-I/BUILD/3rdparty/rapidjson-1.1.0/src/rapidjson-1.1.0/rapidjson-1.1.0/include -I/usr/include/subversion-1
-isystem /BUILD/3rdparty/googletest-1.8.0/src/googletest-1.8.0/googlemock/include -isystem
/BUILD/3rdparty/googletest-1.8.0/src/googletest-1.8.0/googletest/include  -O3 -DNDEBUG -fPIE
  -Wall -Wsign-compare -Wformat-security -fstack-protector-strong -Wno-unused-local-typedefs
-std=c++11 -o CMakeFiles/stout-tests.dir/adaptor_tests.cpp.o -c /tmp/SRC/3rdparty/stout/tests/adaptor_tests.cpp
[ 57%] Building CXX object 3rdparty/stout/tests/CMakeFiles/stout-tests.dir/archiver_tests.cpp.o
cd /BUILD/3rdparty/stout/tests && /usr/bin/c++  -DHAVE_LIBZ -DLIBDIR=\"/usr/local/libmesos\"
-DPKGDATADIR=\"/usr/local/share/mesos\" -DPKGLIBEXECDIR=\"/usr/local/libexec/mesos\" -DVERSION=\"1.7.0\"
-D__STDC_FORMAT_MACROS -I/BUILD/3rdparty/stout/tests -I/tmp/SRC/3rdparty/stout/include -isystem
/usr/include/apr-1.0 -I/BUILD/3rdparty/boost-1.65.0/src/boost-1.65.0 -I/BUILD/3rdparty/elfio-3.2/src/elfio-3.2
-isystem /BUILD/3rdparty/glog-0.3.3/src/glog-0.3.3-build/include -isystem /BUILD/3rdparty/libarchive-3.3.2/src/libarchive-3.3.2-build/include
-I/BUILD/3rdparty/picojson-1.3.0/src/picojson-1.3.0 -isystem /BUILD/3rdparty/protobuf-3.5.0/src/protobuf-3.5.0/src
-I/BUILD/3rdparty/rapidjson-1.1.0/src/rapidjson-1.1.0/rapidjson-1.1.0/include -I/usr/include/subversion-1
-isystem /BUILD/3rdparty/googletest-1.8.0/src/googletest-1.8.0/googlemock/include -isystem
/BUILD/3rdparty/googletest-1.8.0/src/googletest-1.8.0/googletest/include  -O3 -DNDEBUG -fPIE
  -Wall -Wsign-compare -Wformat-security -fstack-protector-strong -Wno-unused-local-typedefs
-std=c++11 -o CMakeFiles/stout-tests.dir/archiver_tests.cpp.o -c /tmp/SRC/3rdparty/stout/tests/archiver_tests.cpp
[ 57%] Building CXX object 3rdparty/stout/tests/CMakeFiles/stout-tests.dir/bits_tests.cpp.o
[ 57%] Building CXX object 3rdparty/stout/tests/CMakeFiles/stout-tests.dir/base64_tests.cpp.o
[ 57%] Building CXX object 3rdparty/stout/tests/CMakeFiles/stout-tests.dir/boundedhashmap_tests.cpp.o
cd /BUILD/3rdparty/stout/tests && /usr/bin/c++  -DHAVE_LIBZ -DLIBDIR=\"/usr/local/libmesos\"
-DPKGDATADIR=\"/usr/local/share/mesos\" -DPKGLIBEXECDIR=\"/usr/local/libexec/mesos\" -DVERSION=\"1.7.0\"
-D__STDC_FORMAT_MACROS -I/BUILD/3rdparty/stout/tests -I/tmp/SRC/3rdparty/stout/include -isystem
/usr/include/apr-1.0 -I/BUILD/3rdparty/boost-1.65.0/src/boost-1.65.0 -I/BUILD/3rdparty/elfio-3.2/src/elfio-3.2
-isystem /BUILD/3rdparty/glog-0.3.3/src/glog-0.3.3-build/include -isystem /BUILD/3rdparty/libarchive-3.3.2/src/libarchive-3.3.2-build/include
-I/BUILD/3rdparty/picojson-1.3.0/src/picojson-1.3.0 -isystem /BUILD/3rdparty/protobuf-3.5.0/src/protobuf-3.5.0/src
-I/BUILD/3rdparty/rapidjson-1.1.0/src/rapidjson-1.1.0/rapidjson-1.1.0/include -I/usr/include/subversion-1
-isystem /BUILD/3rdparty/googletest-1.8.0/src/googletest-1.8.0/googlemock/include -isystem
/BUILD/3rdparty/googletest-1.8.0/src/googletest-1.8.0/googletest/include  -O3 -DNDEBUG -fPIE
  -Wall -Wsign-compare -Wformat-security -fstack-protector-strong -Wno-unused-local-typedefs
-std=c++11 -o CMakeFiles/stout-tests.dir/base64_tests.cpp.o -c /tmp/SRC/3rdparty/stout/tests/base64_tests.cpp
cd /BUILD/3rdparty/stout/tests && /usr/bin/c++  -DHAVE_LIBZ -DLIBDIR=\"/usr/local/libmesos\"
-DPKGDATADIR=\"/usr/local/share/mesos\" -DPKGLIBEXECDIR=\"/usr/local/libexec/mesos\" -DVERSION=\"1.7.0\"
-D__STDC_FORMAT_MACROS -I/BUILD/3rdparty/stout/tests -I/tmp/SRC/3rdparty/stout/include -isystem
/usr/include/apr-1.0 -I/BUILD/3rdparty/boost-1.65.0/src/boost-1.65.0 -I/BUILD/3rdparty/elfio-3.2/src/elfio-3.2
-isystem /BUILD/3rdparty/glog-0.3.3/src/glog-0.3.3-build/include -isystem /BUILD/3rdparty/libarchive-3.3.2/src/libarchive-3.3.2-build/include
-I/BUILD/3rdparty/picojson-1.3.0/src/picojson-1.3.0 -isystem /BUILD/3rdparty/protobuf-3.5.0/src/protobuf-3.5.0/src
-I/BUILD/3rdparty/rapidjson-1.1.0/src/rapidjson-1.1.0/rapidjson-1.1.0/include -I/usr/include/subversion-1
-isystem /BUILD/3rdparty/googletest-1.8.0/src/googletest-1.8.0/googlemock/include -isystem
/BUILD/3rdparty/googletest-1.8.0/src/googletest-1.8.0/googletest/include  -O3 -DNDEBUG -fPIE
  -Wall -Wsign-compare -Wformat-security -fstack-protector-strong -Wno-unused-local-typedefs
-std=c++11 -o CMakeFiles/stout-tests.dir/bits_tests.cpp.o -c /tmp/SRC/3rdparty/stout/tests/bits_tests.cpp
cd /BUILD/3rdparty/stout/tests && /usr/bin/c++  -DHAVE_LIBZ -DLIBDIR=\"/usr/local/libmesos\"
-DPKGDATADIR=\"/usr/local/share/mesos\" -DPKGLIBEXECDIR=\"/usr/local/libexec/mesos\" -DVERSION=\"1.7.0\"
-D__STDC_FORMAT_MACROS -I/BUILD/3rdparty/stout/tests -I/tmp/SRC/3rdparty/stout/include -isystem
/usr/include/apr-1.0 -I/BUILD/3rdparty/boost-1.65.0/src/boost-1.65.0 -I/BUILD/3rdparty/elfio-3.2/src/elfio-3.2
-isystem /BUILD/3rdparty/glog-0.3.3/src/glog-0.3.3-build/include -isystem /BUILD/3rdparty/libarchive-3.3.2/src/libarchive-3.3.2-build/include
-I/BUILD/3rdparty/picojson-1.3.0/src/picojson-1.3.0 -isystem /BUILD/3rdparty/protobuf-3.5.0/src/protobuf-3.5.0/src
-I/BUILD/3rdparty/rapidjson-1.1.0/src/rapidjson-1.1.0/rapidjson-1.1.0/include -I/usr/include/subversion-1
-isystem /BUILD/3rdparty/googletest-1.8.0/src/googletest-1.8.0/googlemock/include -isystem
/BUILD/3rdparty/googletest-1.8.0/src/googletest-1.8.0/googletest/include  -O3 -DNDEBUG -fPIE
  -Wall -Wsign-compare -Wformat-security -fstack-protector-strong -Wno-unused-local-typedefs
-std=c++11 -o CMakeFiles/stout-tests.dir/boundedhashmap_tests.cpp.o -c /tmp/SRC/3rdparty/stout/tests/boundedhashmap_tests.cpp
[ 57%] Building CXX object 3rdparty/stout/tests/CMakeFiles/stout-tests.dir/bytes_tests.cpp.o
[ 57%] Building CXX object 3rdparty/stout/tests/CMakeFiles/stout-tests.dir/cpp17_tests.cpp.o
[ 64%] Building CXX object 3rdparty/stout/tests/CMakeFiles/stout-tests.dir/cache_tests.cpp.o
cd /BUILD/3rdparty/stout/tests && /usr/bin/c++  -DHAVE_LIBZ -DLIBDIR=\"/usr/local/libmesos\"
-DPKGDATADIR=\"/usr/local/share/mesos\" -DPKGLIBEXECDIR=\"/usr/local/libexec/mesos\" -DVERSION=\"1.7.0\"
-D__STDC_FORMAT_MACROS -I/BUILD/3rdparty/stout/tests -I/tmp/SRC/3rdparty/stout/include -isystem
/usr/include/apr-1.0 -I/BUILD/3rdparty/boost-1.65.0/src/boost-1.65.0 -I/BUILD/3rdparty/elfio-3.2/src/elfio-3.2
-isystem /BUILD/3rdparty/glog-0.3.3/src/glog-0.3.3-build/include -isystem /BUILD/3rdparty/libarchive-3.3.2/src/libarchive-3.3.2-build/include
-I/BUILD/3rdparty/picojson-1.3.0/src/picojson-1.3.0 -isystem /BUILD/3rdparty/protobuf-3.5.0/src/protobuf-3.5.0/src
-I/BUILD/3rdparty/rapidjson-1.1.0/src/rapidjson-1.1.0/rapidjson-1.1.0/include -I/usr/include/subversion-1
-isystem /BUILD/3rdparty/googletest-1.8.0/src/googletest-1.8.0/googlemock/include -isystem
/BUILD/3rdparty/googletest-1.8.0/src/googletest-1.8.0/googletest/include  -O3 -DNDEBUG -fPIE
  -Wall -Wsign-compare -Wformat-security -fstack-protector-strong -Wno-unused-local-typedefs
-std=c++11 -o CMakeFiles/stout-tests.dir/bytes_tests.cpp.o -c /tmp/SRC/3rdparty/stout/tests/bytes_tests.cpp
[ 64%] Building CXX object 3rdparty/stout/tests/CMakeFiles/stout-tests.dir/duration_tests.cpp.o
cd /BUILD/3rdparty/stout/tests && /usr/bin/c++  -DHAVE_LIBZ -DLIBDIR=\"/usr/local/libmesos\"
-DPKGDATADIR=\"/usr/local/share/mesos\" -DPKGLIBEXECDIR=\"/usr/local/libexec/mesos\" -DVERSION=\"1.7.0\"
-D__STDC_FORMAT_MACROS -I/BUILD/3rdparty/stout/tests -I/tmp/SRC/3rdparty/stout/include -isystem
/usr/include/apr-1.0 -I/BUILD/3rdparty/boost-1.65.0/src/boost-1.65.0 -I/BUILD/3rdparty/elfio-3.2/src/elfio-3.2
-isystem /BUILD/3rdparty/glog-0.3.3/src/glog-0.3.3-build/include -isystem /BUILD/3rdparty/libarchive-3.3.2/src/libarchive-3.3.2-build/include
-I/BUILD/3rdparty/picojson-1.3.0/src/picojson-1.3.0 -isystem /BUILD/3rdparty/protobuf-3.5.0/src/protobuf-3.5.0/src
-I/BUILD/3rdparty/rapidjson-1.1.0/src/rapidjson-1.1.0/rapidjson-1.1.0/include -I/usr/include/subversion-1
-isystem /BUILD/3rdparty/googletest-1.8.0/src/googletest-1.8.0/googlemock/include -isystem
/BUILD/3rdparty/googletest-1.8.0/src/googletest-1.8.0/googletest/include  -O3 -DNDEBUG -fPIE
  -Wall -Wsign-compare -Wformat-security -fstack-protector-strong -Wno-unused-local-typedefs
-std=c++11 -o CMakeFiles/stout-tests.dir/cache_tests.cpp.o -c /tmp/SRC/3rdparty/stout/tests/cache_tests.cpp
cd /BUILD/3rdparty/stout/tests && /usr/bin/c++  -DHAVE_LIBZ -DLIBDIR=\"/usr/local/libmesos\"
-DPKGDATADIR=\"/usr/local/share/mesos\" -DPKGLIBEXECDIR=\"/usr/local/libexec/mesos\" -DVERSION=\"1.7.0\"
-D__STDC_FORMAT_MACROS -I/BUILD/3rdparty/stout/tests -I/tmp/SRC/3rdparty/stout/include -isystem
/usr/include/apr-1.0 -I/BUILD/3rdparty/boost-1.65.0/src/boost-1.65.0 -I/BUILD/3rdparty/elfio-3.2/src/elfio-3.2
-isystem /BUILD/3rdparty/glog-0.3.3/src/glog-0.3.3-build/include -isystem /BUILD/3rdparty/libarchive-3.3.2/src/libarchive-3.3.2-build/include
-I/BUILD/3rdparty/picojson-1.3.0/src/picojson-1.3.0 -isystem /BUILD/3rdparty/protobuf-3.5.0/src/protobuf-3.5.0/src
-I/BUILD/3rdparty/rapidjson-1.1.0/src/rapidjson-1.1.0/rapidjson-1.1.0/include -I/usr/include/subversion-1
-isystem /BUILD/3rdparty/googletest-1.8.0/src/googletest-1.8.0/googlemock/include -isystem
/BUILD/3rdparty/googletest-1.8.0/src/googletest-1.8.0/googletest/include  -O3 -DNDEBUG -fPIE
  -Wall -Wsign-compare -Wformat-security -fstack-protector-strong -Wno-unused-local-typedefs
-std=c++11 -o CMakeFiles/stout-tests.dir/cpp17_tests.cpp.o -c /tmp/SRC/3rdparty/stout/tests/cpp17_tests.cpp
cd /BUILD/3rdparty/stout/tests && /usr/bin/c++  -DHAVE_LIBZ -DLIBDIR=\"/usr/local/libmesos\"
-DPKGDATADIR=\"/usr/local/share/mesos\" -DPKGLIBEXECDIR=\"/usr/local/libexec/mesos\" -DVERSION=\"1.7.0\"
-D__STDC_FORMAT_MACROS -I/BUILD/3rdparty/stout/tests -I/tmp/SRC/3rdparty/stout/include -isystem
/usr/include/apr-1.0 -I/BUILD/3rdparty/boost-1.65.0/src/boost-1.65.0 -I/BUILD/3rdparty/elfio-3.2/src/elfio-3.2
-isystem /BUILD/3rdparty/glog-0.3.3/src/glog-0.3.3-build/include -isystem /BUILD/3rdparty/libarchive-3.3.2/src/libarchive-3.3.2-build/include
-I/BUILD/3rdparty/picojson-1.3.0/src/picojson-1.3.0 -isystem /BUILD/3rdparty/protobuf-3.5.0/src/protobuf-3.5.0/src
-I/BUILD/3rdparty/rapidjson-1.1.0/src/rapidjson-1.1.0/rapidjson-1.1.0/include -I/usr/include/subversion-1
-isystem /BUILD/3rdparty/googletest-1.8.0/src/googletest-1.8.0/googlemock/include -isystem
/BUILD/3rdparty/googletest-1.8.0/src/googletest-1.8.0/googletest/include  -O3 -DNDEBUG -fPIE
  -Wall -Wsign-compare -Wformat-security -fstack-protector-strong -Wno-unused-local-typedefs
-std=c++11 -o CMakeFiles/stout-tests.dir/duration_tests.cpp.o -c /tmp/SRC/3rdparty/stout/tests/duration_tests.cpp
[ 64%] Building CXX object 3rdparty/stout/tests/CMakeFiles/stout-tests.dir/error_tests.cpp.o
cd /BUILD/3rdparty/stout/tests && /usr/bin/c++  -DHAVE_LIBZ -DLIBDIR=\"/usr/local/libmesos\"
-DPKGDATADIR=\"/usr/local/share/mesos\" -DPKGLIBEXECDIR=\"/usr/local/libexec/mesos\" -DVERSION=\"1.7.0\"
-D__STDC_FORMAT_MACROS -I/BUILD/3rdparty/stout/tests -I/tmp/SRC/3rdparty/stout/include -isystem
/usr/include/apr-1.0 -I/BUILD/3rdparty/boost-1.65.0/src/boost-1.65.0 -I/BUILD/3rdparty/elfio-3.2/src/elfio-3.2
-isystem /BUILD/3rdparty/glog-0.3.3/src/glog-0.3.3-build/include -isystem /BUILD/3rdparty/libarchive-3.3.2/src/libarchive-3.3.2-build/include
-I/BUILD/3rdparty/picojson-1.3.0/src/picojson-1.3.0 -isystem /BUILD/3rdparty/protobuf-3.5.0/src/protobuf-3.5.0/src
-I/BUILD/3rdparty/rapidjson-1.1.0/src/rapidjson-1.1.0/rapidjson-1.1.0/include -I/usr/include/subversion-1
-isystem /BUILD/3rdparty/googletest-1.8.0/src/googletest-1.8.0/googlemock/include -isystem
/BUILD/3rdparty/googletest-1.8.0/src/googletest-1.8.0/googletest/include  -O3 -DNDEBUG -fPIE
  -Wall -Wsign-compare -Wformat-security -fstack-protector-strong -Wno-unused-local-typedefs
-std=c++11 -o CMakeFiles/stout-tests.dir/error_tests.cpp.o -c /tmp/SRC/3rdparty/stout/tests/error_tests.cpp
[ 64%] Building CXX object 3rdparty/stout/tests/CMakeFiles/stout-tests.dir/flags_tests.cpp.o
[ 64%] Building CXX object 3rdparty/stout/tests/CMakeFiles/stout-tests.dir/dynamiclibrary_tests.cpp.o
[ 64%] Building CXX object 3rdparty/stout/tests/CMakeFiles/stout-tests.dir/hashmap_tests.cpp.o
[ 64%] Building CXX object 3rdparty/stout/tests/CMakeFiles/stout-tests.dir/gzip_tests.cpp.o
cd /BUILD/3rdparty/stout/tests && /usr/bin/c++  -DHAVE_LIBZ -DLIBDIR=\"/usr/local/libmesos\"
-DPKGDATADIR=\"/usr/local/share/mesos\" -DPKGLIBEXECDIR=\"/usr/local/libexec/mesos\" -DVERSION=\"1.7.0\"
-D__STDC_FORMAT_MACROS -I/BUILD/3rdparty/stout/tests -I/tmp/SRC/3rdparty/stout/include -isystem
/usr/include/apr-1.0 -I/BUILD/3rdparty/boost-1.65.0/src/boost-1.65.0 -I/BUILD/3rdparty/elfio-3.2/src/elfio-3.2
-isystem /BUILD/3rdparty/glog-0.3.3/src/glog-0.3.3-build/include -isystem /BUILD/3rdparty/libarchive-3.3.2/src/libarchive-3.3.2-build/include
-I/BUILD/3rdparty/picojson-1.3.0/src/picojson-1.3.0 -isystem /BUILD/3rdparty/protobuf-3.5.0/src/protobuf-3.5.0/src
-I/BUILD/3rdparty/rapidjson-1.1.0/src/rapidjson-1.1.0/rapidjson-1.1.0/include -I/usr/include/subversion-1
-isystem /BUILD/3rdparty/googletest-1.8.0/src/googletest-1.8.0/googlemock/include -isystem
/BUILD/3rdparty/googletest-1.8.0/src/googletest-1.8.0/googletest/include  -O3 -DNDEBUG -fPIE
  -Wall -Wsign-compare -Wformat-security -fstack-protector-strong -Wno-unused-local-typedefs
-std=c++11 -o CMakeFiles/stout-tests.dir/dynamiclibrary_tests.cpp.o -c /tmp/SRC/3rdparty/stout/tests/dynamiclibrary_tests.cpp
cd /BUILD/3rdparty/stout/tests && /usr/bin/c++  -DHAVE_LIBZ -DLIBDIR=\"/usr/local/libmesos\"
-DPKGDATADIR=\"/usr/local/share/mesos\" -DPKGLIBEXECDIR=\"/usr/local/libexec/mesos\" -DVERSION=\"1.7.0\"
-D__STDC_FORMAT_MACROS -I/BUILD/3rdparty/stout/tests -I/tmp/SRC/3rdparty/stout/include -isystem
/usr/include/apr-1.0 -I/BUILD/3rdparty/boost-1.65.0/src/boost-1.65.0 -I/BUILD/3rdparty/elfio-3.2/src/elfio-3.2
-isystem /BUILD/3rdparty/glog-0.3.3/src/glog-0.3.3-build/include -isystem /BUILD/3rdparty/libarchive-3.3.2/src/libarchive-3.3.2-build/include
-I/BUILD/3rdparty/picojson-1.3.0/src/picojson-1.3.0 -isystem /BUILD/3rdparty/protobuf-3.5.0/src/protobuf-3.5.0/src
-I/BUILD/3rdparty/rapidjson-1.1.0/src/rapidjson-1.1.0/rapidjson-1.1.0/include -I/usr/include/subversion-1
-isystem /BUILD/3rdparty/googletest-1.8.0/src/googletest-1.8.0/googlemock/include -isystem
/BUILD/3rdparty/googletest-1.8.0/src/googletest-1.8.0/googletest/include  -O3 -DNDEBUG -fPIE
  -Wall -Wsign-compare -Wformat-security -fstack-protector-strong -Wno-unused-local-typedefs
-std=c++11 -o CMakeFiles/stout-tests.dir/flags_tests.cpp.o -c /tmp/SRC/3rdparty/stout/tests/flags_tests.cpp
cd /BUILD/3rdparty/stout/tests && /usr/bin/c++  -DHAVE_LIBZ -DLIBDIR=\"/usr/local/libmesos\"
-DPKGDATADIR=\"/usr/local/share/mesos\" -DPKGLIBEXECDIR=\"/usr/local/libexec/mesos\" -DVERSION=\"1.7.0\"
-D__STDC_FORMAT_MACROS -I/BUILD/3rdparty/stout/tests -I/tmp/SRC/3rdparty/stout/include -isystem
/usr/include/apr-1.0 -I/BUILD/3rdparty/boost-1.65.0/src/boost-1.65.0 -I/BUILD/3rdparty/elfio-3.2/src/elfio-3.2
-isystem /BUILD/3rdparty/glog-0.3.3/src/glog-0.3.3-build/include -isystem /BUILD/3rdparty/libarchive-3.3.2/src/libarchive-3.3.2-build/include
-I/BUILD/3rdparty/picojson-1.3.0/src/picojson-1.3.0 -isystem /BUILD/3rdparty/protobuf-3.5.0/src/protobuf-3.5.0/src
-I/BUILD/3rdparty/rapidjson-1.1.0/src/rapidjson-1.1.0/rapidjson-1.1.0/include -I/usr/include/subversion-1
-isystem /BUILD/3rdparty/googletest-1.8.0/src/googletest-1.8.0/googlemock/include -isystem
/BUILD/3rdparty/googletest-1.8.0/src/googletest-1.8.0/googletest/include  -O3 -DNDEBUG -fPIE
  -Wall -Wsign-compare -Wformat-security -fstack-protector-strong -Wno-unused-local-typedefs
-std=c++11 -o CMakeFiles/stout-tests.dir/gzip_tests.cpp.o -c /tmp/SRC/3rdparty/stout/tests/gzip_tests.cpp
cd /BUILD/3rdparty/stout/tests && /usr/bin/c++  -DHAVE_LIBZ -DLIBDIR=\"/usr/local/libmesos\"
-DPKGDATADIR=\"/usr/local/share/mesos\" -DPKGLIBEXECDIR=\"/usr/local/libexec/mesos\" -DVERSION=\"1.7.0\"
-D__STDC_FORMAT_MACROS -I/BUILD/3rdparty/stout/tests -I/tmp/SRC/3rdparty/stout/include -isystem
/usr/include/apr-1.0 -I/BUILD/3rdparty/boost-1.65.0/src/boost-1.65.0 -I/BUILD/3rdparty/elfio-3.2/src/elfio-3.2
-isystem /BUILD/3rdparty/glog-0.3.3/src/glog-0.3.3-build/include -isystem /BUILD/3rdparty/libarchive-3.3.2/src/libarchive-3.3.2-build/include
-I/BUILD/3rdparty/picojson-1.3.0/src/picojson-1.3.0 -isystem /BUILD/3rdparty/protobuf-3.5.0/src/protobuf-3.5.0/src
-I/BUILD/3rdparty/rapidjson-1.1.0/src/rapidjson-1.1.0/rapidjson-1.1.0/include -I/usr/include/subversion-1
-isystem /BUILD/3rdparty/googletest-1.8.0/src/googletest-1.8.0/googlemock/include -isystem
/BUILD/3rdparty/googletest-1.8.0/src/googletest-1.8.0/googletest/include  -O3 -DNDEBUG -fPIE
  -Wall -Wsign-compare -Wformat-security -fstack-protector-strong -Wno-unused-local-typedefs
-std=c++11 -o CMakeFiles/stout-tests.dir/hashmap_tests.cpp.o -c /tmp/SRC/3rdparty/stout/tests/hashmap_tests.cpp
[ 71%] Building CXX object 3rdparty/stout/tests/CMakeFiles/stout-tests.dir/hashset_tests.cpp.o
[ 71%] Building CXX object 3rdparty/stout/tests/CMakeFiles/stout-tests.dir/interval_tests.cpp.o
cd /BUILD/3rdparty/stout/tests && /usr/bin/c++  -DHAVE_LIBZ -DLIBDIR=\"/usr/local/libmesos\"
-DPKGDATADIR=\"/usr/local/share/mesos\" -DPKGLIBEXECDIR=\"/usr/local/libexec/mesos\" -DVERSION=\"1.7.0\"
-D__STDC_FORMAT_MACROS -I/BUILD/3rdparty/stout/tests -I/tmp/SRC/3rdparty/stout/include -isystem
/usr/include/apr-1.0 -I/BUILD/3rdparty/boost-1.65.0/src/boost-1.65.0 -I/BUILD/3rdparty/elfio-3.2/src/elfio-3.2
-isystem /BUILD/3rdparty/glog-0.3.3/src/glog-0.3.3-build/include -isystem /BUILD/3rdparty/libarchive-3.3.2/src/libarchive-3.3.2-build/include
-I/BUILD/3rdparty/picojson-1.3.0/src/picojson-1.3.0 -isystem /BUILD/3rdparty/protobuf-3.5.0/src/protobuf-3.5.0/src
-I/BUILD/3rdparty/rapidjson-1.1.0/src/rapidjson-1.1.0/rapidjson-1.1.0/include -I/usr/include/subversion-1
-isystem /BUILD/3rdparty/googletest-1.8.0/src/googletest-1.8.0/googlemock/include -isystem
/BUILD/3rdparty/googletest-1.8.0/src/googletest-1.8.0/googletest/include  -O3 -DNDEBUG -fPIE
  -Wall -Wsign-compare -Wformat-security -fstack-protector-strong -Wno-unused-local-typedefs
-std=c++11 -o CMakeFiles/stout-tests.dir/hashset_tests.cpp.o -c /tmp/SRC/3rdparty/stout/tests/hashset_tests.cpp
cd /BUILD/3rdparty/stout/tests && /usr/bin/c++  -DHAVE_LIBZ -DLIBDIR=\"/usr/local/libmesos\"
-DPKGDATADIR=\"/usr/local/share/mesos\" -DPKGLIBEXECDIR=\"/usr/local/libexec/mesos\" -DVERSION=\"1.7.0\"
-D__STDC_FORMAT_MACROS -I/BUILD/3rdparty/stout/tests -I/tmp/SRC/3rdparty/stout/include -isystem
/usr/include/apr-1.0 -I/BUILD/3rdparty/boost-1.65.0/src/boost-1.65.0 -I/BUILD/3rdparty/elfio-3.2/src/elfio-3.2
-isystem /BUILD/3rdparty/glog-0.3.3/src/glog-0.3.3-build/include -isystem /BUILD/3rdparty/libarchive-3.3.2/src/libarchive-3.3.2-build/include
-I/BUILD/3rdparty/picojson-1.3.0/src/picojson-1.3.0 -isystem /BUILD/3rdparty/protobuf-3.5.0/src/protobuf-3.5.0/src
-I/BUILD/3rdparty/rapidjson-1.1.0/src/rapidjson-1.1.0/rapidjson-1.1.0/include -I/usr/include/subversion-1
-isystem /BUILD/3rdparty/googletest-1.8.0/src/googletest-1.8.0/googlemock/include -isystem
/BUILD/3rdparty/googletest-1.8.0/src/googletest-1.8.0/googletest/include  -O3 -DNDEBUG -fPIE
  -Wall -Wsign-compare -Wformat-security -fstack-protector-strong -Wno-unused-local-typedefs
-std=c++11 -o CMakeFiles/stout-tests.dir/interval_tests.cpp.o -c /tmp/SRC/3rdparty/stout/tests/interval_tests.cpp
[ 71%] Building CXX object 3rdparty/stout/tests/CMakeFiles/stout-tests.dir/ip_tests.cpp.o
cd /BUILD/3rdparty/stout/tests && /usr/bin/c++  -DHAVE_LIBZ -DLIBDIR=\"/usr/local/libmesos\"
-DPKGDATADIR=\"/usr/local/share/mesos\" -DPKGLIBEXECDIR=\"/usr/local/libexec/mesos\" -DVERSION=\"1.7.0\"
-D__STDC_FORMAT_MACROS -I/BUILD/3rdparty/stout/tests -I/tmp/SRC/3rdparty/stout/include -isystem
/usr/include/apr-1.0 -I/BUILD/3rdparty/boost-1.65.0/src/boost-1.65.0 -I/BUILD/3rdparty/elfio-3.2/src/elfio-3.2
-isystem /BUILD/3rdparty/glog-0.3.3/src/glog-0.3.3-build/include -isystem /BUILD/3rdparty/libarchive-3.3.2/src/libarchive-3.3.2-build/include
-I/BUILD/3rdparty/picojson-1.3.0/src/picojson-1.3.0 -isystem /BUILD/3rdparty/protobuf-3.5.0/src/protobuf-3.5.0/src
-I/BUILD/3rdparty/rapidjson-1.1.0/src/rapidjson-1.1.0/rapidjson-1.1.0/include -I/usr/include/subversion-1
-isystem /BUILD/3rdparty/googletest-1.8.0/src/googletest-1.8.0/googlemock/include -isystem
/BUILD/3rdparty/googletest-1.8.0/src/googletest-1.8.0/googletest/include  -O3 -DNDEBUG -fPIE
  -Wall -Wsign-compare -Wformat-security -fstack-protector-strong -Wno-unused-local-typedefs
-std=c++11 -o CMakeFiles/stout-tests.dir/ip_tests.cpp.o -c /tmp/SRC/3rdparty/stout/tests/ip_tests.cpp
In file included from /tmp/SRC/3rdparty/stout/include/stout/json.hpp:41:0,
                 from /tmp/SRC/3rdparty/stout/include/stout/flags/fetch.hpp:21,
                 from /tmp/SRC/3rdparty/stout/include/stout/flags/flags.hpp:37,
                 from /tmp/SRC/3rdparty/stout/include/stout/flags.hpp:16,
                 from /tmp/SRC/3rdparty/stout/tests/flags_tests.cpp:19:
/tmp/SRC/3rdparty/stout/include/stout/jsonify.hpp:36:36: fatal error: rapidjson/stringbuffer.h:
No such file or directory
compilation terminated.
3rdparty/stout/tests/CMakeFiles/stout-tests.dir/build.make:336: recipe for target '3rdparty/stout/tests/CMakeFiles/stout-tests.dir/flags_tests.cpp.o'
failed
make[3]: *** [3rdparty/stout/tests/CMakeFiles/stout-tests.dir/flags_tests.cpp.o] Error 1
make[3]: *** Waiting for unfinished jobs....
In file included from /tmp/SRC/3rdparty/stout/include/stout/json.hpp:41:0,
                 from /tmp/SRC/3rdparty/stout/include/stout/os/raw/environment.hpp:21,
                 from /tmp/SRC/3rdparty/stout/include/stout/os.hpp:77,
                 from /tmp/SRC/3rdparty/stout/tests/archiver_tests.cpp:22:
/tmp/SRC/3rdparty/stout/include/stout/jsonify.hpp:36:36: fatal error: rapidjson/stringbuffer.h:
No such file or directory
compilation terminated.
3rdparty/stout/tests/CMakeFiles/stout-tests.dir/build.make:96: recipe for target '3rdparty/stout/tests/CMakeFiles/stout-tests.dir/archiver_tests.cpp.o'
failed
make[3]: *** [3rdparty/stout/tests/CMakeFiles/stout-tests.dir/archiver_tests.cpp.o] Error
1
make[3]: Leaving directory '/BUILD'
CMakeFiles/Makefile2:933: recipe for target '3rdparty/stout/tests/CMakeFiles/stout-tests.dir/all'
failed
make[2]: Leaving directory '/BUILD'
make[2]: *** [3rdparty/stout/tests/CMakeFiles/stout-tests.dir/all] Error 2
CMakeFiles/Makefile2:940: recipe for target '3rdparty/stout/tests/CMakeFiles/stout-tests.dir/rule'
failed
make[1]: Leaving directory '/BUILD'
make[1]: *** [3rdparty/stout/tests/CMakeFiles/stout-tests.dir/rule] Error 2
Makefile:151: recipe for target '3rdparty/stout/tests/CMakeFiles/stout-tests.dir/rule' failed
make: *** [3rdparty/stout/tests/CMakeFiles/stout-tests.dir/rule] Error 2
Untagged: mesos/mesos-tidy:latest
Untagged: mesos/mesos-tidy@sha256:5211521a1b103bc8280cb73fef4460e81fe3374c15d9bcc94f990e93d1c954b8
Deleted: sha256:386d1e01e3af9c13b7335c5bfe8881608705e16c2294c93bb37f1fbe1889cefe
Deleted: sha256:9b38f8334ca23b1abc5fb1ddd09a1b2d4473a6a7c53469aece0df41e59dd376c
Deleted: sha256:bdd819d112d4f5390548e61b954e7509adc4b67eebab781c53dde27f3ce70f4b
Deleted: sha256:722e2fc3b4170287b5319541e5afec9fc77a13af6941f7a17b27239000614868
Deleted: sha256:74ec76afb2a9967595d38729b22fa5b7e457c99ed558309e232ce0e789d615f5
Deleted: sha256:39612ca4579c238185f8727fa0ae501079d34b6347288e3e08fd55632d2be7c4
Deleted: sha256:5a275fa3218482bd2fc9df3383bc3e903bca954490436a7b63c132acef45f6f2
Deleted: sha256:cb0b8b7a1cb77a38561a3a29f5322b5f713f0cb461902aee3abd26781ab247ad
Deleted: sha256:25f5b87004e2bf7eca63960ac9a8fbbed3ffb7c305c26e83d7b8072575fad1d8
Deleted: sha256:fcffce973ed7d3bf7cf5e1dd273be53fea4514a5af318cf1984e293188cc4912
Deleted: sha256:7ce18d83f9a71227c029cebd096bb38c2b8a25c09b0d435b802cbe4b3e800a9a
Build step 'Execute shell' marked build as failure

Mime
View raw message