mesos-builds mailing list archives

Site index · List index
Message view « Date » · « Thread »
Top « Date » · « Thread »
From Apache Jenkins Server <jenk...@builds.apache.org>
Subject Build failed in Jenkins: Mesos-Reviewbot #22791
Date Mon, 25 Jun 2018 19:01:27 GMT
See <https://builds.apache.org/job/Mesos-Reviewbot/22791/display/redirect>

------------------------------------------
[...truncated 37.42 MB...]
I0625 19:01:12.977443 18263 slave.cpp:269] Flags at startup: --acls="" --appc_simple_discovery_uri_prefix="http://"
--appc_store_dir="/tmp/Endpoint_SlaveEndpointTest_AuthorizedRequest_2_jJ51a1/store/appc" --authenticate_http_readonly="true"
--authenticate_http_readwrite="false" --authenticatee="crammd5" --authentication_backoff_factor="1secs"
--authorizer="local" --cgroups_cpu_enable_pids_and_tids_count="false" --cgroups_enable_cfs="false"
--cgroups_hierarchy="/sys/fs/cgroup" --cgroups_limit_swap="false" --cgroups_root="mesos" --container_disk_watch_interval="15secs"
--containerizers="mesos" --credential="/tmp/Endpoint_SlaveEndpointTest_AuthorizedRequest_2_jJ51a1/credential"
--default_role="*" --disallow_sharing_agent_pid_namespace="false" --disk_watch_interval="1mins"
--docker="docker" --docker_kill_orphans="true" --docker_registry="https://registry-1.docker.io"
--docker_remove_delay="6hrs" --docker_socket="/var/run/docker.sock" --docker_stop_timeout="0ns"
--docker_store_dir="/tmp/Endpoint_SlaveEndpointTest_AuthorizedRequest_2_jJ51a1/store/docker"
--docker_volume_checkpoint_dir="/var/run/mesos/isolators/docker/volume" --enforce_container_disk_quota="false"
--executor_registration_timeout="1mins" --executor_reregistration_timeout="2secs" --executor_shutdown_grace_period="5secs"
--fetcher_cache_dir="/tmp/Endpoint_SlaveEndpointTest_AuthorizedRequest_2_jJ51a1/fetch" --fetcher_cache_size="2GB"
--fetcher_stall_timeout="1mins" --frameworks_home="" --gc_delay="1weeks" --gc_disk_headroom="0.1"
--help="false" --hostname_lookup="true" --http_command_executor="false" --http_credentials="/tmp/Endpoint_SlaveEndpointTest_AuthorizedRequest_2_jJ51a1/http_credentials"
--http_heartbeat_interval="30secs" --initialize_driver_logging="true" --isolation="posix/cpu,posix/mem"
--launcher="posix" --launcher_dir="/tmp/SRC/build/mesos-1.7.0/_build/sub/src" --logbufsecs="0"
--logging_level="INFO" --max_completed_executors_per_framework="150" --memory_profiling="false"
--oversubscribed_resources_interval="15secs" --perf_duration="10secs" --perf_interval="1mins"
--port="5051" --qos_correction_interval_min="0ns" --quiet="false" --reconfiguration_policy="equal"
--recover="reconnect" --recovery_timeout="15mins" --registration_backoff_factor="10ms" --resources="cpus:2;gpus:0;mem:1024;disk:1024;ports:[31000-32000]"
--revocable_cpu_low_priority="true" --runtime_dir="/tmp/Endpoint_SlaveEndpointTest_AuthorizedRequest_2_jJ51a1"
--sandbox_directory="/mnt/mesos/sandbox" --strict="true" --switch_user="true" --systemd_enable_support="true"
--systemd_runtime_directory="/run/systemd/system" --version="false" --work_dir="/tmp/Endpoint_SlaveEndpointTest_AuthorizedRequest_2_8yH6Ad"
--zk_session_timeout="10secs"
I0625 19:01:12.977934 18263 credentials.hpp:86] Loading credential for authentication from
'/tmp/Endpoint_SlaveEndpointTest_AuthorizedRequest_2_jJ51a1/credential'
I0625 19:01:12.978145 18263 slave.cpp:301] Agent using credential for: test-principal
I0625 19:01:12.978173 18263 credentials.hpp:37] Loading credentials for authentication from
'/tmp/Endpoint_SlaveEndpointTest_AuthorizedRequest_2_jJ51a1/http_credentials'
I0625 19:01:12.978433 18263 http.cpp:959] Creating default 'basic' HTTP authenticator for
realm 'mesos-agent-readonly'
I0625 19:01:12.978799 18263 disk_profile_adaptor.cpp:80] Creating default disk profile adaptor
module
I0625 19:01:12.980192 18263 slave.cpp:616] Agent resources: [{"name":"cpus","scalar":{"value":2.0},"type":"SCALAR"},{"name":"mem","scalar":{"value":1024.0},"type":"SCALAR"},{"name":"disk","scalar":{"value":1024.0},"type":"SCALAR"},{"name":"ports","ranges":{"range":[{"begin":31000,"end":32000}]},"type":"RANGES"}]
I0625 19:01:12.980408 18263 slave.cpp:624] Agent attributes: [  ]
I0625 19:01:12.980429 18263 slave.cpp:633] Agent hostname: d84c36706868
I0625 19:01:12.980599 18274 task_status_update_manager.cpp:181] Pausing sending task status
updates
I0625 19:01:12.982399 18270 state.cpp:66] Recovering state from '/tmp/Endpoint_SlaveEndpointTest_AuthorizedRequest_2_8yH6Ad/meta'
I0625 19:01:12.982583 18265 slave.cpp:6929] Finished recovering checkpointed state from '/tmp/Endpoint_SlaveEndpointTest_AuthorizedRequest_2_8yH6Ad/meta',
beginning agent recovery
I0625 19:01:12.982720 18270 task_status_update_manager.cpp:207] Recovering task status update
manager
I0625 19:01:12.983024 18282 containerizer.cpp:718] Recovering Mesos containers
I0625 19:01:12.983302 18282 containerizer.cpp:1025] Recovering isolators
I0625 19:01:12.983942 18260 containerizer.cpp:1064] Recovering provisioner
I0625 19:01:12.984699 18274 provisioner.cpp:494] Provisioner recovery complete
I0625 19:01:12.985363 18265 composing.cpp:339] Finished recovering all containerizers
I0625 19:01:12.985507 18270 slave.cpp:7158] Recovering executors
I0625 19:01:12.985649 18270 slave.cpp:7311] Finished recovery
I0625 19:01:12.988754 18260 process.cpp:3583] Handling HTTP event for process 'slave(1009)'
with path: '/slave(1009)/containers'
I0625 19:01:12.990546 18279 http.cpp:1099] HTTP GET for /slave(1009)/containers from 172.17.0.2:53072
I0625 19:01:12.990628 18279 http.cpp:936] Authorizing principal 'test-principal' to GET the
'/containers' endpoint
I0625 19:01:12.993870 18263 slave.cpp:931] Agent terminating
[       OK ] Endpoint/SlaveEndpointTest.AuthorizedRequest/2 (32 ms)
[ RUN      ] Endpoint/SlaveEndpointTest.UnauthorizedRequest/0
I0625 19:01:13.005992 18259 containerizer.cpp:300] Using isolation { environment_secret, posix/cpu,
posix/mem, filesystem/posix, network/cni }
W0625 19:01:13.006520 18259 backend.cpp:76] Failed to create 'aufs' backend: AufsBackend requires
root privileges
W0625 19:01:13.006549 18259 backend.cpp:76] Failed to create 'bind' backend: BindBackend requires
root privileges
I0625 19:01:13.006580 18259 provisioner.cpp:298] Using default backend 'copy'
I0625 19:01:13.010306 18260 slave.cpp:268] Mesos agent started on (1010)@172.17.0.2:39920
I0625 19:01:13.010341 18260 slave.cpp:269] Flags at startup: --acls="" --appc_simple_discovery_uri_prefix="http://"
--appc_store_dir="/tmp/Endpoint_SlaveEndpointTest_UnauthorizedRequest_0_WG9pLd/store/appc"
--authenticate_http_readonly="true" --authenticate_http_readwrite="false" --authenticatee="crammd5"
--authentication_backoff_factor="1secs" --authorizer="local" --cgroups_cpu_enable_pids_and_tids_count="false"
--cgroups_enable_cfs="false" --cgroups_hierarchy="/sys/fs/cgroup" --cgroups_limit_swap="false"
--cgroups_root="mesos" --container_disk_watch_interval="15secs" --containerizers="mesos" --credential="/tmp/Endpoint_SlaveEndpointTest_UnauthorizedRequest_0_WG9pLd/credential"
--default_role="*" --disallow_sharing_agent_pid_namespace="false" --disk_watch_interval="1mins"
--docker="docker" --docker_kill_orphans="true" --docker_registry="https://registry-1.docker.io"
--docker_remove_delay="6hrs" --docker_socket="/var/run/docker.sock" --docker_stop_timeout="0ns"
--docker_store_dir="/tmp/Endpoint_SlaveEndpointTest_UnauthorizedRequest_0_WG9pLd/store/docker"
--docker_volume_checkpoint_dir="/var/run/mesos/isolators/docker/volume" --enforce_container_disk_quota="false"
--executor_registration_timeout="1mins" --executor_reregistration_timeout="2secs" --executor_shutdown_grace_period="5secs"
--fetcher_cache_dir="/tmp/Endpoint_SlaveEndpointTest_UnauthorizedRequest_0_WG9pLd/fetch" --fetcher_cache_size="2GB"
--fetcher_stall_timeout="1mins" --frameworks_home="" --gc_delay="1weeks" --gc_disk_headroom="0.1"
--help="false" --hostname_lookup="true" --http_command_executor="false" --http_credentials="/tmp/Endpoint_SlaveEndpointTest_UnauthorizedRequest_0_WG9pLd/http_credentials"
--http_heartbeat_interval="30secs" --initialize_driver_logging="true" --isolation="posix/cpu,posix/mem"
--launcher="posix" --launcher_dir="/tmp/SRC/build/mesos-1.7.0/_build/sub/src" --logbufsecs="0"
--logging_level="INFO" --max_completed_executors_per_framework="150" --memory_profiling="false"
--oversubscribed_resources_interval="15secs" --perf_duration="10secs" --perf_interval="1mins"
--port="5051" --qos_correction_interval_min="0ns" --quiet="false" --reconfiguration_policy="equal"
--recover="reconnect" --recovery_timeout="15mins" --registration_backoff_factor="10ms" --resources="cpus:2;gpus:0;mem:1024;disk:1024;ports:[31000-32000]"
--revocable_cpu_low_priority="true" --runtime_dir="/tmp/Endpoint_SlaveEndpointTest_UnauthorizedRequest_0_WG9pLd"
--sandbox_directory="/mnt/mesos/sandbox" --strict="true" --switch_user="true" --systemd_enable_support="true"
--systemd_runtime_directory="/run/systemd/system" --version="false" --work_dir="/tmp/Endpoint_SlaveEndpointTest_UnauthorizedRequest_0_zpUA6p"
--zk_session_timeout="10secs"
I0625 19:01:13.010819 18260 credentials.hpp:86] Loading credential for authentication from
'/tmp/Endpoint_SlaveEndpointTest_UnauthorizedRequest_0_WG9pLd/credential'
I0625 19:01:13.011023 18260 slave.cpp:301] Agent using credential for: test-principal
I0625 19:01:13.011049 18260 credentials.hpp:37] Loading credentials for authentication from
'/tmp/Endpoint_SlaveEndpointTest_UnauthorizedRequest_0_WG9pLd/http_credentials'
I0625 19:01:13.011296 18260 http.cpp:959] Creating default 'basic' HTTP authenticator for
realm 'mesos-agent-readonly'
I0625 19:01:13.011651 18260 disk_profile_adaptor.cpp:80] Creating default disk profile adaptor
module
I0625 19:01:13.013047 18260 slave.cpp:616] Agent resources: [{"name":"cpus","scalar":{"value":2.0},"type":"SCALAR"},{"name":"mem","scalar":{"value":1024.0},"type":"SCALAR"},{"name":"disk","scalar":{"value":1024.0},"type":"SCALAR"},{"name":"ports","ranges":{"range":[{"begin":31000,"end":32000}]},"type":"RANGES"}]
I0625 19:01:13.013265 18260 slave.cpp:624] Agent attributes: [  ]
I0625 19:01:13.013285 18260 slave.cpp:633] Agent hostname: d84c36706868
I0625 19:01:13.013432 18270 task_status_update_manager.cpp:181] Pausing sending task status
updates
I0625 19:01:13.015174 18280 state.cpp:66] Recovering state from '/tmp/Endpoint_SlaveEndpointTest_UnauthorizedRequest_0_zpUA6p/meta'
I0625 19:01:13.015359 18262 slave.cpp:6929] Finished recovering checkpointed state from '/tmp/Endpoint_SlaveEndpointTest_UnauthorizedRequest_0_zpUA6p/meta',
beginning agent recovery
I0625 19:01:13.015513 18276 task_status_update_manager.cpp:207] Recovering task status update
manager
I0625 19:01:13.015813 18273 containerizer.cpp:718] Recovering Mesos containers
I0625 19:01:13.016101 18273 containerizer.cpp:1025] Recovering isolators
I0625 19:01:13.016711 18268 containerizer.cpp:1064] Recovering provisioner
I0625 19:01:13.017501 18270 provisioner.cpp:494] Provisioner recovery complete
I0625 19:01:13.018139 18266 composing.cpp:339] Finished recovering all containerizers
I0625 19:01:13.018278 18276 slave.cpp:7158] Recovering executors
I0625 19:01:13.018410 18276 slave.cpp:7311] Finished recovery
I0625 19:01:13.022006 18268 process.cpp:3583] Handling HTTP event for process 'slave(1010)'
with path: '/slave(1010)/monitor/statistics'
I0625 19:01:13.023711 18261 http.cpp:1099] HTTP GET for /slave(1010)/monitor/statistics from
172.17.0.2:53074
I0625 19:01:13.023820 18261 http.cpp:936] Authorizing principal 'test-principal' to GET the
'/monitor/statistics' endpoint
I0625 19:01:13.025415 18259 slave.cpp:931] Agent terminating
[       OK ] Endpoint/SlaveEndpointTest.UnauthorizedRequest/0 (31 ms)
[ RUN      ] Endpoint/SlaveEndpointTest.UnauthorizedRequest/1
I0625 19:01:13.037812 18259 containerizer.cpp:300] Using isolation { environment_secret, posix/cpu,
posix/mem, filesystem/posix, network/cni }
W0625 19:01:13.038348 18259 backend.cpp:76] Failed to create 'aufs' backend: AufsBackend requires
root privileges
W0625 19:01:13.038380 18259 backend.cpp:76] Failed to create 'bind' backend: BindBackend requires
root privileges
I0625 19:01:13.038413 18259 provisioner.cpp:298] Using default backend 'copy'
I0625 19:01:13.042147 18274 slave.cpp:268] Mesos agent started on (1011)@172.17.0.2:39920
I0625 19:01:13.042178 18274 slave.cpp:269] Flags at startup: --acls="" --appc_simple_discovery_uri_prefix="http://"
--appc_store_dir="/tmp/Endpoint_SlaveEndpointTest_UnauthorizedRequest_1_2rNREq/store/appc"
--authenticate_http_readonly="true" --authenticate_http_readwrite="false" --authenticatee="crammd5"
--authentication_backoff_factor="1secs" --authorizer="local" --cgroups_cpu_enable_pids_and_tids_count="false"
--cgroups_enable_cfs="false" --cgroups_hierarchy="/sys/fs/cgroup" --cgroups_limit_swap="false"
--cgroups_root="mesos" --container_disk_watch_interval="15secs" --containerizers="mesos" --credential="/tmp/Endpoint_SlaveEndpointTest_UnauthorizedRequest_1_2rNREq/credential"
--default_role="*" --disallow_sharing_agent_pid_namespace="false" --disk_watch_interval="1mins"
--docker="docker" --docker_kill_orphans="true" --docker_registry="https://registry-1.docker.io"
--docker_remove_delay="6hrs" --docker_socket="/var/run/docker.sock" --docker_stop_timeout="0ns"
--docker_store_dir="/tmp/Endpoint_SlaveEndpointTest_UnauthorizedRequest_1_2rNREq/store/docker"
--docker_volume_checkpoint_dir="/var/run/mesos/isolators/docker/volume" --enforce_container_disk_quota="false"
--executor_registration_timeout="1mins" --executor_reregistration_timeout="2secs" --executor_shutdown_grace_period="5secs"
--fetcher_cache_dir="/tmp/Endpoint_SlaveEndpointTest_UnauthorizedRequest_1_2rNREq/fetch" --fetcher_cache_size="2GB"
--fetcher_stall_timeout="1mins" --frameworks_home="" --gc_delay="1weeks" --gc_disk_headroom="0.1"
--help="false" --hostname_lookup="true" --http_command_executor="false" --http_credentials="/tmp/Endpoint_SlaveEndpointTest_UnauthorizedRequest_1_2rNREq/http_credentials"
--http_heartbeat_interval="30secs" --initialize_driver_logging="true" --isolation="posix/cpu,posix/mem"
--launcher="posix" --launcher_dir="/tmp/SRC/build/mesos-1.7.0/_build/sub/src" --logbufsecs="0"
--logging_level="INFO" --max_completed_executors_per_framework="150" --memory_profiling="false"
--oversubscribed_resources_interval="15secs" --perf_duration="10secs" --perf_interval="1mins"
--port="5051" --qos_correction_interval_min="0ns" --quiet="false" --reconfiguration_policy="equal"
--recover="reconnect" --recovery_timeout="15mins" --registration_backoff_factor="10ms" --resources="cpus:2;gpus:0;mem:1024;disk:1024;ports:[31000-32000]"
--revocable_cpu_low_priority="true" --runtime_dir="/tmp/Endpoint_SlaveEndpointTest_UnauthorizedRequest_1_2rNREq"
--sandbox_directory="/mnt/mesos/sandbox" --strict="true" --switch_user="true" --systemd_enable_support="true"
--systemd_runtime_directory="/run/systemd/system" --version="false" --work_dir="/tmp/Endpoint_SlaveEndpointTest_UnauthorizedRequest_1_3kEjVC"
--zk_session_timeout="10secs"
I0625 19:01:13.042660 18274 credentials.hpp:86] Loading credential for authentication from
'/tmp/Endpoint_SlaveEndpointTest_UnauthorizedRequest_1_2rNREq/credential'
I0625 19:01:13.042868 18274 slave.cpp:301] Agent using credential for: test-principal
I0625 19:01:13.042896 18274 credentials.hpp:37] Loading credentials for authentication from
'/tmp/Endpoint_SlaveEndpointTest_UnauthorizedRequest_1_2rNREq/http_credentials'
I0625 19:01:13.043164 18274 http.cpp:959] Creating default 'basic' HTTP authenticator for
realm 'mesos-agent-readonly'
I0625 19:01:13.043520 18274 disk_profile_adaptor.cpp:80] Creating default disk profile adaptor
module
I0625 19:01:13.044922 18274 slave.cpp:616] Agent resources: [{"name":"cpus","scalar":{"value":2.0},"type":"SCALAR"},{"name":"mem","scalar":{"value":1024.0},"type":"SCALAR"},{"name":"disk","scalar":{"value":1024.0},"type":"SCALAR"},{"name":"ports","ranges":{"range":[{"begin":31000,"end":32000}]},"type":"RANGES"}]
I0625 19:01:13.045145 18274 slave.cpp:624] Agent attributes: [  ]
I0625 19:01:13.045171 18274 slave.cpp:633] Agent hostname: d84c36706868
I0625 19:01:13.045337 18266 task_status_update_manager.cpp:181] Pausing sending task status
updates
I0625 19:01:13.047168 18265 state.cpp:66] Recovering state from '/tmp/Endpoint_SlaveEndpointTest_UnauthorizedRequest_1_3kEjVC/meta'
I0625 19:01:13.047423 18260 slave.cpp:6929] Finished recovering checkpointed state from '/tmp/Endpoint_SlaveEndpointTest_UnauthorizedRequest_1_3kEjVC/meta',
beginning agent recovery
I0625 19:01:13.047590 18261 task_status_update_manager.cpp:207] Recovering task status update
manager
I0625 19:01:13.047900 18263 containerizer.cpp:718] Recovering Mesos containers
I0625 19:01:13.048185 18263 containerizer.cpp:1025] Recovering isolators
I0625 19:01:13.048821 18278 containerizer.cpp:1064] Recovering provisioner
I0625 19:01:13.049489 18266 provisioner.cpp:494] Provisioner recovery complete
I0625 19:01:13.050142 18260 composing.cpp:339] Finished recovering all containerizers
I0625 19:01:13.050277 18261 slave.cpp:7158] Recovering executors
I0625 19:01:13.050472 18261 slave.cpp:7311] Finished recovery
I0625 19:01:13.054164 18276 process.cpp:3583] Handling HTTP event for process 'slave(1011)'
with path: '/slave(1011)/monitor/statistics.json'
I0625 19:01:13.055843 18279 http.cpp:1099] HTTP GET for /slave(1011)/monitor/statistics.json
from 172.17.0.2:53076
I0625 19:01:13.055932 18279 http.cpp:936] Authorizing principal 'test-principal' to GET the
'/monitor/statistics.json' endpoint
I0625 19:01:13.057552 18277 slave.cpp:931] Agent terminating
[       OK ] Endpoint/SlaveEndpointTest.UnauthorizedRequest/1 (32 ms)
[ RUN      ] Endpoint/SlaveEndpointTest.UnauthorizedRequest/2
I0625 19:01:13.070853 18259 containerizer.cpp:300] Using isolation { environment_secret, posix/cpu,
posix/mem, filesystem/posix, network/cni }
W0625 19:01:13.071419 18259 backend.cpp:76] Failed to create 'aufs' backend: AufsBackend requires
root privileges
W0625 19:01:13.071449 18259 backend.cpp:76] Failed to create 'bind' backend: BindBackend requires
root privileges
I0625 19:01:13.071485 18259 provisioner.cpp:298] Using default backend 'copy'
I0625 19:01:13.075556 18277 slave.cpp:268] Mesos agent started on (1012)@172.17.0.2:39920
I0625 19:01:13.075580 18277 slave.cpp:269] Flags at startup: --acls="" --appc_simple_discovery_uri_prefix="http://"
--appc_store_dir="/tmp/Endpoint_SlaveEndpointTest_UnauthorizedRequest_2_dhYLRD/store/appc"
--authenticate_http_readonly="true" --authenticate_http_readwrite="false" --authenticatee="crammd5"
--authentication_backoff_factor="1secs" --authorizer="local" --cgroups_cpu_enable_pids_and_tids_count="false"
--cgroups_enable_cfs="false" --cgroups_hierarchy="/sys/fs/cgroup" --cgroups_limit_swap="false"
--cgroups_root="mesos" --container_disk_watch_interval="15secs" --containerizers="mesos" --credential="/tmp/Endpoint_SlaveEndpointTest_UnauthorizedRequest_2_dhYLRD/credential"
--default_role="*" --disallow_sharing_agent_pid_namespace="false" --disk_watch_interval="1mins"
--docker="docker" --docker_kill_orphans="true" --docker_registry="https://registry-1.docker.io"
--docker_remove_delay="6hrs" --docker_socket="/var/run/docker.sock" --docker_stop_timeout="0ns"
--docker_store_dir="/tmp/Endpoint_SlaveEndpointTest_UnauthorizedRequest_2_dhYLRD/store/docker"
--docker_volume_checkpoint_dir="/var/run/mesos/isolators/docker/volume" --enforce_container_disk_quota="false"
--executor_registration_timeout="1mins" --executor_reregistration_timeout="2secs" --executor_shutdown_grace_period="5secs"
--fetcher_cache_dir="/tmp/Endpoint_SlaveEndpointTest_UnauthorizedRequest_2_dhYLRD/fetch" --fetcher_cache_size="2GB"
--fetcher_stall_timeout="1mins" --frameworks_home="" --gc_delay="1weeks" --gc_disk_headroom="0.1"
--help="false" --hostname_lookup="true" --http_command_executor="false" --http_credentials="/tmp/Endpoint_SlaveEndpointTest_UnauthorizedRequest_2_dhYLRD/http_credentials"
--http_heartbeat_interval="30secs" --initialize_driver_logging="true" --isolation="posix/cpu,posix/mem"
--launcher="posix" --launcher_dir="/tmp/SRC/build/mesos-1.7.0/_build/sub/src" --logbufsecs="0"
--logging_level="INFO" --max_completed_executors_per_framework="150" --memory_profiling="false"
--oversubscribed_resources_interval="15secs" --perf_duration="10secs" --perf_interval="1mins"
--port="5051" --qos_correction_interval_min="0ns" --quiet="false" --reconfiguration_policy="equal"
--recover="reconnect" --recovery_timeout="15mins" --registration_backoff_factor="10ms" --resources="cpus:2;gpus:0;mem:1024;disk:1024;ports:[31000-32000]"
--revocable_cpu_low_priority="true" --runtime_dir="/tmp/Endpoint_SlaveEndpointTest_UnauthorizedRequest_2_dhYLRD"
--sandbox_directory="/mnt/mesos/sandbox" --strict="true" --switch_user="true" --systemd_enable_support="true"
--systemd_runtime_directory="/run/systemd/system" --version="false" --work_dir="/tmp/Endpoint_SlaveEndpointTest_UnauthorizedRequest_2_GUrj3P"
--zk_session_timeout="10secs"
I0625 19:01:13.076073 18277 credentials.hpp:86] Loading credential for authentication from
'/tmp/Endpoint_SlaveEndpointTest_UnauthorizedRequest_2_dhYLRD/credential'
I0625 19:01:13.076273 18277 slave.cpp:301] Agent using credential for: test-principal
I0625 19:01:13.076300 18277 credentials.hpp:37] Loading credentials for authentication from
'/tmp/Endpoint_SlaveEndpointTest_UnauthorizedRequest_2_dhYLRD/http_credentials'
I0625 19:01:13.076530 18277 http.cpp:959] Creating default 'basic' HTTP authenticator for
realm 'mesos-agent-readonly'
I0625 19:01:13.076872 18277 disk_profile_adaptor.cpp:80] Creating default disk profile adaptor
module
I0625 19:01:13.078160 18277 slave.cpp:616] Agent resources: [{"name":"cpus","scalar":{"value":2.0},"type":"SCALAR"},{"name":"mem","scalar":{"value":1024.0},"type":"SCALAR"},{"name":"disk","scalar":{"value":1024.0},"type":"SCALAR"},{"name":"ports","ranges":{"range":[{"begin":31000,"end":32000}]},"type":"RANGES"}]
I0625 19:01:13.078372 18277 slave.cpp:624] Agent attributes: [  ]
I0625 19:01:13.078392 18277 slave.cpp:633] Agent hostname: d84c36706868
I0625 19:01:13.078544 18267 task_status_update_manager.cpp:181] Pausing sending task status
updates
I0625 19:01:13.080181 18265 state.cpp:66] Recovering state from '/tmp/Endpoint_SlaveEndpointTest_UnauthorizedRequest_2_GUrj3P/meta'
I0625 19:01:13.080420 18270 slave.cpp:6929] Finished recovering checkpointed state from '/tmp/Endpoint_SlaveEndpointTest_UnauthorizedRequest_2_GUrj3P/meta',
beginning agent recovery
I0625 19:01:13.080575 18265 task_status_update_manager.cpp:207] Recovering task status update
manager
I0625 19:01:13.080920 18279 containerizer.cpp:718] Recovering Mesos containers
I0625 19:01:13.081254 18279 containerizer.cpp:1025] Recovering isolators
I0625 19:01:13.081802 18263 containerizer.cpp:1064] Recovering provisioner
I0625 19:01:13.082458 18267 provisioner.cpp:494] Provisioner recovery complete
I0625 19:01:13.083078 18270 composing.cpp:339] Finished recovering all containerizers
I0625 19:01:13.083212 18265 slave.cpp:7158] Recovering executors
I0625 19:01:13.083361 18265 slave.cpp:7311] Finished recovery
I0625 19:01:13.086817 18273 process.cpp:3583] Handling HTTP event for process 'slave(1012)'
with path: '/slave(1012)/containers'
I0625 19:01:13.088284 18269 http.cpp:1099] HTTP GET for /slave(1012)/containers from 172.17.0.2:53078
I0625 19:01:13.088362 18269 http.cpp:936] Authorizing principal 'test-principal' to GET the
'/containers' endpoint
I0625 19:01:13.089982 18279 slave.cpp:931] Agent terminating
[       OK ] Endpoint/SlaveEndpointTest.UnauthorizedRequest/2 (32 ms)
[ RUN      ] Endpoint/SlaveEndpointTest.NoAuthorizer/0
I0625 19:01:13.103663 18259 containerizer.cpp:300] Using isolation { environment_secret, posix/cpu,
posix/mem, filesystem/posix, network/cni }
W0625 19:01:13.104236 18259 backend.cpp:76] Failed to create 'aufs' backend: AufsBackend requires
root privileges
W0625 19:01:13.104269 18259 backend.cpp:76] Failed to create 'bind' backend: BindBackend requires
root privileges
I0625 19:01:13.104305 18259 provisioner.cpp:298] Using default backend 'copy'
I0625 19:01:13.106392 18259 cluster.cpp:479] Creating default 'local' authorizer
I0625 19:01:13.108645 18261 slave.cpp:268] Mesos agent started on (1013)@172.17.0.2:39920
I0625 19:01:13.108675 18261 slave.cpp:269] Flags at startup: --acls="" --appc_simple_discovery_uri_prefix="http://"
--appc_store_dir="/tmp/Endpoint_SlaveEndpointTest_NoAuthorizer_0_BC2XnR/store/appc" --authenticate_http_readonly="true"
--authenticate_http_readwrite="false" --authenticatee="crammd5" --authentication_backoff_factor="1secs"
--authorizer="local" --cgroups_cpu_enable_pids_and_tids_count="false" --cgroups_enable_cfs="false"
--cgroups_hierarchy="/sys/fs/cgroup" --cgroups_limit_swap="false" --cgroups_root="mesos" --container_disk_watch_interval="15secs"
--containerizers="mesos" --credential="/tmp/Endpoint_SlaveEndpointTest_NoAuthorizer_0_BC2XnR/credential"
--default_role="*" --disallow_sharing_agent_pid_namespace="false" --disk_watch_interval="1mins"
--docker="docker" --docker_kill_orphans="true" --docker_registry="https://registry-1.docker.io"
--docker_remove_delay="6hrs" --docker_socket="/var/run/docker.sock" --docker_stop_timeout="0ns"
--docker_store_dir="/tmp/Endpoint_SlaveEndpointTest_NoAuthorizer_0_BC2XnR/store/docker" --docker_volume_checkpoint_dir="/var/run/mesos/isolators/docker/volume"
--enforce_container_disk_quota="false" --executor_registration_timeout="1mins" --executor_reregistration_timeout="2secs"
--executor_shutdown_grace_period="5secs" --fetcher_cache_dir="/tmp/Endpoint_SlaveEndpointTest_NoAuthorizer_0_BC2XnR/fetch"
--fetcher_cache_size="2GB" --fetcher_stall_timeout="1mins" --frameworks_home="" --gc_delay="1weeks"
--gc_disk_headroom="0.1" --help="false" --hostname_lookup="true" --http_command_executor="false"
--http_credentials="/tmp/Endpoint_SlaveEndpointTest_NoAuthorizer_0_BC2XnR/http_credentials"
--http_heartbeat_interval="30secs" --initialize_driver_logging="true" --isolation="posix/cpu,posix/mem"
--launcher="posix" --launcher_dir="/tmp/SRC/build/mesos-1.7.0/_build/sub/src" --logbufsecs="0"
--logging_level="INFO" --max_completed_executors_per_framework="150" --memory_profiling="false"
--oversubscribed_resources_interval="15secs" --perf_duration="10secs" --perf_interval="1mins"
--port="5051" --qos_correction_interval_min="0ns" --quiet="false" --reconfiguration_policy="equal"
--recover="reconnect" --recovery_timeout="15mins" --registration_backoff_factor="10ms" --resources="cpus:2;gpus:0;mem:1024;disk:1024;ports:[31000-32000]"
--revocable_cpu_low_priority="true" --runtime_dir="/tmp/Endpoint_SlaveEndpointTest_NoAuthorizer_0_BC2XnR"
--sandbox_directory="/mnt/mesos/sandbox" --strict="true" --switch_user="true" --systemd_enable_support="true"
--systemd_runtime_directory="/run/systemd/system" --version="false" --work_dir="/tmp/Endpoint_SlaveEndpointTest_NoAuthorizer_0_vvUHu3"
--zk_session_timeout="10secs"
I0625 19:01:13.109105 18261 credentials.hpp:86] Loading credential for authentication from
'/tmp/Endpoint_SlaveEndpointTest_NoAuthorizer_0_BC2XnR/credential'
I0625 19:01:13.109300 18261 slave.cpp:301] Agent using credential for: test-principal
I0625 19:01:13.109333 18261 credentials.hpp:37] Loading credentials for authentication from
'/tmp/Endpoint_SlaveEndpointTest_NoAuthorizer_0_BC2XnR/http_credentials'
I0625 19:01:13.109597 18261 http.cpp:959] Creating default 'basic' HTTP authenticator for
realm 'mesos-agent-readonly'
I0625 19:01:13.109977 18261 disk_profile_adaptor.cpp:80] Creating default disk profile adaptor
module
I0625 19:01:13.111357 18261 slave.cpp:616] Agent resources: [{"name":"cpus","scalar":{"value":2.0},"type":"SCALAR"},{"name":"mem","scalar":{"value":1024.0},"type":"SCALAR"},{"name":"disk","scalar":{"value":1024.0},"type":"SCALAR"},{"name":"ports","ranges":{"range":[{"begin":31000,"end":32000}]},"type":"RANGES"}]
I0625 19:01:13.111574 18261 slave.cpp:624] Agent attributes: [  ]
I0625 19:01:13.111599 18261 slave.cpp:633] Agent hostname: d84c36706868
I0625 19:01:13.111775 18266 task_status_update_manager.cpp:181] Pausing sending task status
updates
I0625 19:01:13.113526 18280 state.cpp:66] Recovering state from '/tmp/Endpoint_SlaveEndpointTest_NoAuthorizer_0_vvUHu3/meta'
I0625 19:01:13.113731 18277 slave.cpp:6929] Finished recovering checkpointed state from '/tmp/Endpoint_SlaveEndpointTest_NoAuthorizer_0_vvUHu3/meta',
beginning agent recovery
I0625 19:01:13.113862 18283 task_status_update_manager.cpp:207] Recovering task status update
manager
I0625 19:01:13.114121 18262 containerizer.cpp:718] Recovering Mesos containers
I0625 19:01:13.114392 18262 containerizer.cpp:1025] Recovering isolators
I0625 19:01:13.115054 18271 containerizer.cpp:1064] Recovering provisioner
I0625 19:01:13.115877 18266 provisioner.cpp:494] Provisioner recovery complete
I0625 19:01:13.116600 18277 composing.cpp:339] Finished recovering all containerizers
I0625 19:01:13.116719 18283 slave.cpp:7158] Recovering executors
I0625 19:01:13.116885 18283 slave.cpp:7311] Finished recovery
I0625 19:01:13.120398 18272 process.cpp:3583] Handling HTTP event for process 'slave(1013)'
with path: '/slave(1013)/monitor/statistics'
I0625 19:01:13.122082 18280 http.cpp:1099] HTTP GET for /slave(1013)/monitor/statistics from
172.17.0.2:53080
I0625 19:01:13.122164 18280 http.cpp:936] Authorizing principal 'test-principal' to GET the
'/monitor/statistics' endpoint
I0625 19:01:13.124835 18282 slave.cpp:931] Agent terminating
[       OK ] Endpoint/SlaveEndpointTest.NoAuthorizer/0 (34 ms)
[ RUN      ] Endpoint/SlaveEndpointTest.NoAuthorizer/1
I0625 19:01:13.138315 18259 containerizer.cpp:300] Using isolation { environment_secret, posix/cpu,
posix/mem, filesystem/posix, network/cni }
W0625 19:01:13.138873 18259 backend.cpp:76] Failed to create 'aufs' backend: AufsBackend requires
root privileges
W0625 19:01:13.138902 18259 backend.cpp:76] Failed to create 'bind' backend: BindBackend requires
root privileges
I0625 19:01:13.138937 18259 provisioner.cpp:298] Using default backend 'copy'
I0625 19:01:13.140951 18259 cluster.cpp:479] Creating default 'local' authorizer
I0625 19:01:13.143167 18270 slave.cpp:268] Mesos agent started on (1014)@172.17.0.2:39920
I0625 19:01:13.143195 18270 slave.cpp:269] Flags at startup: --acls="" --appc_simple_discovery_uri_prefix="http://"
--appc_store_dir="/tmp/Endpoint_SlaveEndpointTest_NoAuthorizer_1_BLKGe5/store/appc" --authenticate_http_readonly="true"
--authenticate_http_readwrite="false" --authenticatee="crammd5" --authentication_backoff_factor="1secs"
--authorizer="local" --cgroups_cpu_enable_pids_and_tids_count="false" --cgroups_enable_cfs="false"
--cgroups_hierarchy="/sys/fs/cgroup" --cgroups_limit_swap="false" --cgroups_root="mesos" --container_disk_watch_interval="15secs"
--containerizers="mesos" --credential="/tmp/Endpoint_SlaveEndpointTest_NoAuthorizer_1_BLKGe5/credential"
--default_role="*" --disallow_sharing_agent_pid_namespace="false" --disk_watch_interval="1mins"
--docker="docker" --docker_kill_orphans="true" --docker_registry="https://registry-1.docker.io"
--docker_remove_delay="6hrs" --docker_socket="/var/run/docker.sock" --docker_stop_timeout="0ns"
--docker_store_dir="/tmp/Endpoint_SlaveEndpointTest_NoAuthorizer_1_BLKGe5/store/docker" --docker_volume_checkpoint_dir="/var/run/mesos/isolators/docker/volume"
--enforce_container_disk_quota="false" --executor_registration_timeout="1mins" --executor_reregistration_timeout="2secs"
--executor_shutdown_grace_period="5secs" --fetcher_cache_dir="/tmp/Endpoint_SlaveEndpointTest_NoAuthorizer_1_BLKGe5/fetch"
--fetcher_cache_size="2GB" --fetcher_stall_timeout="1mins" --frameworks_home="" --gc_delay="1weeks"
--gc_disk_headroom="0.1" --help="false" --hostname_lookup="true" --http_command_executor="false"
--http_credentials="/tmp/Endpoint_SlaveEndpointTest_NoAuthorizer_1_BLKGe5/http_credentials"
--http_heartbeat_interval="30secs" --initialize_driver_logging="true" --isolation="posix/cpu,posix/mem"
--launcher="posix" --launcher_dir="/tmp/SRC/build/mesos-1.7.0/_build/sub/src" --logbufsecs="0"
--logging_level="INFO" --max_completed_executors_per_framework="150" --memory_profiling="false"
--oversubscribed_resources_interval="15secs" --perf_duration="10secs" --perf_interval="1mins"
--port="5051" --qos_correction_interval_min="0ns" --quiet="false" --reconfiguration_policy="equal"
--recover="reconnect" --recovery_timeout="15mins" --registration_backoff_factor="10ms" --resources="cpus:2;gpus:0;mem:1024;disk:1024;ports:[31000-32000]"
--revocable_cpu_low_priority="true" --runtime_dir="/tmp/Endpoint_SlaveEndpointTest_NoAuthorizer_1_BLKGe5"
--sandbox_directory="/mnt/mesos/sandbox" --strict="true" --switch_user="true" --systemd_enable_support="true"
--systemd_runtime_directory="/run/systemd/system" --version="false" --work_dir="/tmp/Endpoint_SlaveEndpointTest_NoAuthorizer_1_lPXfgh"
--zk_session_timeout="10secs"
I0625 19:01:13.143630 18270 credentials.hpp:86] Loading credential for authentication from
'/tmp/Endpoint_SlaveEndpointTest_NoAuthorizer_1_BLKGe5/credential'
I0625 19:01:13.143846 18270 slave.cpp:301] Agent using credential for: test-principal
I0625 19:01:13.143872 18270 credentials.hpp:37] Loading credentials for authentication from
'/tmp/Endpoint_SlaveEndpointTest_NoAuthorizer_1_BLKGe5/http_credentials'
I0625 19:01:13.144100 18270 http.cpp:959] Creating default 'basic' HTTP authenticator for
realm 'mesos-agent-readonly'
I0625 19:01:13.144443 18270 disk_profile_adaptor.cpp:80] Creating default disk profile adaptor
module
I0625 19:01:13.145715 18270 slave.cpp:616] Agent resources: [{"name":"cpus","scalar":{"value":2.0},"type":"SCALAR"},{"name":"mem","scalar":{"value":1024.0},"type":"SCALAR"},{"name":"disk","scalar":{"value":1024.0},"type":"SCALAR"},{"name":"ports","ranges":{"range":[{"begin":31000,"end":32000}]},"type":"RANGES"}]
I0625 19:01:13.145925 18270 slave.cpp:624] Agent attributes: [  ]
I0625 19:01:13.145944 18270 slave.cpp:633] Agent hostname: d84c36706868
I0625 19:01:13.146107 18261 task_status_update_manager.cpp:181] Pausing sending task status
updates
I0625 19:01:13.147505 18275 state.cpp:66] Recovering state from '/tmp/Endpoint_SlaveEndpointTest_NoAuthorizer_1_lPXfgh/meta'
I0625 19:01:13.147711 18264 slave.cpp:6929] Finished recovering checkpointed state from '/tmp/Endpoint_SlaveEndpointTest_NoAuthorizer_1_lPXfgh/meta',
beginning agent recovery
I0625 19:01:13.147850 18280 task_status_update_manager.cpp:207] Recovering task status update
manager
I0625 19:01:13.148116 18260 containerizer.cpp:718] Recovering Mesos containers
I0625 19:01:13.148391 18260 containerizer.cpp:1025] Recovering isolators
I0625 19:01:13.148991 18277 containerizer.cpp:1064] Recovering provisioner
I0625 19:01:13.149760 18282 provisioner.cpp:494] Provisioner recovery complete
I0625 19:01:13.150429 18281 composing.cpp:339] Finished recovering all containerizers
I0625 19:01:13.150552 18264 slave.cpp:7158] Recovering executors
I0625 19:01:13.150688 18264 slave.cpp:7311] Finished recovery
I0625 19:01:13.154214 18276 process.cpp:3583] Handling HTTP event for process 'slave(1014)'
with path: '/slave(1014)/monitor/statistics.json'
I0625 19:01:13.155942 18275 http.cpp:1099] HTTP GET for /slave(1014)/monitor/statistics.json
from 172.17.0.2:53082
I0625 19:01:13.156018 18275 http.cpp:936] Authorizing principal 'test-principal' to GET the
'/monitor/statistics.json' endpoint
I0625 19:01:13.158629 18283 slave.cpp:931] Agent terminating
[       OK ] Endpoint/SlaveEndpointTest.NoAuthorizer/1 (33 ms)
[ RUN      ] Endpoint/SlaveEndpointTest.NoAuthorizer/2
I0625 19:01:13.171728 18259 containerizer.cpp:300] Using isolation { environment_secret, posix/cpu,
posix/mem, filesystem/posix, network/cni }
W0625 19:01:13.172291 18259 backend.cpp:76] Failed to create 'aufs' backend: AufsBackend requires
root privileges
W0625 19:01:13.172320 18259 backend.cpp:76] Failed to create 'bind' backend: BindBackend requires
root privileges
I0625 19:01:13.172353 18259 provisioner.cpp:298] Using default backend 'copy'
I0625 19:01:13.174294 18259 cluster.cpp:479] Creating default 'local' authorizer
I0625 19:01:13.176498 18271 slave.cpp:268] Mesos agent started on (1015)@172.17.0.2:39920
I0625 19:01:13.176524 18271 slave.cpp:269] Flags at startup: --acls="" --appc_simple_discovery_uri_prefix="http://"
--appc_store_dir="/tmp/Endpoint_SlaveEndpointTest_NoAuthorizer_2_3thnpj/store/appc" --authenticate_http_readonly="true"
--authenticate_http_readwrite="false" --authenticatee="crammd5" --authentication_backoff_factor="1secs"
--authorizer="local" --cgroups_cpu_enable_pids_and_tids_count="false" --cgroups_enable_cfs="false"
--cgroups_hierarchy="/sys/fs/cgroup" --cgroups_limit_swap="false" --cgroups_root="mesos" --container_disk_watch_interval="15secs"
--containerizers="mesos" --credential="/tmp/Endpoint_SlaveEndpointTest_NoAuthorizer_2_3thnpj/credential"
--default_role="*" --disallow_sharing_agent_pid_namespace="false" --disk_watch_interval="1mins"
--docker="docker" --docker_kill_orphans="true" --docker_registry="https://registry-1.docker.io"
--docker_remove_delay="6hrs" --docker_socket="/var/run/docker.sock" --docker_stop_timeout="0ns"
--docker_store_dir="/tmp/Endpoint_SlaveEndpointTest_NoAuthorizer_2_3thnpj/store/docker" --docker_volume_checkpoint_dir="/var/run/mesos/isolators/docker/volume"
--enforce_container_disk_quota="false" --executor_registration_timeout="1mins" --executor_reregistration_timeout="2secs"
--executor_shutdown_grace_period="5secs" --fetcher_cache_dir="/tmp/Endpoint_SlaveEndpointTest_NoAuthorizer_2_3thnpj/fetch"
--fetcher_cache_size="2GB" --fetcher_stall_timeout="1mins" --frameworks_home="" --gc_delay="1weeks"
--gc_disk_headroom="0.1" --help="false" --hostname_lookup="true" --http_command_executor="false"
--http_credentials="/tmp/Endpoint_SlaveEndpointTest_NoAuthorizer_2_3thnpj/http_credentials"
--http_heartbeat_interval="30secs" --initialize_driver_logging="true" --isolation="posix/cpu,posix/mem"
--launcher="posix" --launcher_dir="/tmp/SRC/build/mesos-1.7.0/_build/sub/src" --logbufsecs="0"
--logging_level="INFO" --max_completed_executors_per_framework="150" --memory_profiling="false"
--oversubscribed_resources_interval="15secs" --perf_duration="10secs" --perf_interval="1mins"
--port="5051" --qos_correction_interval_min="0ns" --quiet="false" --reconfiguration_policy="equal"
--recover="reconnect" --recovery_timeout="15mins" --registration_backoff_factor="10ms" --resources="cpus:2;gpus:0;mem:1024;disk:1024;ports:[31000-32000]"
--revocable_cpu_low_priority="true" --runtime_dir="/tmp/Endpoint_SlaveEndpointTest_NoAuthorizer_2_3thnpj"
--sandbox_directory="/mnt/mesos/sandbox" --strict="true" --switch_user="true" --systemd_enable_support="true"
--systemd_runtime_directory="/run/systemd/system" --version="false" --work_dir="/tmp/Endpoint_SlaveEndpointTest_NoAuthorizer_2_sPWXlv"
--zk_session_timeout="10secs"
I0625 19:01:13.176949 18271 credentials.hpp:86] Loading credential for authentication from
'/tmp/Endpoint_SlaveEndpointTest_NoAuthorizer_2_3thnpj/credential'
I0625 19:01:13.177129 18271 slave.cpp:301] Agent using credential for: test-principal
I0625 19:01:13.177155 18271 credentials.hpp:37] Loading credentials for authentication from
'/tmp/Endpoint_SlaveEndpointTest_NoAuthorizer_2_3thnpj/http_credentials'
I0625 19:01:13.177378 18271 http.cpp:959] Creating default 'basic' HTTP authenticator for
realm 'mesos-agent-readonly'
I0625 19:01:13.177706 18271 disk_profile_adaptor.cpp:80] Creating default disk profile adaptor
module
I0625 19:01:13.178962 18271 slave.cpp:616] Agent resources: [{"name":"cpus","scalar":{"value":2.0},"type":"SCALAR"},{"name":"mem","scalar":{"value":1024.0},"type":"SCALAR"},{"name":"disk","scalar":{"value":1024.0},"type":"SCALAR"},{"name":"ports","ranges":{"range":[{"begin":31000,"end":32000}]},"type":"RANGES"}]
I0625 19:01:13.179167 18271 slave.cpp:624] Agent attributes: [  ]
I0625 19:01:13.179184 18271 slave.cpp:633] Agent hostname: d84c36706868
I0625 19:01:13.179334 18269 task_status_update_manager.cpp:181] Pausing sending task status
updates
I0625 19:01:13.180871 18270 state.cpp:66] Recovering state from '/tmp/Endpoint_SlaveEndpointTest_NoAuthorizer_2_sPWXlv/meta'
I0625 19:01:13.181100 18275 slave.cpp:6929] Finished recovering checkpointed state from '/tmp/Endpoint_SlaveEndpointTest_NoAuthorizer_2_sPWXlv/meta',
beginning agent recovery
I0625 19:01:13.181260 18270 task_status_update_manager.cpp:207] Recovering task status update
manager
I0625 19:01:13.181545 18278 containerizer.cpp:718] Recovering Mesos containers
I0625 19:01:13.181833 18278 containerizer.cpp:1025] Recovering isolators
I0625 19:01:13.182400 18276 containerizer.cpp:1064] Recovering provisioner
I0625 19:01:13.183051 18268 provisioner.cpp:494] Provisioner recovery complete
I0625 19:01:13.183840 18275 composing.cpp:339] Finished recovering all containerizers
I0625 19:01:13.183971 18270 slave.cpp:7158] Recovering executors
I0625 19:01:13.184115 18270 slave.cpp:7311] Finished recovery
I0625 19:01:13.187642 18276 process.cpp:3583] Handling HTTP event for process 'slave(1015)'
with path: '/slave(1015)/containers'
I0625 19:01:13.189321 18273 http.cpp:1099] HTTP GET for /slave(1015)/containers from 172.17.0.2:53084
I0625 19:01:13.189396 18273 http.cpp:936] Authorizing principal 'test-principal' to GET the
'/containers' endpoint
I0625 19:01:13.193048 18269 slave.cpp:931] Agent terminating
[       OK ] Endpoint/SlaveEndpointTest.NoAuthorizer/2 (35 ms)
[----------] 9 tests from Endpoint/SlaveEndpointTest (302 ms total)

[----------] 2 tests from ContainerizerType/DefaultContainerDNSFlagTest
[ RUN      ] ContainerizerType/DefaultContainerDNSFlagTest.ValidateFlag/0
[       OK ] ContainerizerType/DefaultContainerDNSFlagTest.ValidateFlag/0 (11 ms)
[ RUN      ] ContainerizerType/DefaultContainerDNSFlagTest.ValidateFlag/1
[       OK ] ContainerizerType/DefaultContainerDNSFlagTest.ValidateFlag/1 (9 ms)
[----------] 2 tests from ContainerizerType/DefaultContainerDNSFlagTest (20 ms total)

[----------] Global test environment tear-down
[==========] 1965 tests from 201 test cases ran. (1022388 ms total)
[  PASSED  ] 1964 tests.
[  FAILED  ] 1 test, listed below:
[  FAILED  ] ExamplesTest.DynamicReservationFramework

 1 FAILED TEST
  YOU HAVE 22 DISABLED TESTS

I0625 19:01:13.277143 18284 process.cpp:940] Stopped the socket accept loop
Makefile:14789: recipe for target 'check-local' failed
make[4]: *** [check-local] Error 1
make[4]: Leaving directory '/tmp/SRC/build/mesos-1.7.0/_build/sub/src'
Makefile:13903: recipe for target 'check-am' failed
make[3]: *** [check-am] Error 2
make[3]: Leaving directory '/tmp/SRC/build/mesos-1.7.0/_build/sub/src'
Makefile:13907: recipe for target 'check' failed
make[2]: *** [check] Error 2
make[2]: Leaving directory '/tmp/SRC/build/mesos-1.7.0/_build/sub/src'
Makefile:777: recipe for target 'check-recursive' failed
make[1]: *** [check-recursive] Error 1
make[1]: Leaving directory '/tmp/SRC/build/mesos-1.7.0/_build/sub'
Makefile:983: recipe for target 'distcheck' failed
make: *** [distcheck] Error 1
Error response from daemon: conflict: unable to delete 4ecb5a128921 (cannot be forced) - image
is being used by running container 4b6fee207724
Build step 'Execute shell' marked build as failure


Mime
View raw message