mesos-builds mailing list archives

Site index · List index
Message view « Date » · « Thread »
Top « Date » · « Thread »
From Apache Jenkins Server <jenk...@builds.apache.org>
Subject Build failed in Jenkins: Mesos-Reviewbot #22809
Date Wed, 27 Jun 2018 03:53:50 GMT
See <https://builds.apache.org/job/Mesos-Reviewbot/22809/display/redirect>

------------------------------------------
[...truncated 37.44 MB...]
I0627 03:53:43.772368 18340 task_status_update_manager.cpp:207] Recovering task status update
manager
I0627 03:53:43.772758 18323 containerizer.cpp:718] Recovering Mesos containers
I0627 03:53:43.773160 18323 containerizer.cpp:1025] Recovering isolators
I0627 03:53:43.774001 18336 containerizer.cpp:1064] Recovering provisioner
I0627 03:53:43.774981 18330 provisioner.cpp:494] Provisioner recovery complete
I0627 03:53:43.775920 18322 composing.cpp:339] Finished recovering all containerizers
I0627 03:53:43.776123 18340 slave.cpp:7158] Recovering executors
I0627 03:53:43.776368 18340 slave.cpp:7311] Finished recovery
I0627 03:53:43.780342 18318 process.cpp:3583] Handling HTTP event for process 'slave(1009)'
with path: '/slave(1009)/containers'
I0627 03:53:43.782359 18337 http.cpp:1099] HTTP GET for /slave(1009)/containers from 172.17.0.2:51362
I0627 03:53:43.782460 18337 http.cpp:936] Authorizing principal 'test-principal' to GET the
'/containers' endpoint
I0627 03:53:43.787606 18322 slave.cpp:931] Agent terminating
[       OK ] Endpoint/SlaveEndpointTest.AuthorizedRequest/2 (44 ms)
[ RUN      ] Endpoint/SlaveEndpointTest.UnauthorizedRequest/0
I0627 03:53:43.806035 18316 containerizer.cpp:300] Using isolation { environment_secret, posix/cpu,
posix/mem, filesystem/posix, network/cni }
W0627 03:53:43.806905 18316 backend.cpp:76] Failed to create 'aufs' backend: AufsBackend requires
root privileges
W0627 03:53:43.806947 18316 backend.cpp:76] Failed to create 'bind' backend: BindBackend requires
root privileges
I0627 03:53:43.806993 18316 provisioner.cpp:298] Using default backend 'copy'
I0627 03:53:43.813179 18330 slave.cpp:268] Mesos agent started on (1010)@172.17.0.2:38688
I0627 03:53:43.813215 18330 slave.cpp:269] Flags at startup: --acls="" --appc_simple_discovery_uri_prefix="http://"
--appc_store_dir="/tmp/Endpoint_SlaveEndpointTest_UnauthorizedRequest_0_eGIBZx/store/appc"
--authenticate_http_readonly="true" --authenticate_http_readwrite="false" --authenticatee="crammd5"
--authentication_backoff_factor="1secs" --authorizer="local" --cgroups_cpu_enable_pids_and_tids_count="false"
--cgroups_enable_cfs="false" --cgroups_hierarchy="/sys/fs/cgroup" --cgroups_limit_swap="false"
--cgroups_root="mesos" --container_disk_watch_interval="15secs" --containerizers="mesos" --credential="/tmp/Endpoint_SlaveEndpointTest_UnauthorizedRequest_0_eGIBZx/credential"
--default_role="*" --disallow_sharing_agent_pid_namespace="false" --disk_watch_interval="1mins"
--docker="docker" --docker_kill_orphans="true" --docker_registry="https://registry-1.docker.io"
--docker_remove_delay="6hrs" --docker_socket="/var/run/docker.sock" --docker_stop_timeout="0ns"
--docker_store_dir="/tmp/Endpoint_SlaveEndpointTest_UnauthorizedRequest_0_eGIBZx/store/docker"
--docker_volume_checkpoint_dir="/var/run/mesos/isolators/docker/volume" --enforce_container_disk_quota="false"
--executor_registration_timeout="1mins" --executor_reregistration_timeout="2secs" --executor_shutdown_grace_period="5secs"
--fetcher_cache_dir="/tmp/Endpoint_SlaveEndpointTest_UnauthorizedRequest_0_eGIBZx/fetch" --fetcher_cache_size="2GB"
--fetcher_stall_timeout="1mins" --frameworks_home="" --gc_delay="1weeks" --gc_disk_headroom="0.1"
--help="false" --hostname_lookup="true" --http_command_executor="false" --http_credentials="/tmp/Endpoint_SlaveEndpointTest_UnauthorizedRequest_0_eGIBZx/http_credentials"
--http_heartbeat_interval="30secs" --initialize_driver_logging="true" --isolation="posix/cpu,posix/mem"
--launcher="posix" --launcher_dir="/tmp/SRC/build/mesos-1.7.0/_build/sub/src" --logbufsecs="0"
--logging_level="INFO" --max_completed_executors_per_framework="150" --memory_profiling="false"
--oversubscribed_resources_interval="15secs" --perf_duration="10secs" --perf_interval="1mins"
--port="5051" --qos_correction_interval_min="0ns" --quiet="false" --reconfiguration_policy="equal"
--recover="reconnect" --recovery_timeout="15mins" --registration_backoff_factor="10ms" --resources="cpus:2;gpus:0;mem:1024;disk:1024;ports:[31000-32000]"
--revocable_cpu_low_priority="true" --runtime_dir="/tmp/Endpoint_SlaveEndpointTest_UnauthorizedRequest_0_eGIBZx"
--sandbox_directory="/mnt/mesos/sandbox" --strict="true" --switch_user="true" --systemd_enable_support="true"
--systemd_runtime_directory="/run/systemd/system" --version="false" --work_dir="/tmp/Endpoint_SlaveEndpointTest_UnauthorizedRequest_0_xgBVZl"
--zk_session_timeout="10secs"
I0627 03:53:43.813819 18330 credentials.hpp:86] Loading credential for authentication from
'/tmp/Endpoint_SlaveEndpointTest_UnauthorizedRequest_0_eGIBZx/credential'
I0627 03:53:43.814057 18330 slave.cpp:301] Agent using credential for: test-principal
I0627 03:53:43.814091 18330 credentials.hpp:37] Loading credentials for authentication from
'/tmp/Endpoint_SlaveEndpointTest_UnauthorizedRequest_0_eGIBZx/http_credentials'
I0627 03:53:43.814430 18330 http.cpp:959] Creating default 'basic' HTTP authenticator for
realm 'mesos-agent-readonly'
I0627 03:53:43.814908 18330 disk_profile_adaptor.cpp:80] Creating default disk profile adaptor
module
I0627 03:53:43.816761 18330 slave.cpp:616] Agent resources: [{"name":"cpus","scalar":{"value":2.0},"type":"SCALAR"},{"name":"mem","scalar":{"value":1024.0},"type":"SCALAR"},{"name":"disk","scalar":{"value":1024.0},"type":"SCALAR"},{"name":"ports","ranges":{"range":[{"begin":31000,"end":32000}]},"type":"RANGES"}]
I0627 03:53:43.817024 18330 slave.cpp:624] Agent attributes: [  ]
I0627 03:53:43.817044 18330 slave.cpp:633] Agent hostname: a01f3ec15d7f
I0627 03:53:43.817227 18320 task_status_update_manager.cpp:181] Pausing sending task status
updates
I0627 03:53:43.819108 18337 state.cpp:66] Recovering state from '/tmp/Endpoint_SlaveEndpointTest_UnauthorizedRequest_0_xgBVZl/meta'
I0627 03:53:43.819337 18324 slave.cpp:6929] Finished recovering checkpointed state from '/tmp/Endpoint_SlaveEndpointTest_UnauthorizedRequest_0_xgBVZl/meta',
beginning agent recovery
I0627 03:53:43.819510 18340 task_status_update_manager.cpp:207] Recovering task status update
manager
I0627 03:53:43.819885 18326 containerizer.cpp:718] Recovering Mesos containers
I0627 03:53:43.820276 18326 containerizer.cpp:1025] Recovering isolators
I0627 03:53:43.821138 18329 containerizer.cpp:1064] Recovering provisioner
I0627 03:53:43.822122 18318 provisioner.cpp:494] Provisioner recovery complete
I0627 03:53:43.823094 18324 composing.cpp:339] Finished recovering all containerizers
I0627 03:53:43.823299 18340 slave.cpp:7158] Recovering executors
I0627 03:53:43.823537 18340 slave.cpp:7311] Finished recovery
I0627 03:53:43.827361 18333 process.cpp:3583] Handling HTTP event for process 'slave(1010)'
with path: '/slave(1010)/monitor/statistics'
I0627 03:53:43.829895 18337 http.cpp:1099] HTTP GET for /slave(1010)/monitor/statistics from
172.17.0.2:51364
I0627 03:53:43.830041 18337 http.cpp:936] Authorizing principal 'test-principal' to GET the
'/monitor/statistics' endpoint
I0627 03:53:43.832895 18322 slave.cpp:931] Agent terminating
[       OK ] Endpoint/SlaveEndpointTest.UnauthorizedRequest/0 (48 ms)
[ RUN      ] Endpoint/SlaveEndpointTest.UnauthorizedRequest/1
I0627 03:53:43.856043 18316 containerizer.cpp:300] Using isolation { environment_secret, posix/cpu,
posix/mem, filesystem/posix, network/cni }
W0627 03:53:43.857094 18316 backend.cpp:76] Failed to create 'aufs' backend: AufsBackend requires
root privileges
W0627 03:53:43.857143 18316 backend.cpp:76] Failed to create 'bind' backend: BindBackend requires
root privileges
I0627 03:53:43.857197 18316 provisioner.cpp:298] Using default backend 'copy'
I0627 03:53:43.863904 18339 slave.cpp:268] Mesos agent started on (1011)@172.17.0.2:38688
I0627 03:53:43.863948 18339 slave.cpp:269] Flags at startup: --acls="" --appc_simple_discovery_uri_prefix="http://"
--appc_store_dir="/tmp/Endpoint_SlaveEndpointTest_UnauthorizedRequest_1_r3STlk/store/appc"
--authenticate_http_readonly="true" --authenticate_http_readwrite="false" --authenticatee="crammd5"
--authentication_backoff_factor="1secs" --authorizer="local" --cgroups_cpu_enable_pids_and_tids_count="false"
--cgroups_enable_cfs="false" --cgroups_hierarchy="/sys/fs/cgroup" --cgroups_limit_swap="false"
--cgroups_root="mesos" --container_disk_watch_interval="15secs" --containerizers="mesos" --credential="/tmp/Endpoint_SlaveEndpointTest_UnauthorizedRequest_1_r3STlk/credential"
--default_role="*" --disallow_sharing_agent_pid_namespace="false" --disk_watch_interval="1mins"
--docker="docker" --docker_kill_orphans="true" --docker_registry="https://registry-1.docker.io"
--docker_remove_delay="6hrs" --docker_socket="/var/run/docker.sock" --docker_stop_timeout="0ns"
--docker_store_dir="/tmp/Endpoint_SlaveEndpointTest_UnauthorizedRequest_1_r3STlk/store/docker"
--docker_volume_checkpoint_dir="/var/run/mesos/isolators/docker/volume" --enforce_container_disk_quota="false"
--executor_registration_timeout="1mins" --executor_reregistration_timeout="2secs" --executor_shutdown_grace_period="5secs"
--fetcher_cache_dir="/tmp/Endpoint_SlaveEndpointTest_UnauthorizedRequest_1_r3STlk/fetch" --fetcher_cache_size="2GB"
--fetcher_stall_timeout="1mins" --frameworks_home="" --gc_delay="1weeks" --gc_disk_headroom="0.1"
--help="false" --hostname_lookup="true" --http_command_executor="false" --http_credentials="/tmp/Endpoint_SlaveEndpointTest_UnauthorizedRequest_1_r3STlk/http_credentials"
--http_heartbeat_interval="30secs" --initialize_driver_logging="true" --isolation="posix/cpu,posix/mem"
--launcher="posix" --launcher_dir="/tmp/SRC/build/mesos-1.7.0/_build/sub/src" --logbufsecs="0"
--logging_level="INFO" --max_completed_executors_per_framework="150" --memory_profiling="false"
--oversubscribed_resources_interval="15secs" --perf_duration="10secs" --perf_interval="1mins"
--port="5051" --qos_correction_interval_min="0ns" --quiet="false" --reconfiguration_policy="equal"
--recover="reconnect" --recovery_timeout="15mins" --registration_backoff_factor="10ms" --resources="cpus:2;gpus:0;mem:1024;disk:1024;ports:[31000-32000]"
--revocable_cpu_low_priority="true" --runtime_dir="/tmp/Endpoint_SlaveEndpointTest_UnauthorizedRequest_1_r3STlk"
--sandbox_directory="/mnt/mesos/sandbox" --strict="true" --switch_user="true" --systemd_enable_support="true"
--systemd_runtime_directory="/run/systemd/system" --version="false" --work_dir="/tmp/Endpoint_SlaveEndpointTest_UnauthorizedRequest_1_FRRdf8"
--zk_session_timeout="10secs"
I0627 03:53:43.864637 18339 credentials.hpp:86] Loading credential for authentication from
'/tmp/Endpoint_SlaveEndpointTest_UnauthorizedRequest_1_r3STlk/credential'
I0627 03:53:43.864874 18339 slave.cpp:301] Agent using credential for: test-principal
I0627 03:53:43.864912 18339 credentials.hpp:37] Loading credentials for authentication from
'/tmp/Endpoint_SlaveEndpointTest_UnauthorizedRequest_1_r3STlk/http_credentials'
I0627 03:53:43.865260 18339 http.cpp:959] Creating default 'basic' HTTP authenticator for
realm 'mesos-agent-readonly'
I0627 03:53:43.865762 18339 disk_profile_adaptor.cpp:80] Creating default disk profile adaptor
module
I0627 03:53:43.867858 18339 slave.cpp:616] Agent resources: [{"name":"cpus","scalar":{"value":2.0},"type":"SCALAR"},{"name":"mem","scalar":{"value":1024.0},"type":"SCALAR"},{"name":"disk","scalar":{"value":1024.0},"type":"SCALAR"},{"name":"ports","ranges":{"range":[{"begin":31000,"end":32000}]},"type":"RANGES"}]
I0627 03:53:43.868207 18339 slave.cpp:624] Agent attributes: [  ]
I0627 03:53:43.868232 18339 slave.cpp:633] Agent hostname: a01f3ec15d7f
I0627 03:53:43.868469 18317 task_status_update_manager.cpp:181] Pausing sending task status
updates
I0627 03:53:43.870781 18338 state.cpp:66] Recovering state from '/tmp/Endpoint_SlaveEndpointTest_UnauthorizedRequest_1_FRRdf8/meta'
I0627 03:53:43.871073 18337 slave.cpp:6929] Finished recovering checkpointed state from '/tmp/Endpoint_SlaveEndpointTest_UnauthorizedRequest_1_FRRdf8/meta',
beginning agent recovery
I0627 03:53:43.871289 18338 task_status_update_manager.cpp:207] Recovering task status update
manager
I0627 03:53:43.871742 18327 containerizer.cpp:718] Recovering Mesos containers
I0627 03:53:43.872205 18327 containerizer.cpp:1025] Recovering isolators
I0627 03:53:43.873116 18335 containerizer.cpp:1064] Recovering provisioner
I0627 03:53:43.874179 18340 provisioner.cpp:494] Provisioner recovery complete
I0627 03:53:43.875229 18337 composing.cpp:339] Finished recovering all containerizers
I0627 03:53:43.875449 18338 slave.cpp:7158] Recovering executors
I0627 03:53:43.875694 18338 slave.cpp:7311] Finished recovery
I0627 03:53:43.880507 18330 process.cpp:3583] Handling HTTP event for process 'slave(1011)'
with path: '/slave(1011)/monitor/statistics.json'
I0627 03:53:43.882766 18323 http.cpp:1099] HTTP GET for /slave(1011)/monitor/statistics.json
from 172.17.0.2:51366
I0627 03:53:43.882885 18323 http.cpp:936] Authorizing principal 'test-principal' to GET the
'/monitor/statistics.json' endpoint
I0627 03:53:43.885114 18322 slave.cpp:931] Agent terminating
[       OK ] Endpoint/SlaveEndpointTest.UnauthorizedRequest/1 (48 ms)
[ RUN      ] Endpoint/SlaveEndpointTest.UnauthorizedRequest/2
I0627 03:53:43.901994 18316 containerizer.cpp:300] Using isolation { environment_secret, posix/cpu,
posix/mem, filesystem/posix, network/cni }
W0627 03:53:43.902742 18316 backend.cpp:76] Failed to create 'aufs' backend: AufsBackend requires
root privileges
W0627 03:53:43.902776 18316 backend.cpp:76] Failed to create 'bind' backend: BindBackend requires
root privileges
I0627 03:53:43.902814 18316 provisioner.cpp:298] Using default backend 'copy'
I0627 03:53:43.907616 18337 slave.cpp:268] Mesos agent started on (1012)@172.17.0.2:38688
I0627 03:53:43.907650 18337 slave.cpp:269] Flags at startup: --acls="" --appc_simple_discovery_uri_prefix="http://"
--appc_store_dir="/tmp/Endpoint_SlaveEndpointTest_UnauthorizedRequest_2_eIb296/store/appc"
--authenticate_http_readonly="true" --authenticate_http_readwrite="false" --authenticatee="crammd5"
--authentication_backoff_factor="1secs" --authorizer="local" --cgroups_cpu_enable_pids_and_tids_count="false"
--cgroups_enable_cfs="false" --cgroups_hierarchy="/sys/fs/cgroup" --cgroups_limit_swap="false"
--cgroups_root="mesos" --container_disk_watch_interval="15secs" --containerizers="mesos" --credential="/tmp/Endpoint_SlaveEndpointTest_UnauthorizedRequest_2_eIb296/credential"
--default_role="*" --disallow_sharing_agent_pid_namespace="false" --disk_watch_interval="1mins"
--docker="docker" --docker_kill_orphans="true" --docker_registry="https://registry-1.docker.io"
--docker_remove_delay="6hrs" --docker_socket="/var/run/docker.sock" --docker_stop_timeout="0ns"
--docker_store_dir="/tmp/Endpoint_SlaveEndpointTest_UnauthorizedRequest_2_eIb296/store/docker"
--docker_volume_checkpoint_dir="/var/run/mesos/isolators/docker/volume" --enforce_container_disk_quota="false"
--executor_registration_timeout="1mins" --executor_reregistration_timeout="2secs" --executor_shutdown_grace_period="5secs"
--fetcher_cache_dir="/tmp/Endpoint_SlaveEndpointTest_UnauthorizedRequest_2_eIb296/fetch" --fetcher_cache_size="2GB"
--fetcher_stall_timeout="1mins" --frameworks_home="" --gc_delay="1weeks" --gc_disk_headroom="0.1"
--help="false" --hostname_lookup="true" --http_command_executor="false" --http_credentials="/tmp/Endpoint_SlaveEndpointTest_UnauthorizedRequest_2_eIb296/http_credentials"
--http_heartbeat_interval="30secs" --initialize_driver_logging="true" --isolation="posix/cpu,posix/mem"
--launcher="posix" --launcher_dir="/tmp/SRC/build/mesos-1.7.0/_build/sub/src" --logbufsecs="0"
--logging_level="INFO" --max_completed_executors_per_framework="150" --memory_profiling="false"
--oversubscribed_resources_interval="15secs" --perf_duration="10secs" --perf_interval="1mins"
--port="5051" --qos_correction_interval_min="0ns" --quiet="false" --reconfiguration_policy="equal"
--recover="reconnect" --recovery_timeout="15mins" --registration_backoff_factor="10ms" --resources="cpus:2;gpus:0;mem:1024;disk:1024;ports:[31000-32000]"
--revocable_cpu_low_priority="true" --runtime_dir="/tmp/Endpoint_SlaveEndpointTest_UnauthorizedRequest_2_eIb296"
--sandbox_directory="/mnt/mesos/sandbox" --strict="true" --switch_user="true" --systemd_enable_support="true"
--systemd_runtime_directory="/run/systemd/system" --version="false" --work_dir="/tmp/Endpoint_SlaveEndpointTest_UnauthorizedRequest_2_mgoBWU"
--zk_session_timeout="10secs"
I0627 03:53:43.908202 18337 credentials.hpp:86] Loading credential for authentication from
'/tmp/Endpoint_SlaveEndpointTest_UnauthorizedRequest_2_eIb296/credential'
I0627 03:53:43.908398 18337 slave.cpp:301] Agent using credential for: test-principal
I0627 03:53:43.908438 18337 credentials.hpp:37] Loading credentials for authentication from
'/tmp/Endpoint_SlaveEndpointTest_UnauthorizedRequest_2_eIb296/http_credentials'
I0627 03:53:43.908751 18337 http.cpp:959] Creating default 'basic' HTTP authenticator for
realm 'mesos-agent-readonly'
I0627 03:53:43.909164 18337 disk_profile_adaptor.cpp:80] Creating default disk profile adaptor
module
I0627 03:53:43.910809 18337 slave.cpp:616] Agent resources: [{"name":"cpus","scalar":{"value":2.0},"type":"SCALAR"},{"name":"mem","scalar":{"value":1024.0},"type":"SCALAR"},{"name":"disk","scalar":{"value":1024.0},"type":"SCALAR"},{"name":"ports","ranges":{"range":[{"begin":31000,"end":32000}]},"type":"RANGES"}]
I0627 03:53:43.911069 18337 slave.cpp:624] Agent attributes: [  ]
I0627 03:53:43.911087 18337 slave.cpp:633] Agent hostname: a01f3ec15d7f
I0627 03:53:43.911262 18326 task_status_update_manager.cpp:181] Pausing sending task status
updates
I0627 03:53:43.913033 18317 state.cpp:66] Recovering state from '/tmp/Endpoint_SlaveEndpointTest_UnauthorizedRequest_2_mgoBWU/meta'
I0627 03:53:43.913242 18330 slave.cpp:6929] Finished recovering checkpointed state from '/tmp/Endpoint_SlaveEndpointTest_UnauthorizedRequest_2_mgoBWU/meta',
beginning agent recovery
I0627 03:53:43.913445 18334 task_status_update_manager.cpp:207] Recovering task status update
manager
I0627 03:53:43.913753 18339 containerizer.cpp:718] Recovering Mesos containers
I0627 03:53:43.914060 18339 containerizer.cpp:1025] Recovering isolators
I0627 03:53:43.914726 18321 containerizer.cpp:1064] Recovering provisioner
I0627 03:53:43.915508 18336 provisioner.cpp:494] Provisioner recovery complete
I0627 03:53:43.916316 18319 composing.cpp:339] Finished recovering all containerizers
I0627 03:53:43.916524 18330 slave.cpp:7158] Recovering executors
I0627 03:53:43.916688 18330 slave.cpp:7311] Finished recovery
I0627 03:53:43.919931 18321 process.cpp:3583] Handling HTTP event for process 'slave(1012)'
with path: '/slave(1012)/containers'
I0627 03:53:43.921787 18328 http.cpp:1099] HTTP GET for /slave(1012)/containers from 172.17.0.2:51368
I0627 03:53:43.921913 18328 http.cpp:936] Authorizing principal 'test-principal' to GET the
'/containers' endpoint
I0627 03:53:43.923771 18329 slave.cpp:931] Agent terminating
[       OK ] Endpoint/SlaveEndpointTest.UnauthorizedRequest/2 (35 ms)
[ RUN      ] Endpoint/SlaveEndpointTest.NoAuthorizer/0
I0627 03:53:43.937445 18316 containerizer.cpp:300] Using isolation { environment_secret, posix/cpu,
posix/mem, filesystem/posix, network/cni }
W0627 03:53:43.938027 18316 backend.cpp:76] Failed to create 'aufs' backend: AufsBackend requires
root privileges
W0627 03:53:43.938056 18316 backend.cpp:76] Failed to create 'bind' backend: BindBackend requires
root privileges
I0627 03:53:43.938091 18316 provisioner.cpp:298] Using default backend 'copy'
I0627 03:53:43.940171 18316 cluster.cpp:479] Creating default 'local' authorizer
I0627 03:53:43.943086 18324 slave.cpp:268] Mesos agent started on (1013)@172.17.0.2:38688
I0627 03:53:43.943115 18324 slave.cpp:269] Flags at startup: --acls="" --appc_simple_discovery_uri_prefix="http://"
--appc_store_dir="/tmp/Endpoint_SlaveEndpointTest_NoAuthorizer_0_HJijjU/store/appc" --authenticate_http_readonly="true"
--authenticate_http_readwrite="false" --authenticatee="crammd5" --authentication_backoff_factor="1secs"
--authorizer="local" --cgroups_cpu_enable_pids_and_tids_count="false" --cgroups_enable_cfs="false"
--cgroups_hierarchy="/sys/fs/cgroup" --cgroups_limit_swap="false" --cgroups_root="mesos" --container_disk_watch_interval="15secs"
--containerizers="mesos" --credential="/tmp/Endpoint_SlaveEndpointTest_NoAuthorizer_0_HJijjU/credential"
--default_role="*" --disallow_sharing_agent_pid_namespace="false" --disk_watch_interval="1mins"
--docker="docker" --docker_kill_orphans="true" --docker_registry="https://registry-1.docker.io"
--docker_remove_delay="6hrs" --docker_socket="/var/run/docker.sock" --docker_stop_timeout="0ns"
--docker_store_dir="/tmp/Endpoint_SlaveEndpointTest_NoAuthorizer_0_HJijjU/store/docker" --docker_volume_checkpoint_dir="/var/run/mesos/isolators/docker/volume"
--enforce_container_disk_quota="false" --executor_registration_timeout="1mins" --executor_reregistration_timeout="2secs"
--executor_shutdown_grace_period="5secs" --fetcher_cache_dir="/tmp/Endpoint_SlaveEndpointTest_NoAuthorizer_0_HJijjU/fetch"
--fetcher_cache_size="2GB" --fetcher_stall_timeout="1mins" --frameworks_home="" --gc_delay="1weeks"
--gc_disk_headroom="0.1" --help="false" --hostname_lookup="true" --http_command_executor="false"
--http_credentials="/tmp/Endpoint_SlaveEndpointTest_NoAuthorizer_0_HJijjU/http_credentials"
--http_heartbeat_interval="30secs" --initialize_driver_logging="true" --isolation="posix/cpu,posix/mem"
--launcher="posix" --launcher_dir="/tmp/SRC/build/mesos-1.7.0/_build/sub/src" --logbufsecs="0"
--logging_level="INFO" --max_completed_executors_per_framework="150" --memory_profiling="false"
--oversubscribed_resources_interval="15secs" --perf_duration="10secs" --perf_interval="1mins"
--port="5051" --qos_correction_interval_min="0ns" --quiet="false" --reconfiguration_policy="equal"
--recover="reconnect" --recovery_timeout="15mins" --registration_backoff_factor="10ms" --resources="cpus:2;gpus:0;mem:1024;disk:1024;ports:[31000-32000]"
--revocable_cpu_low_priority="true" --runtime_dir="/tmp/Endpoint_SlaveEndpointTest_NoAuthorizer_0_HJijjU"
--sandbox_directory="/mnt/mesos/sandbox" --strict="true" --switch_user="true" --systemd_enable_support="true"
--systemd_runtime_directory="/run/systemd/system" --version="false" --work_dir="/tmp/Endpoint_SlaveEndpointTest_NoAuthorizer_0_hDuN0H"
--zk_session_timeout="10secs"
I0627 03:53:43.943534 18324 credentials.hpp:86] Loading credential for authentication from
'/tmp/Endpoint_SlaveEndpointTest_NoAuthorizer_0_HJijjU/credential'
I0627 03:53:43.943696 18324 slave.cpp:301] Agent using credential for: test-principal
I0627 03:53:43.943722 18324 credentials.hpp:37] Loading credentials for authentication from
'/tmp/Endpoint_SlaveEndpointTest_NoAuthorizer_0_HJijjU/http_credentials'
I0627 03:53:43.943958 18324 http.cpp:959] Creating default 'basic' HTTP authenticator for
realm 'mesos-agent-readonly'
I0627 03:53:43.944341 18324 disk_profile_adaptor.cpp:80] Creating default disk profile adaptor
module
I0627 03:53:43.945775 18324 slave.cpp:616] Agent resources: [{"name":"cpus","scalar":{"value":2.0},"type":"SCALAR"},{"name":"mem","scalar":{"value":1024.0},"type":"SCALAR"},{"name":"disk","scalar":{"value":1024.0},"type":"SCALAR"},{"name":"ports","ranges":{"range":[{"begin":31000,"end":32000}]},"type":"RANGES"}]
I0627 03:53:43.946004 18324 slave.cpp:624] Agent attributes: [  ]
I0627 03:53:43.946022 18324 slave.cpp:633] Agent hostname: a01f3ec15d7f
I0627 03:53:43.946179 18339 task_status_update_manager.cpp:181] Pausing sending task status
updates
I0627 03:53:43.947844 18333 state.cpp:66] Recovering state from '/tmp/Endpoint_SlaveEndpointTest_NoAuthorizer_0_hDuN0H/meta'
I0627 03:53:43.948040 18340 slave.cpp:6929] Finished recovering checkpointed state from '/tmp/Endpoint_SlaveEndpointTest_NoAuthorizer_0_hDuN0H/meta',
beginning agent recovery
I0627 03:53:43.948230 18336 task_status_update_manager.cpp:207] Recovering task status update
manager
I0627 03:53:43.948532 18334 containerizer.cpp:718] Recovering Mesos containers
I0627 03:53:43.948833 18334 containerizer.cpp:1025] Recovering isolators
I0627 03:53:43.949456 18322 containerizer.cpp:1064] Recovering provisioner
I0627 03:53:43.950178 18325 provisioner.cpp:494] Provisioner recovery complete
I0627 03:53:43.950850 18328 composing.cpp:339] Finished recovering all containerizers
I0627 03:53:43.950978 18340 slave.cpp:7158] Recovering executors
I0627 03:53:43.951126 18340 slave.cpp:7311] Finished recovery
I0627 03:53:43.954200 18322 process.cpp:3583] Handling HTTP event for process 'slave(1013)'
with path: '/slave(1013)/monitor/statistics'
I0627 03:53:43.955900 18327 http.cpp:1099] HTTP GET for /slave(1013)/monitor/statistics from
172.17.0.2:51370
I0627 03:53:43.955983 18327 http.cpp:936] Authorizing principal 'test-principal' to GET the
'/monitor/statistics' endpoint
I0627 03:53:43.958858 18316 slave.cpp:931] Agent terminating
[       OK ] Endpoint/SlaveEndpointTest.NoAuthorizer/0 (38 ms)
[ RUN      ] Endpoint/SlaveEndpointTest.NoAuthorizer/1
I0627 03:53:43.978798 18316 containerizer.cpp:300] Using isolation { environment_secret, posix/cpu,
posix/mem, filesystem/posix, network/cni }
W0627 03:53:43.979670 18316 backend.cpp:76] Failed to create 'aufs' backend: AufsBackend requires
root privileges
W0627 03:53:43.979712 18316 backend.cpp:76] Failed to create 'bind' backend: BindBackend requires
root privileges
I0627 03:53:43.979760 18316 provisioner.cpp:298] Using default backend 'copy'
I0627 03:53:43.982846 18316 cluster.cpp:479] Creating default 'local' authorizer
I0627 03:53:43.986069 18330 slave.cpp:268] Mesos agent started on (1014)@172.17.0.2:38688
I0627 03:53:43.986114 18330 slave.cpp:269] Flags at startup: --acls="" --appc_simple_discovery_uri_prefix="http://"
--appc_store_dir="/tmp/Endpoint_SlaveEndpointTest_NoAuthorizer_1_bOefOH/store/appc" --authenticate_http_readonly="true"
--authenticate_http_readwrite="false" --authenticatee="crammd5" --authentication_backoff_factor="1secs"
--authorizer="local" --cgroups_cpu_enable_pids_and_tids_count="false" --cgroups_enable_cfs="false"
--cgroups_hierarchy="/sys/fs/cgroup" --cgroups_limit_swap="false" --cgroups_root="mesos" --container_disk_watch_interval="15secs"
--containerizers="mesos" --credential="/tmp/Endpoint_SlaveEndpointTest_NoAuthorizer_1_bOefOH/credential"
--default_role="*" --disallow_sharing_agent_pid_namespace="false" --disk_watch_interval="1mins"
--docker="docker" --docker_kill_orphans="true" --docker_registry="https://registry-1.docker.io"
--docker_remove_delay="6hrs" --docker_socket="/var/run/docker.sock" --docker_stop_timeout="0ns"
--docker_store_dir="/tmp/Endpoint_SlaveEndpointTest_NoAuthorizer_1_bOefOH/store/docker" --docker_volume_checkpoint_dir="/var/run/mesos/isolators/docker/volume"
--enforce_container_disk_quota="false" --executor_registration_timeout="1mins" --executor_reregistration_timeout="2secs"
--executor_shutdown_grace_period="5secs" --fetcher_cache_dir="/tmp/Endpoint_SlaveEndpointTest_NoAuthorizer_1_bOefOH/fetch"
--fetcher_cache_size="2GB" --fetcher_stall_timeout="1mins" --frameworks_home="" --gc_delay="1weeks"
--gc_disk_headroom="0.1" --help="false" --hostname_lookup="true" --http_command_executor="false"
--http_credentials="/tmp/Endpoint_SlaveEndpointTest_NoAuthorizer_1_bOefOH/http_credentials"
--http_heartbeat_interval="30secs" --initialize_driver_logging="true" --isolation="posix/cpu,posix/mem"
--launcher="posix" --launcher_dir="/tmp/SRC/build/mesos-1.7.0/_build/sub/src" --logbufsecs="0"
--logging_level="INFO" --max_completed_executors_per_framework="150" --memory_profiling="false"
--oversubscribed_resources_interval="15secs" --perf_duration="10secs" --perf_interval="1mins"
--port="5051" --qos_correction_interval_min="0ns" --quiet="false" --reconfiguration_policy="equal"
--recover="reconnect" --recovery_timeout="15mins" --registration_backoff_factor="10ms" --resources="cpus:2;gpus:0;mem:1024;disk:1024;ports:[31000-32000]"
--revocable_cpu_low_priority="true" --runtime_dir="/tmp/Endpoint_SlaveEndpointTest_NoAuthorizer_1_bOefOH"
--sandbox_directory="/mnt/mesos/sandbox" --strict="true" --switch_user="true" --systemd_enable_support="true"
--systemd_runtime_directory="/run/systemd/system" --version="false" --work_dir="/tmp/Endpoint_SlaveEndpointTest_NoAuthorizer_1_ZKd6pv"
--zk_session_timeout="10secs"
I0627 03:53:43.986721 18330 credentials.hpp:86] Loading credential for authentication from
'/tmp/Endpoint_SlaveEndpointTest_NoAuthorizer_1_bOefOH/credential'
I0627 03:53:43.986958 18330 slave.cpp:301] Agent using credential for: test-principal
I0627 03:53:43.987002 18330 credentials.hpp:37] Loading credentials for authentication from
'/tmp/Endpoint_SlaveEndpointTest_NoAuthorizer_1_bOefOH/http_credentials'
I0627 03:53:43.987365 18330 http.cpp:959] Creating default 'basic' HTTP authenticator for
realm 'mesos-agent-readonly'
I0627 03:53:43.987888 18330 disk_profile_adaptor.cpp:80] Creating default disk profile adaptor
module
I0627 03:53:43.990010 18330 slave.cpp:616] Agent resources: [{"name":"cpus","scalar":{"value":2.0},"type":"SCALAR"},{"name":"mem","scalar":{"value":1024.0},"type":"SCALAR"},{"name":"disk","scalar":{"value":1024.0},"type":"SCALAR"},{"name":"ports","ranges":{"range":[{"begin":31000,"end":32000}]},"type":"RANGES"}]
I0627 03:53:43.990350 18330 slave.cpp:624] Agent attributes: [  ]
I0627 03:53:43.990383 18330 slave.cpp:633] Agent hostname: a01f3ec15d7f
I0627 03:53:43.990587 18335 task_status_update_manager.cpp:181] Pausing sending task status
updates
I0627 03:53:43.993427 18336 state.cpp:66] Recovering state from '/tmp/Endpoint_SlaveEndpointTest_NoAuthorizer_1_ZKd6pv/meta'
I0627 03:53:43.993798 18320 slave.cpp:6929] Finished recovering checkpointed state from '/tmp/Endpoint_SlaveEndpointTest_NoAuthorizer_1_ZKd6pv/meta',
beginning agent recovery
I0627 03:53:43.994091 18336 task_status_update_manager.cpp:207] Recovering task status update
manager
I0627 03:53:43.994565 18329 containerizer.cpp:718] Recovering Mesos containers
I0627 03:53:43.995050 18329 containerizer.cpp:1025] Recovering isolators
I0627 03:53:43.996157 18338 containerizer.cpp:1064] Recovering provisioner
I0627 03:53:43.997383 18328 provisioner.cpp:494] Provisioner recovery complete
I0627 03:53:43.998585 18321 composing.cpp:339] Finished recovering all containerizers
I0627 03:53:43.998806 18336 slave.cpp:7158] Recovering executors
I0627 03:53:43.999084 18336 slave.cpp:7311] Finished recovery
I0627 03:53:44.003445 18338 process.cpp:3583] Handling HTTP event for process 'slave(1014)'
with path: '/slave(1014)/monitor/statistics.json'
I0627 03:53:44.006054 18320 http.cpp:1099] HTTP GET for /slave(1014)/monitor/statistics.json
from 172.17.0.2:51372
I0627 03:53:44.006201 18320 http.cpp:936] Authorizing principal 'test-principal' to GET the
'/monitor/statistics.json' endpoint
I0627 03:53:44.010722 18335 slave.cpp:931] Agent terminating
[       OK ] Endpoint/SlaveEndpointTest.NoAuthorizer/1 (53 ms)
[ RUN      ] Endpoint/SlaveEndpointTest.NoAuthorizer/2
I0627 03:53:44.033792 18316 containerizer.cpp:300] Using isolation { environment_secret, posix/cpu,
posix/mem, filesystem/posix, network/cni }
W0627 03:53:44.034729 18316 backend.cpp:76] Failed to create 'aufs' backend: AufsBackend requires
root privileges
W0627 03:53:44.034775 18316 backend.cpp:76] Failed to create 'bind' backend: BindBackend requires
root privileges
I0627 03:53:44.034828 18316 provisioner.cpp:298] Using default backend 'copy'
I0627 03:53:44.038290 18316 cluster.cpp:479] Creating default 'local' authorizer
I0627 03:53:44.041877 18318 slave.cpp:268] Mesos agent started on (1015)@172.17.0.2:38688
I0627 03:53:44.041923 18318 slave.cpp:269] Flags at startup: --acls="" --appc_simple_discovery_uri_prefix="http://"
--appc_store_dir="/tmp/Endpoint_SlaveEndpointTest_NoAuthorizer_2_1MGcNv/store/appc" --authenticate_http_readonly="true"
--authenticate_http_readwrite="false" --authenticatee="crammd5" --authentication_backoff_factor="1secs"
--authorizer="local" --cgroups_cpu_enable_pids_and_tids_count="false" --cgroups_enable_cfs="false"
--cgroups_hierarchy="/sys/fs/cgroup" --cgroups_limit_swap="false" --cgroups_root="mesos" --container_disk_watch_interval="15secs"
--containerizers="mesos" --credential="/tmp/Endpoint_SlaveEndpointTest_NoAuthorizer_2_1MGcNv/credential"
--default_role="*" --disallow_sharing_agent_pid_namespace="false" --disk_watch_interval="1mins"
--docker="docker" --docker_kill_orphans="true" --docker_registry="https://registry-1.docker.io"
--docker_remove_delay="6hrs" --docker_socket="/var/run/docker.sock" --docker_stop_timeout="0ns"
--docker_store_dir="/tmp/Endpoint_SlaveEndpointTest_NoAuthorizer_2_1MGcNv/store/docker" --docker_volume_checkpoint_dir="/var/run/mesos/isolators/docker/volume"
--enforce_container_disk_quota="false" --executor_registration_timeout="1mins" --executor_reregistration_timeout="2secs"
--executor_shutdown_grace_period="5secs" --fetcher_cache_dir="/tmp/Endpoint_SlaveEndpointTest_NoAuthorizer_2_1MGcNv/fetch"
--fetcher_cache_size="2GB" --fetcher_stall_timeout="1mins" --frameworks_home="" --gc_delay="1weeks"
--gc_disk_headroom="0.1" --help="false" --hostname_lookup="true" --http_command_executor="false"
--http_credentials="/tmp/Endpoint_SlaveEndpointTest_NoAuthorizer_2_1MGcNv/http_credentials"
--http_heartbeat_interval="30secs" --initialize_driver_logging="true" --isolation="posix/cpu,posix/mem"
--launcher="posix" --launcher_dir="/tmp/SRC/build/mesos-1.7.0/_build/sub/src" --logbufsecs="0"
--logging_level="INFO" --max_completed_executors_per_framework="150" --memory_profiling="false"
--oversubscribed_resources_interval="15secs" --perf_duration="10secs" --perf_interval="1mins"
--port="5051" --qos_correction_interval_min="0ns" --quiet="false" --reconfiguration_policy="equal"
--recover="reconnect" --recovery_timeout="15mins" --registration_backoff_factor="10ms" --resources="cpus:2;gpus:0;mem:1024;disk:1024;ports:[31000-32000]"
--revocable_cpu_low_priority="true" --runtime_dir="/tmp/Endpoint_SlaveEndpointTest_NoAuthorizer_2_1MGcNv"
--sandbox_directory="/mnt/mesos/sandbox" --strict="true" --switch_user="true" --systemd_enable_support="true"
--systemd_runtime_directory="/run/systemd/system" --version="false" --work_dir="/tmp/Endpoint_SlaveEndpointTest_NoAuthorizer_2_aeAjhj"
--zk_session_timeout="10secs"
I0627 03:53:44.042659 18318 credentials.hpp:86] Loading credential for authentication from
'/tmp/Endpoint_SlaveEndpointTest_NoAuthorizer_2_1MGcNv/credential'
I0627 03:53:44.042927 18318 slave.cpp:301] Agent using credential for: test-principal
I0627 03:53:44.042979 18318 credentials.hpp:37] Loading credentials for authentication from
'/tmp/Endpoint_SlaveEndpointTest_NoAuthorizer_2_1MGcNv/http_credentials'
I0627 03:53:44.043429 18318 http.cpp:959] Creating default 'basic' HTTP authenticator for
realm 'mesos-agent-readonly'
I0627 03:53:44.044023 18318 disk_profile_adaptor.cpp:80] Creating default disk profile adaptor
module
I0627 03:53:44.046255 18318 slave.cpp:616] Agent resources: [{"name":"cpus","scalar":{"value":2.0},"type":"SCALAR"},{"name":"mem","scalar":{"value":1024.0},"type":"SCALAR"},{"name":"disk","scalar":{"value":1024.0},"type":"SCALAR"},{"name":"ports","ranges":{"range":[{"begin":31000,"end":32000}]},"type":"RANGES"}]
I0627 03:53:44.046598 18318 slave.cpp:624] Agent attributes: [  ]
I0627 03:53:44.046622 18318 slave.cpp:633] Agent hostname: a01f3ec15d7f
I0627 03:53:44.046823 18322 task_status_update_manager.cpp:181] Pausing sending task status
updates
I0627 03:53:44.049355 18331 state.cpp:66] Recovering state from '/tmp/Endpoint_SlaveEndpointTest_NoAuthorizer_2_aeAjhj/meta'
I0627 03:53:44.049674 18332 slave.cpp:6929] Finished recovering checkpointed state from '/tmp/Endpoint_SlaveEndpointTest_NoAuthorizer_2_aeAjhj/meta',
beginning agent recovery
I0627 03:53:44.049932 18337 task_status_update_manager.cpp:207] Recovering task status update
manager
I0627 03:53:44.050381 18338 containerizer.cpp:718] Recovering Mesos containers
I0627 03:53:44.050843 18338 containerizer.cpp:1025] Recovering isolators
I0627 03:53:44.051710 18333 containerizer.cpp:1064] Recovering provisioner
I0627 03:53:44.052884 18322 provisioner.cpp:494] Provisioner recovery complete
I0627 03:53:44.054064 18332 composing.cpp:339] Finished recovering all containerizers
I0627 03:53:44.054265 18337 slave.cpp:7158] Recovering executors
I0627 03:53:44.054494 18337 slave.cpp:7311] Finished recovery
I0627 03:53:44.059031 18323 process.cpp:3583] Handling HTTP event for process 'slave(1015)'
with path: '/slave(1015)/containers'
I0627 03:53:44.061785 18331 http.cpp:1099] HTTP GET for /slave(1015)/containers from 172.17.0.2:51374
I0627 03:53:44.061934 18331 http.cpp:936] Authorizing principal 'test-principal' to GET the
'/containers' endpoint
I0627 03:53:44.068442 18316 slave.cpp:931] Agent terminating
[       OK ] Endpoint/SlaveEndpointTest.NoAuthorizer/2 (55 ms)
[----------] 9 tests from Endpoint/SlaveEndpointTest (406 ms total)

[----------] 2 tests from ContainerizerType/DefaultContainerDNSFlagTest
[ RUN      ] ContainerizerType/DefaultContainerDNSFlagTest.ValidateFlag/0
[       OK ] ContainerizerType/DefaultContainerDNSFlagTest.ValidateFlag/0 (15 ms)
[ RUN      ] ContainerizerType/DefaultContainerDNSFlagTest.ValidateFlag/1
[       OK ] ContainerizerType/DefaultContainerDNSFlagTest.ValidateFlag/1 (14 ms)
[----------] 2 tests from ContainerizerType/DefaultContainerDNSFlagTest (30 ms total)

[----------] Global test environment tear-down
[==========] 1965 tests from 201 test cases ran. (1104342 ms total)
[  PASSED  ] 1963 tests.
[  FAILED  ] 2 tests, listed below:
[  FAILED  ] DiskQuotaTest.SlaveRecovery
[  FAILED  ] RegistrarTest.Remove

 2 FAILED TESTS
  YOU HAVE 22 DISABLED TESTS

I0627 03:53:44.191390 18341 process.cpp:940] Stopped the socket accept loop
Makefile:14788: recipe for target 'check-local' failed
make[4]: *** [check-local] Error 1
make[4]: Leaving directory '/tmp/SRC/build/mesos-1.7.0/_build/sub/src'
Makefile:13902: recipe for target 'check-am' failed
make[3]: *** [check-am] Error 2
make[3]: Leaving directory '/tmp/SRC/build/mesos-1.7.0/_build/sub/src'
Makefile:13906: recipe for target 'check' failed
make[2]: *** [check] Error 2
make[2]: Leaving directory '/tmp/SRC/build/mesos-1.7.0/_build/sub/src'
Makefile:777: recipe for target 'check-recursive' failed
make[1]: *** [check-recursive] Error 1
make[1]: Leaving directory '/tmp/SRC/build/mesos-1.7.0/_build/sub'
Makefile:983: recipe for target 'distcheck' failed
make: *** [distcheck] Error 1
Untagged: mesos/mesos-build:ubuntu-16.04
Untagged: mesos/mesos-build@sha256:8685ea3c3e17663e4a1764d08df701102b4e9286c6c1a7116afccbe382777290
Deleted: sha256:4ecb5a128921ae9aad805a57a0e4d24dbcfbe84b09304997c7e2798819aa155a
Deleted: sha256:91a3c8a13a99414ff67baa2d1c6a6a82b43c237327a78d7f815414e155578ac1
Deleted: sha256:d05373b7ffe6961840e0962d4b16df22a14b1bbba3416f5aee58b579f08a2bcd
Deleted: sha256:db96690681268d3c4fdd48cd5edc2ca128c6b2493c67333983b63119622cc485
Deleted: sha256:70f40beaddd4e8dc15479d4f78d75b121fd4428c7bb29319a0fae0babd257e37
Deleted: sha256:77e6ddba346d8ad1e436256f6373dede5af4002006981b7d4116c561c759cefa
Deleted: sha256:8db758ab2fdb54da0aec53aeac876934337e6170f5a8c8872b3d4171e3d465b7
Deleted: sha256:a7fc6b405fe8ef71edfa6163d1dc9f1cb1df426049eefaa7d388e9df21a061ad
Deleted: sha256:5a3e35538f7f2e2727c8ac92f08c30002b9e8a77737de0dab91244344d59f69b
Deleted: sha256:ff986b10a018b48074e6d3a68b39aad8ccc002cdad912d4148c0f92b3729323e
Build step 'Execute shell' marked build as failure


Mime
View raw message