mesos-builds mailing list archives

Site index · List index
Message view « Date » · « Thread »
Top « Date » · « Thread »
From Apache Jenkins Server <jenk...@builds.apache.org>
Subject Build failed in Jenkins: Mesos-Reviewbot #22716
Date Fri, 15 Jun 2018 22:03:51 GMT
See <https://builds.apache.org/job/Mesos-Reviewbot/22716/display/redirect>

------------------------------------------
[...truncated 37.18 MB...]
I0615 22:03:45.487849 18265 slave.cpp:269] Flags at startup: --acls="" --appc_simple_discovery_uri_prefix="http://"
--appc_store_dir="/tmp/Endpoint_SlaveEndpointTest_AuthorizedRequest_2_S1sup6/store/appc" --authenticate_http_readonly="true"
--authenticate_http_readwrite="false" --authenticatee="crammd5" --authentication_backoff_factor="1secs"
--authorizer="local" --cgroups_cpu_enable_pids_and_tids_count="false" --cgroups_enable_cfs="false"
--cgroups_hierarchy="/sys/fs/cgroup" --cgroups_limit_swap="false" --cgroups_root="mesos" --container_disk_watch_interval="15secs"
--containerizers="mesos" --credential="/tmp/Endpoint_SlaveEndpointTest_AuthorizedRequest_2_S1sup6/credential"
--default_role="*" --disallow_sharing_agent_pid_namespace="false" --disk_watch_interval="1mins"
--docker="docker" --docker_kill_orphans="true" --docker_registry="https://registry-1.docker.io"
--docker_remove_delay="6hrs" --docker_socket="/var/run/docker.sock" --docker_stop_timeout="0ns"
--docker_store_dir="/tmp/Endpoint_SlaveEndpointTest_AuthorizedRequest_2_S1sup6/store/docker"
--docker_volume_checkpoint_dir="/var/run/mesos/isolators/docker/volume" --enforce_container_disk_quota="false"
--executor_registration_timeout="1mins" --executor_reregistration_timeout="2secs" --executor_shutdown_grace_period="5secs"
--fetcher_cache_dir="/tmp/Endpoint_SlaveEndpointTest_AuthorizedRequest_2_S1sup6/fetch" --fetcher_cache_size="2GB"
--fetcher_stall_timeout="1mins" --frameworks_home="" --gc_delay="1weeks" --gc_disk_headroom="0.1"
--help="false" --hostname_lookup="true" --http_command_executor="false" --http_credentials="/tmp/Endpoint_SlaveEndpointTest_AuthorizedRequest_2_S1sup6/http_credentials"
--http_heartbeat_interval="30secs" --initialize_driver_logging="true" --isolation="posix/cpu,posix/mem"
--launcher="posix" --launcher_dir="/tmp/SRC/build/mesos-1.7.0/_build/sub/src" --logbufsecs="0"
--logging_level="INFO" --max_completed_executors_per_framework="150" --memory_profiling="false"
--oversubscribed_resources_interval="15secs" --perf_duration="10secs" --perf_interval="1mins"
--port="5051" --qos_correction_interval_min="0ns" --quiet="false" --reconfiguration_policy="equal"
--recover="reconnect" --recovery_timeout="15mins" --registration_backoff_factor="10ms" --resources="cpus:2;gpus:0;mem:1024;disk:1024;ports:[31000-32000]"
--revocable_cpu_low_priority="true" --runtime_dir="/tmp/Endpoint_SlaveEndpointTest_AuthorizedRequest_2_S1sup6"
--sandbox_directory="/mnt/mesos/sandbox" --strict="true" --switch_user="true" --systemd_enable_support="true"
--systemd_runtime_directory="/run/systemd/system" --version="false" --work_dir="/tmp/Endpoint_SlaveEndpointTest_AuthorizedRequest_2_2ban4v"
--zk_session_timeout="10secs"
I0615 22:03:45.488299 18265 credentials.hpp:86] Loading credential for authentication from
'/tmp/Endpoint_SlaveEndpointTest_AuthorizedRequest_2_S1sup6/credential'
I0615 22:03:45.488519 18265 slave.cpp:301] Agent using credential for: test-principal
I0615 22:03:45.488554 18265 credentials.hpp:37] Loading credentials for authentication from
'/tmp/Endpoint_SlaveEndpointTest_AuthorizedRequest_2_S1sup6/http_credentials'
I0615 22:03:45.488819 18265 http.cpp:959] Creating default 'basic' HTTP authenticator for
realm 'mesos-agent-readonly'
I0615 22:03:45.489183 18265 disk_profile_adaptor.cpp:80] Creating default disk profile adaptor
module
I0615 22:03:45.490468 18265 slave.cpp:616] Agent resources: [{"name":"cpus","scalar":{"value":2.0},"type":"SCALAR"},{"name":"mem","scalar":{"value":1024.0},"type":"SCALAR"},{"name":"disk","scalar":{"value":1024.0},"type":"SCALAR"},{"name":"ports","ranges":{"range":[{"begin":31000,"end":32000}]},"type":"RANGES"}]
I0615 22:03:45.490682 18265 slave.cpp:624] Agent attributes: [  ]
I0615 22:03:45.490702 18265 slave.cpp:633] Agent hostname: faa026331144
I0615 22:03:45.490854 18273 task_status_update_manager.cpp:181] Pausing sending task status
updates
I0615 22:03:45.492478 18268 state.cpp:66] Recovering state from '/tmp/Endpoint_SlaveEndpointTest_AuthorizedRequest_2_2ban4v/meta'
I0615 22:03:45.492692 18277 slave.cpp:6929] Finished recovering checkpointed state from '/tmp/Endpoint_SlaveEndpointTest_AuthorizedRequest_2_2ban4v/meta',
beginning agent recovery
I0615 22:03:45.492820 18268 task_status_update_manager.cpp:207] Recovering task status update
manager
I0615 22:03:45.493149 18276 containerizer.cpp:717] Recovering Mesos containers
I0615 22:03:45.493456 18276 containerizer.cpp:1024] Recovering isolators
I0615 22:03:45.493994 18287 containerizer.cpp:1063] Recovering provisioner
I0615 22:03:45.494673 18273 provisioner.cpp:494] Provisioner recovery complete
I0615 22:03:45.495384 18288 composing.cpp:339] Finished recovering all containerizers
I0615 22:03:45.495537 18277 slave.cpp:7158] Recovering executors
I0615 22:03:45.495714 18277 slave.cpp:7311] Finished recovery
I0615 22:03:45.499143 18287 process.cpp:3583] Handling HTTP event for process 'slave(993)'
with path: '/slave(993)/containers'
I0615 22:03:45.500780 18284 http.cpp:1099] HTTP GET for /slave(993)/containers from 172.17.0.2:33542
I0615 22:03:45.500867 18284 http.cpp:936] Authorizing principal 'test-principal' to GET the
'/containers' endpoint
I0615 22:03:45.504360 18280 slave.cpp:931] Agent terminating
[       OK ] Endpoint/SlaveEndpointTest.AuthorizedRequest/2 (34 ms)
[ RUN      ] Endpoint/SlaveEndpointTest.UnauthorizedRequest/0
I0615 22:03:45.517592 18264 containerizer.cpp:300] Using isolation { environment_secret, posix/cpu,
posix/mem, filesystem/posix, network/cni }
W0615 22:03:45.518146 18264 backend.cpp:76] Failed to create 'aufs' backend: AufsBackend requires
root privileges
W0615 22:03:45.518175 18264 backend.cpp:76] Failed to create 'bind' backend: BindBackend requires
root privileges
I0615 22:03:45.518219 18264 provisioner.cpp:298] Using default backend 'copy'
I0615 22:03:45.522142 18274 slave.cpp:268] Mesos agent started on (994)@172.17.0.2:45365
I0615 22:03:45.522171 18274 slave.cpp:269] Flags at startup: --acls="" --appc_simple_discovery_uri_prefix="http://"
--appc_store_dir="/tmp/Endpoint_SlaveEndpointTest_UnauthorizedRequest_0_4Cfr3r/store/appc"
--authenticate_http_readonly="true" --authenticate_http_readwrite="false" --authenticatee="crammd5"
--authentication_backoff_factor="1secs" --authorizer="local" --cgroups_cpu_enable_pids_and_tids_count="false"
--cgroups_enable_cfs="false" --cgroups_hierarchy="/sys/fs/cgroup" --cgroups_limit_swap="false"
--cgroups_root="mesos" --container_disk_watch_interval="15secs" --containerizers="mesos" --credential="/tmp/Endpoint_SlaveEndpointTest_UnauthorizedRequest_0_4Cfr3r/credential"
--default_role="*" --disallow_sharing_agent_pid_namespace="false" --disk_watch_interval="1mins"
--docker="docker" --docker_kill_orphans="true" --docker_registry="https://registry-1.docker.io"
--docker_remove_delay="6hrs" --docker_socket="/var/run/docker.sock" --docker_stop_timeout="0ns"
--docker_store_dir="/tmp/Endpoint_SlaveEndpointTest_UnauthorizedRequest_0_4Cfr3r/store/docker"
--docker_volume_checkpoint_dir="/var/run/mesos/isolators/docker/volume" --enforce_container_disk_quota="false"
--executor_registration_timeout="1mins" --executor_reregistration_timeout="2secs" --executor_shutdown_grace_period="5secs"
--fetcher_cache_dir="/tmp/Endpoint_SlaveEndpointTest_UnauthorizedRequest_0_4Cfr3r/fetch" --fetcher_cache_size="2GB"
--fetcher_stall_timeout="1mins" --frameworks_home="" --gc_delay="1weeks" --gc_disk_headroom="0.1"
--help="false" --hostname_lookup="true" --http_command_executor="false" --http_credentials="/tmp/Endpoint_SlaveEndpointTest_UnauthorizedRequest_0_4Cfr3r/http_credentials"
--http_heartbeat_interval="30secs" --initialize_driver_logging="true" --isolation="posix/cpu,posix/mem"
--launcher="posix" --launcher_dir="/tmp/SRC/build/mesos-1.7.0/_build/sub/src" --logbufsecs="0"
--logging_level="INFO" --max_completed_executors_per_framework="150" --memory_profiling="false"
--oversubscribed_resources_interval="15secs" --perf_duration="10secs" --perf_interval="1mins"
--port="5051" --qos_correction_interval_min="0ns" --quiet="false" --reconfiguration_policy="equal"
--recover="reconnect" --recovery_timeout="15mins" --registration_backoff_factor="10ms" --resources="cpus:2;gpus:0;mem:1024;disk:1024;ports:[31000-32000]"
--revocable_cpu_low_priority="true" --runtime_dir="/tmp/Endpoint_SlaveEndpointTest_UnauthorizedRequest_0_4Cfr3r"
--sandbox_directory="/mnt/mesos/sandbox" --strict="true" --switch_user="true" --systemd_enable_support="true"
--systemd_runtime_directory="/run/systemd/system" --version="false" --work_dir="/tmp/Endpoint_SlaveEndpointTest_UnauthorizedRequest_0_pkraDR"
--zk_session_timeout="10secs"
I0615 22:03:45.522642 18274 credentials.hpp:86] Loading credential for authentication from
'/tmp/Endpoint_SlaveEndpointTest_UnauthorizedRequest_0_4Cfr3r/credential'
I0615 22:03:45.522836 18274 slave.cpp:301] Agent using credential for: test-principal
I0615 22:03:45.522871 18274 credentials.hpp:37] Loading credentials for authentication from
'/tmp/Endpoint_SlaveEndpointTest_UnauthorizedRequest_0_4Cfr3r/http_credentials'
I0615 22:03:45.523113 18274 http.cpp:959] Creating default 'basic' HTTP authenticator for
realm 'mesos-agent-readonly'
I0615 22:03:45.523458 18274 disk_profile_adaptor.cpp:80] Creating default disk profile adaptor
module
I0615 22:03:45.524766 18274 slave.cpp:616] Agent resources: [{"name":"cpus","scalar":{"value":2.0},"type":"SCALAR"},{"name":"mem","scalar":{"value":1024.0},"type":"SCALAR"},{"name":"disk","scalar":{"value":1024.0},"type":"SCALAR"},{"name":"ports","ranges":{"range":[{"begin":31000,"end":32000}]},"type":"RANGES"}]
I0615 22:03:45.524981 18274 slave.cpp:624] Agent attributes: [  ]
I0615 22:03:45.524999 18274 slave.cpp:633] Agent hostname: faa026331144
I0615 22:03:45.525144 18287 task_status_update_manager.cpp:181] Pausing sending task status
updates
I0615 22:03:45.526759 18275 state.cpp:66] Recovering state from '/tmp/Endpoint_SlaveEndpointTest_UnauthorizedRequest_0_pkraDR/meta'
I0615 22:03:45.526959 18271 slave.cpp:6929] Finished recovering checkpointed state from '/tmp/Endpoint_SlaveEndpointTest_UnauthorizedRequest_0_pkraDR/meta',
beginning agent recovery
I0615 22:03:45.527104 18276 task_status_update_manager.cpp:207] Recovering task status update
manager
I0615 22:03:45.527356 18278 containerizer.cpp:717] Recovering Mesos containers
I0615 22:03:45.527633 18278 containerizer.cpp:1024] Recovering isolators
I0615 22:03:45.528214 18281 containerizer.cpp:1063] Recovering provisioner
I0615 22:03:45.528928 18287 provisioner.cpp:494] Provisioner recovery complete
I0615 22:03:45.529657 18270 composing.cpp:339] Finished recovering all containerizers
I0615 22:03:45.529779 18271 slave.cpp:7158] Recovering executors
I0615 22:03:45.529942 18271 slave.cpp:7311] Finished recovery
I0615 22:03:45.533102 18281 process.cpp:3583] Handling HTTP event for process 'slave(994)'
with path: '/slave(994)/monitor/statistics'
I0615 22:03:45.534621 18275 http.cpp:1099] HTTP GET for /slave(994)/monitor/statistics from
172.17.0.2:33544
I0615 22:03:45.534695 18275 http.cpp:936] Authorizing principal 'test-principal' to GET the
'/monitor/statistics' endpoint
I0615 22:03:45.536203 18278 slave.cpp:931] Agent terminating
[       OK ] Endpoint/SlaveEndpointTest.UnauthorizedRequest/0 (31 ms)
[ RUN      ] Endpoint/SlaveEndpointTest.UnauthorizedRequest/1
I0615 22:03:45.549187 18264 containerizer.cpp:300] Using isolation { environment_secret, posix/cpu,
posix/mem, filesystem/posix, network/cni }
W0615 22:03:45.549728 18264 backend.cpp:76] Failed to create 'aufs' backend: AufsBackend requires
root privileges
W0615 22:03:45.549760 18264 backend.cpp:76] Failed to create 'bind' backend: BindBackend requires
root privileges
I0615 22:03:45.549793 18264 provisioner.cpp:298] Using default backend 'copy'
I0615 22:03:45.553757 18285 slave.cpp:268] Mesos agent started on (995)@172.17.0.2:45365
I0615 22:03:45.553786 18285 slave.cpp:269] Flags at startup: --acls="" --appc_simple_discovery_uri_prefix="http://"
--appc_store_dir="/tmp/Endpoint_SlaveEndpointTest_UnauthorizedRequest_1_638y0N/store/appc"
--authenticate_http_readonly="true" --authenticate_http_readwrite="false" --authenticatee="crammd5"
--authentication_backoff_factor="1secs" --authorizer="local" --cgroups_cpu_enable_pids_and_tids_count="false"
--cgroups_enable_cfs="false" --cgroups_hierarchy="/sys/fs/cgroup" --cgroups_limit_swap="false"
--cgroups_root="mesos" --container_disk_watch_interval="15secs" --containerizers="mesos" --credential="/tmp/Endpoint_SlaveEndpointTest_UnauthorizedRequest_1_638y0N/credential"
--default_role="*" --disallow_sharing_agent_pid_namespace="false" --disk_watch_interval="1mins"
--docker="docker" --docker_kill_orphans="true" --docker_registry="https://registry-1.docker.io"
--docker_remove_delay="6hrs" --docker_socket="/var/run/docker.sock" --docker_stop_timeout="0ns"
--docker_store_dir="/tmp/Endpoint_SlaveEndpointTest_UnauthorizedRequest_1_638y0N/store/docker"
--docker_volume_checkpoint_dir="/var/run/mesos/isolators/docker/volume" --enforce_container_disk_quota="false"
--executor_registration_timeout="1mins" --executor_reregistration_timeout="2secs" --executor_shutdown_grace_period="5secs"
--fetcher_cache_dir="/tmp/Endpoint_SlaveEndpointTest_UnauthorizedRequest_1_638y0N/fetch" --fetcher_cache_size="2GB"
--fetcher_stall_timeout="1mins" --frameworks_home="" --gc_delay="1weeks" --gc_disk_headroom="0.1"
--help="false" --hostname_lookup="true" --http_command_executor="false" --http_credentials="/tmp/Endpoint_SlaveEndpointTest_UnauthorizedRequest_1_638y0N/http_credentials"
--http_heartbeat_interval="30secs" --initialize_driver_logging="true" --isolation="posix/cpu,posix/mem"
--launcher="posix" --launcher_dir="/tmp/SRC/build/mesos-1.7.0/_build/sub/src" --logbufsecs="0"
--logging_level="INFO" --max_completed_executors_per_framework="150" --memory_profiling="false"
--oversubscribed_resources_interval="15secs" --perf_duration="10secs" --perf_interval="1mins"
--port="5051" --qos_correction_interval_min="0ns" --quiet="false" --reconfiguration_policy="equal"
--recover="reconnect" --recovery_timeout="15mins" --registration_backoff_factor="10ms" --resources="cpus:2;gpus:0;mem:1024;disk:1024;ports:[31000-32000]"
--revocable_cpu_low_priority="true" --runtime_dir="/tmp/Endpoint_SlaveEndpointTest_UnauthorizedRequest_1_638y0N"
--sandbox_directory="/mnt/mesos/sandbox" --strict="true" --switch_user="true" --systemd_enable_support="true"
--systemd_runtime_directory="/run/systemd/system" --version="false" --work_dir="/tmp/Endpoint_SlaveEndpointTest_UnauthorizedRequest_1_RV4Avd"
--zk_session_timeout="10secs"
I0615 22:03:45.554227 18285 credentials.hpp:86] Loading credential for authentication from
'/tmp/Endpoint_SlaveEndpointTest_UnauthorizedRequest_1_638y0N/credential'
I0615 22:03:45.554433 18285 slave.cpp:301] Agent using credential for: test-principal
I0615 22:03:45.554461 18285 credentials.hpp:37] Loading credentials for authentication from
'/tmp/Endpoint_SlaveEndpointTest_UnauthorizedRequest_1_638y0N/http_credentials'
I0615 22:03:45.554700 18285 http.cpp:959] Creating default 'basic' HTTP authenticator for
realm 'mesos-agent-readonly'
I0615 22:03:45.555058 18285 disk_profile_adaptor.cpp:80] Creating default disk profile adaptor
module
I0615 22:03:45.556349 18285 slave.cpp:616] Agent resources: [{"name":"cpus","scalar":{"value":2.0},"type":"SCALAR"},{"name":"mem","scalar":{"value":1024.0},"type":"SCALAR"},{"name":"disk","scalar":{"value":1024.0},"type":"SCALAR"},{"name":"ports","ranges":{"range":[{"begin":31000,"end":32000}]},"type":"RANGES"}]
I0615 22:03:45.556565 18285 slave.cpp:624] Agent attributes: [  ]
I0615 22:03:45.556584 18285 slave.cpp:633] Agent hostname: faa026331144
I0615 22:03:45.556730 18287 task_status_update_manager.cpp:181] Pausing sending task status
updates
I0615 22:03:45.558275 18283 state.cpp:66] Recovering state from '/tmp/Endpoint_SlaveEndpointTest_UnauthorizedRequest_1_RV4Avd/meta'
I0615 22:03:45.558461 18275 slave.cpp:6929] Finished recovering checkpointed state from '/tmp/Endpoint_SlaveEndpointTest_UnauthorizedRequest_1_RV4Avd/meta',
beginning agent recovery
I0615 22:03:45.558589 18281 task_status_update_manager.cpp:207] Recovering task status update
manager
I0615 22:03:45.558856 18280 containerizer.cpp:717] Recovering Mesos containers
I0615 22:03:45.559126 18280 containerizer.cpp:1024] Recovering isolators
I0615 22:03:45.559664 18279 containerizer.cpp:1063] Recovering provisioner
I0615 22:03:45.560401 18287 provisioner.cpp:494] Provisioner recovery complete
I0615 22:03:45.561038 18275 composing.cpp:339] Finished recovering all containerizers
I0615 22:03:45.561157 18281 slave.cpp:7158] Recovering executors
I0615 22:03:45.561288 18281 slave.cpp:7311] Finished recovery
I0615 22:03:45.564247 18279 process.cpp:3583] Handling HTTP event for process 'slave(995)'
with path: '/slave(995)/monitor/statistics.json'
I0615 22:03:45.565737 18283 http.cpp:1099] HTTP GET for /slave(995)/monitor/statistics.json
from 172.17.0.2:33546
I0615 22:03:45.565817 18283 http.cpp:936] Authorizing principal 'test-principal' to GET the
'/monitor/statistics.json' endpoint
I0615 22:03:45.567410 18265 slave.cpp:931] Agent terminating
[       OK ] Endpoint/SlaveEndpointTest.UnauthorizedRequest/1 (30 ms)
[ RUN      ] Endpoint/SlaveEndpointTest.UnauthorizedRequest/2
I0615 22:03:45.580389 18264 containerizer.cpp:300] Using isolation { environment_secret, posix/cpu,
posix/mem, filesystem/posix, network/cni }
W0615 22:03:45.580947 18264 backend.cpp:76] Failed to create 'aufs' backend: AufsBackend requires
root privileges
W0615 22:03:45.580977 18264 backend.cpp:76] Failed to create 'bind' backend: BindBackend requires
root privileges
I0615 22:03:45.581015 18264 provisioner.cpp:298] Using default backend 'copy'
I0615 22:03:45.585160 18269 slave.cpp:268] Mesos agent started on (996)@172.17.0.2:45365
I0615 22:03:45.585183 18269 slave.cpp:269] Flags at startup: --acls="" --appc_simple_discovery_uri_prefix="http://"
--appc_store_dir="/tmp/Endpoint_SlaveEndpointTest_UnauthorizedRequest_2_nuBiga/store/appc"
--authenticate_http_readonly="true" --authenticate_http_readwrite="false" --authenticatee="crammd5"
--authentication_backoff_factor="1secs" --authorizer="local" --cgroups_cpu_enable_pids_and_tids_count="false"
--cgroups_enable_cfs="false" --cgroups_hierarchy="/sys/fs/cgroup" --cgroups_limit_swap="false"
--cgroups_root="mesos" --container_disk_watch_interval="15secs" --containerizers="mesos" --credential="/tmp/Endpoint_SlaveEndpointTest_UnauthorizedRequest_2_nuBiga/credential"
--default_role="*" --disallow_sharing_agent_pid_namespace="false" --disk_watch_interval="1mins"
--docker="docker" --docker_kill_orphans="true" --docker_registry="https://registry-1.docker.io"
--docker_remove_delay="6hrs" --docker_socket="/var/run/docker.sock" --docker_stop_timeout="0ns"
--docker_store_dir="/tmp/Endpoint_SlaveEndpointTest_UnauthorizedRequest_2_nuBiga/store/docker"
--docker_volume_checkpoint_dir="/var/run/mesos/isolators/docker/volume" --enforce_container_disk_quota="false"
--executor_registration_timeout="1mins" --executor_reregistration_timeout="2secs" --executor_shutdown_grace_period="5secs"
--fetcher_cache_dir="/tmp/Endpoint_SlaveEndpointTest_UnauthorizedRequest_2_nuBiga/fetch" --fetcher_cache_size="2GB"
--fetcher_stall_timeout="1mins" --frameworks_home="" --gc_delay="1weeks" --gc_disk_headroom="0.1"
--help="false" --hostname_lookup="true" --http_command_executor="false" --http_credentials="/tmp/Endpoint_SlaveEndpointTest_UnauthorizedRequest_2_nuBiga/http_credentials"
--http_heartbeat_interval="30secs" --initialize_driver_logging="true" --isolation="posix/cpu,posix/mem"
--launcher="posix" --launcher_dir="/tmp/SRC/build/mesos-1.7.0/_build/sub/src" --logbufsecs="0"
--logging_level="INFO" --max_completed_executors_per_framework="150" --memory_profiling="false"
--oversubscribed_resources_interval="15secs" --perf_duration="10secs" --perf_interval="1mins"
--port="5051" --qos_correction_interval_min="0ns" --quiet="false" --reconfiguration_policy="equal"
--recover="reconnect" --recovery_timeout="15mins" --registration_backoff_factor="10ms" --resources="cpus:2;gpus:0;mem:1024;disk:1024;ports:[31000-32000]"
--revocable_cpu_low_priority="true" --runtime_dir="/tmp/Endpoint_SlaveEndpointTest_UnauthorizedRequest_2_nuBiga"
--sandbox_directory="/mnt/mesos/sandbox" --strict="true" --switch_user="true" --systemd_enable_support="true"
--systemd_runtime_directory="/run/systemd/system" --version="false" --work_dir="/tmp/Endpoint_SlaveEndpointTest_UnauthorizedRequest_2_zlfGGz"
--zk_session_timeout="10secs"
I0615 22:03:45.585636 18269 credentials.hpp:86] Loading credential for authentication from
'/tmp/Endpoint_SlaveEndpointTest_UnauthorizedRequest_2_nuBiga/credential'
I0615 22:03:45.585805 18269 slave.cpp:301] Agent using credential for: test-principal
I0615 22:03:45.585832 18269 credentials.hpp:37] Loading credentials for authentication from
'/tmp/Endpoint_SlaveEndpointTest_UnauthorizedRequest_2_nuBiga/http_credentials'
I0615 22:03:45.586061 18269 http.cpp:959] Creating default 'basic' HTTP authenticator for
realm 'mesos-agent-readonly'
I0615 22:03:45.586390 18269 disk_profile_adaptor.cpp:80] Creating default disk profile adaptor
module
I0615 22:03:45.587684 18269 slave.cpp:616] Agent resources: [{"name":"cpus","scalar":{"value":2.0},"type":"SCALAR"},{"name":"mem","scalar":{"value":1024.0},"type":"SCALAR"},{"name":"disk","scalar":{"value":1024.0},"type":"SCALAR"},{"name":"ports","ranges":{"range":[{"begin":31000,"end":32000}]},"type":"RANGES"}]
I0615 22:03:45.587910 18269 slave.cpp:624] Agent attributes: [  ]
I0615 22:03:45.587929 18269 slave.cpp:633] Agent hostname: faa026331144
I0615 22:03:45.588104 18274 task_status_update_manager.cpp:181] Pausing sending task status
updates
I0615 22:03:45.589699 18279 state.cpp:66] Recovering state from '/tmp/Endpoint_SlaveEndpointTest_UnauthorizedRequest_2_zlfGGz/meta'
I0615 22:03:45.589876 18266 slave.cpp:6929] Finished recovering checkpointed state from '/tmp/Endpoint_SlaveEndpointTest_UnauthorizedRequest_2_zlfGGz/meta',
beginning agent recovery
I0615 22:03:45.590016 18286 task_status_update_manager.cpp:207] Recovering task status update
manager
I0615 22:03:45.590296 18288 containerizer.cpp:717] Recovering Mesos containers
I0615 22:03:45.590592 18288 containerizer.cpp:1024] Recovering isolators
I0615 22:03:45.591152 18270 containerizer.cpp:1063] Recovering provisioner
I0615 22:03:45.591893 18274 provisioner.cpp:494] Provisioner recovery complete
I0615 22:03:45.592525 18266 composing.cpp:339] Finished recovering all containerizers
I0615 22:03:45.592638 18286 slave.cpp:7158] Recovering executors
I0615 22:03:45.592808 18286 slave.cpp:7311] Finished recovery
I0615 22:03:45.596079 18265 process.cpp:3583] Handling HTTP event for process 'slave(996)'
with path: '/slave(996)/containers'
I0615 22:03:45.597693 18285 http.cpp:1099] HTTP GET for /slave(996)/containers from 172.17.0.2:33548
I0615 22:03:45.597792 18285 http.cpp:936] Authorizing principal 'test-principal' to GET the
'/containers' endpoint
I0615 22:03:45.599452 18288 slave.cpp:931] Agent terminating
[       OK ] Endpoint/SlaveEndpointTest.UnauthorizedRequest/2 (32 ms)
[ RUN      ] Endpoint/SlaveEndpointTest.NoAuthorizer/0
I0615 22:03:45.613586 18264 containerizer.cpp:300] Using isolation { environment_secret, posix/cpu,
posix/mem, filesystem/posix, network/cni }
W0615 22:03:45.614151 18264 backend.cpp:76] Failed to create 'aufs' backend: AufsBackend requires
root privileges
W0615 22:03:45.614179 18264 backend.cpp:76] Failed to create 'bind' backend: BindBackend requires
root privileges
I0615 22:03:45.614213 18264 provisioner.cpp:298] Using default backend 'copy'
I0615 22:03:45.616314 18264 cluster.cpp:479] Creating default 'local' authorizer
I0615 22:03:45.618607 18267 slave.cpp:268] Mesos agent started on (997)@172.17.0.2:45365
I0615 22:03:45.618633 18267 slave.cpp:269] Flags at startup: --acls="" --appc_simple_discovery_uri_prefix="http://"
--appc_store_dir="/tmp/Endpoint_SlaveEndpointTest_NoAuthorizer_0_33xjPw/store/appc" --authenticate_http_readonly="true"
--authenticate_http_readwrite="false" --authenticatee="crammd5" --authentication_backoff_factor="1secs"
--authorizer="local" --cgroups_cpu_enable_pids_and_tids_count="false" --cgroups_enable_cfs="false"
--cgroups_hierarchy="/sys/fs/cgroup" --cgroups_limit_swap="false" --cgroups_root="mesos" --container_disk_watch_interval="15secs"
--containerizers="mesos" --credential="/tmp/Endpoint_SlaveEndpointTest_NoAuthorizer_0_33xjPw/credential"
--default_role="*" --disallow_sharing_agent_pid_namespace="false" --disk_watch_interval="1mins"
--docker="docker" --docker_kill_orphans="true" --docker_registry="https://registry-1.docker.io"
--docker_remove_delay="6hrs" --docker_socket="/var/run/docker.sock" --docker_stop_timeout="0ns"
--docker_store_dir="/tmp/Endpoint_SlaveEndpointTest_NoAuthorizer_0_33xjPw/store/docker" --docker_volume_checkpoint_dir="/var/run/mesos/isolators/docker/volume"
--enforce_container_disk_quota="false" --executor_registration_timeout="1mins" --executor_reregistration_timeout="2secs"
--executor_shutdown_grace_period="5secs" --fetcher_cache_dir="/tmp/Endpoint_SlaveEndpointTest_NoAuthorizer_0_33xjPw/fetch"
--fetcher_cache_size="2GB" --fetcher_stall_timeout="1mins" --frameworks_home="" --gc_delay="1weeks"
--gc_disk_headroom="0.1" --help="false" --hostname_lookup="true" --http_command_executor="false"
--http_credentials="/tmp/Endpoint_SlaveEndpointTest_NoAuthorizer_0_33xjPw/http_credentials"
--http_heartbeat_interval="30secs" --initialize_driver_logging="true" --isolation="posix/cpu,posix/mem"
--launcher="posix" --launcher_dir="/tmp/SRC/build/mesos-1.7.0/_build/sub/src" --logbufsecs="0"
--logging_level="INFO" --max_completed_executors_per_framework="150" --memory_profiling="false"
--oversubscribed_resources_interval="15secs" --perf_duration="10secs" --perf_interval="1mins"
--port="5051" --qos_correction_interval_min="0ns" --quiet="false" --reconfiguration_policy="equal"
--recover="reconnect" --recovery_timeout="15mins" --registration_backoff_factor="10ms" --resources="cpus:2;gpus:0;mem:1024;disk:1024;ports:[31000-32000]"
--revocable_cpu_low_priority="true" --runtime_dir="/tmp/Endpoint_SlaveEndpointTest_NoAuthorizer_0_33xjPw"
--sandbox_directory="/mnt/mesos/sandbox" --strict="true" --switch_user="true" --systemd_enable_support="true"
--systemd_runtime_directory="/run/systemd/system" --version="false" --work_dir="/tmp/Endpoint_SlaveEndpointTest_NoAuthorizer_0_MMgPaW"
--zk_session_timeout="10secs"
I0615 22:03:45.619102 18267 credentials.hpp:86] Loading credential for authentication from
'/tmp/Endpoint_SlaveEndpointTest_NoAuthorizer_0_33xjPw/credential'
I0615 22:03:45.619323 18267 slave.cpp:301] Agent using credential for: test-principal
I0615 22:03:45.619350 18267 credentials.hpp:37] Loading credentials for authentication from
'/tmp/Endpoint_SlaveEndpointTest_NoAuthorizer_0_33xjPw/http_credentials'
I0615 22:03:45.619602 18267 http.cpp:959] Creating default 'basic' HTTP authenticator for
realm 'mesos-agent-readonly'
I0615 22:03:45.619976 18267 disk_profile_adaptor.cpp:80] Creating default disk profile adaptor
module
I0615 22:03:45.621271 18267 slave.cpp:616] Agent resources: [{"name":"cpus","scalar":{"value":2.0},"type":"SCALAR"},{"name":"mem","scalar":{"value":1024.0},"type":"SCALAR"},{"name":"disk","scalar":{"value":1024.0},"type":"SCALAR"},{"name":"ports","ranges":{"range":[{"begin":31000,"end":32000}]},"type":"RANGES"}]
I0615 22:03:45.621486 18267 slave.cpp:624] Agent attributes: [  ]
I0615 22:03:45.621505 18267 slave.cpp:633] Agent hostname: faa026331144
I0615 22:03:45.621665 18280 task_status_update_manager.cpp:181] Pausing sending task status
updates
I0615 22:03:45.623272 18284 state.cpp:66] Recovering state from '/tmp/Endpoint_SlaveEndpointTest_NoAuthorizer_0_MMgPaW/meta'
I0615 22:03:45.623462 18275 slave.cpp:6929] Finished recovering checkpointed state from '/tmp/Endpoint_SlaveEndpointTest_NoAuthorizer_0_MMgPaW/meta',
beginning agent recovery
I0615 22:03:45.623600 18279 task_status_update_manager.cpp:207] Recovering task status update
manager
I0615 22:03:45.623961 18271 containerizer.cpp:717] Recovering Mesos containers
I0615 22:03:45.624251 18271 containerizer.cpp:1024] Recovering isolators
I0615 22:03:45.624816 18268 containerizer.cpp:1063] Recovering provisioner
I0615 22:03:45.625509 18280 provisioner.cpp:494] Provisioner recovery complete
I0615 22:03:45.626181 18275 composing.cpp:339] Finished recovering all containerizers
I0615 22:03:45.626322 18279 slave.cpp:7158] Recovering executors
I0615 22:03:45.626509 18279 slave.cpp:7311] Finished recovery
I0615 22:03:45.629809 18286 process.cpp:3583] Handling HTTP event for process 'slave(997)'
with path: '/slave(997)/monitor/statistics'
I0615 22:03:45.631361 18274 http.cpp:1099] HTTP GET for /slave(997)/monitor/statistics from
172.17.0.2:33550
I0615 22:03:45.631446 18274 http.cpp:936] Authorizing principal 'test-principal' to GET the
'/monitor/statistics' endpoint
I0615 22:03:45.634198 18265 slave.cpp:931] Agent terminating
[       OK ] Endpoint/SlaveEndpointTest.NoAuthorizer/0 (34 ms)
[ RUN      ] Endpoint/SlaveEndpointTest.NoAuthorizer/1
I0615 22:03:45.647230 18264 containerizer.cpp:300] Using isolation { environment_secret, posix/cpu,
posix/mem, filesystem/posix, network/cni }
W0615 22:03:45.647805 18264 backend.cpp:76] Failed to create 'aufs' backend: AufsBackend requires
root privileges
W0615 22:03:45.647836 18264 backend.cpp:76] Failed to create 'bind' backend: BindBackend requires
root privileges
I0615 22:03:45.647869 18264 provisioner.cpp:298] Using default backend 'copy'
I0615 22:03:45.649847 18264 cluster.cpp:479] Creating default 'local' authorizer
I0615 22:03:45.652535 18270 slave.cpp:268] Mesos agent started on (998)@172.17.0.2:45365
I0615 22:03:45.652560 18270 slave.cpp:269] Flags at startup: --acls="" --appc_simple_discovery_uri_prefix="http://"
--appc_store_dir="/tmp/Endpoint_SlaveEndpointTest_NoAuthorizer_1_JzQrIT/store/appc" --authenticate_http_readonly="true"
--authenticate_http_readwrite="false" --authenticatee="crammd5" --authentication_backoff_factor="1secs"
--authorizer="local" --cgroups_cpu_enable_pids_and_tids_count="false" --cgroups_enable_cfs="false"
--cgroups_hierarchy="/sys/fs/cgroup" --cgroups_limit_swap="false" --cgroups_root="mesos" --container_disk_watch_interval="15secs"
--containerizers="mesos" --credential="/tmp/Endpoint_SlaveEndpointTest_NoAuthorizer_1_JzQrIT/credential"
--default_role="*" --disallow_sharing_agent_pid_namespace="false" --disk_watch_interval="1mins"
--docker="docker" --docker_kill_orphans="true" --docker_registry="https://registry-1.docker.io"
--docker_remove_delay="6hrs" --docker_socket="/var/run/docker.sock" --docker_stop_timeout="0ns"
--docker_store_dir="/tmp/Endpoint_SlaveEndpointTest_NoAuthorizer_1_JzQrIT/store/docker" --docker_volume_checkpoint_dir="/var/run/mesos/isolators/docker/volume"
--enforce_container_disk_quota="false" --executor_registration_timeout="1mins" --executor_reregistration_timeout="2secs"
--executor_shutdown_grace_period="5secs" --fetcher_cache_dir="/tmp/Endpoint_SlaveEndpointTest_NoAuthorizer_1_JzQrIT/fetch"
--fetcher_cache_size="2GB" --fetcher_stall_timeout="1mins" --frameworks_home="" --gc_delay="1weeks"
--gc_disk_headroom="0.1" --help="false" --hostname_lookup="true" --http_command_executor="false"
--http_credentials="/tmp/Endpoint_SlaveEndpointTest_NoAuthorizer_1_JzQrIT/http_credentials"
--http_heartbeat_interval="30secs" --initialize_driver_logging="true" --isolation="posix/cpu,posix/mem"
--launcher="posix" --launcher_dir="/tmp/SRC/build/mesos-1.7.0/_build/sub/src" --logbufsecs="0"
--logging_level="INFO" --max_completed_executors_per_framework="150" --memory_profiling="false"
--oversubscribed_resources_interval="15secs" --perf_duration="10secs" --perf_interval="1mins"
--port="5051" --qos_correction_interval_min="0ns" --quiet="false" --reconfiguration_policy="equal"
--recover="reconnect" --recovery_timeout="15mins" --registration_backoff_factor="10ms" --resources="cpus:2;gpus:0;mem:1024;disk:1024;ports:[31000-32000]"
--revocable_cpu_low_priority="true" --runtime_dir="/tmp/Endpoint_SlaveEndpointTest_NoAuthorizer_1_JzQrIT"
--sandbox_directory="/mnt/mesos/sandbox" --strict="true" --switch_user="true" --systemd_enable_support="true"
--systemd_runtime_directory="/run/systemd/system" --version="false" --work_dir="/tmp/Endpoint_SlaveEndpointTest_NoAuthorizer_1_ouIVYi"
--zk_session_timeout="10secs"
I0615 22:03:45.653002 18270 credentials.hpp:86] Loading credential for authentication from
'/tmp/Endpoint_SlaveEndpointTest_NoAuthorizer_1_JzQrIT/credential'
I0615 22:03:45.653170 18270 slave.cpp:301] Agent using credential for: test-principal
I0615 22:03:45.653203 18270 credentials.hpp:37] Loading credentials for authentication from
'/tmp/Endpoint_SlaveEndpointTest_NoAuthorizer_1_JzQrIT/http_credentials'
I0615 22:03:45.653477 18270 http.cpp:959] Creating default 'basic' HTTP authenticator for
realm 'mesos-agent-readonly'
I0615 22:03:45.653872 18270 disk_profile_adaptor.cpp:80] Creating default disk profile adaptor
module
I0615 22:03:45.655167 18270 slave.cpp:616] Agent resources: [{"name":"cpus","scalar":{"value":2.0},"type":"SCALAR"},{"name":"mem","scalar":{"value":1024.0},"type":"SCALAR"},{"name":"disk","scalar":{"value":1024.0},"type":"SCALAR"},{"name":"ports","ranges":{"range":[{"begin":31000,"end":32000}]},"type":"RANGES"}]
I0615 22:03:45.655380 18270 slave.cpp:624] Agent attributes: [  ]
I0615 22:03:45.655408 18270 slave.cpp:633] Agent hostname: faa026331144
I0615 22:03:45.655599 18267 task_status_update_manager.cpp:181] Pausing sending task status
updates
I0615 22:03:45.657335 18284 state.cpp:66] Recovering state from '/tmp/Endpoint_SlaveEndpointTest_NoAuthorizer_1_ouIVYi/meta'
I0615 22:03:45.657531 18288 slave.cpp:6929] Finished recovering checkpointed state from '/tmp/Endpoint_SlaveEndpointTest_NoAuthorizer_1_ouIVYi/meta',
beginning agent recovery
I0615 22:03:45.657656 18284 task_status_update_manager.cpp:207] Recovering task status update
manager
I0615 22:03:45.657940 18279 containerizer.cpp:717] Recovering Mesos containers
I0615 22:03:45.658215 18279 containerizer.cpp:1024] Recovering isolators
I0615 22:03:45.658776 18280 containerizer.cpp:1063] Recovering provisioner
I0615 22:03:45.659456 18267 provisioner.cpp:494] Provisioner recovery complete
I0615 22:03:45.660217 18288 composing.cpp:339] Finished recovering all containerizers
I0615 22:03:45.660352 18284 slave.cpp:7158] Recovering executors
I0615 22:03:45.660514 18284 slave.cpp:7311] Finished recovery
I0615 22:03:45.664019 18280 process.cpp:3583] Handling HTTP event for process 'slave(998)'
with path: '/slave(998)/monitor/statistics.json'
I0615 22:03:45.665752 18277 http.cpp:1099] HTTP GET for /slave(998)/monitor/statistics.json
from 172.17.0.2:33552
I0615 22:03:45.665858 18277 http.cpp:936] Authorizing principal 'test-principal' to GET the
'/monitor/statistics.json' endpoint
I0615 22:03:45.668555 18278 slave.cpp:931] Agent terminating
[       OK ] Endpoint/SlaveEndpointTest.NoAuthorizer/1 (34 ms)
[ RUN      ] Endpoint/SlaveEndpointTest.NoAuthorizer/2
I0615 22:03:45.681797 18264 containerizer.cpp:300] Using isolation { environment_secret, posix/cpu,
posix/mem, filesystem/posix, network/cni }
W0615 22:03:45.682340 18264 backend.cpp:76] Failed to create 'aufs' backend: AufsBackend requires
root privileges
W0615 22:03:45.682370 18264 backend.cpp:76] Failed to create 'bind' backend: BindBackend requires
root privileges
I0615 22:03:45.682402 18264 provisioner.cpp:298] Using default backend 'copy'
I0615 22:03:45.684303 18264 cluster.cpp:479] Creating default 'local' authorizer
I0615 22:03:45.686600 18265 slave.cpp:268] Mesos agent started on (999)@172.17.0.2:45365
I0615 22:03:45.686625 18265 slave.cpp:269] Flags at startup: --acls="" --appc_simple_discovery_uri_prefix="http://"
--appc_store_dir="/tmp/Endpoint_SlaveEndpointTest_NoAuthorizer_2_OKs4Vg/store/appc" --authenticate_http_readonly="true"
--authenticate_http_readwrite="false" --authenticatee="crammd5" --authentication_backoff_factor="1secs"
--authorizer="local" --cgroups_cpu_enable_pids_and_tids_count="false" --cgroups_enable_cfs="false"
--cgroups_hierarchy="/sys/fs/cgroup" --cgroups_limit_swap="false" --cgroups_root="mesos" --container_disk_watch_interval="15secs"
--containerizers="mesos" --credential="/tmp/Endpoint_SlaveEndpointTest_NoAuthorizer_2_OKs4Vg/credential"
--default_role="*" --disallow_sharing_agent_pid_namespace="false" --disk_watch_interval="1mins"
--docker="docker" --docker_kill_orphans="true" --docker_registry="https://registry-1.docker.io"
--docker_remove_delay="6hrs" --docker_socket="/var/run/docker.sock" --docker_stop_timeout="0ns"
--docker_store_dir="/tmp/Endpoint_SlaveEndpointTest_NoAuthorizer_2_OKs4Vg/store/docker" --docker_volume_checkpoint_dir="/var/run/mesos/isolators/docker/volume"
--enforce_container_disk_quota="false" --executor_registration_timeout="1mins" --executor_reregistration_timeout="2secs"
--executor_shutdown_grace_period="5secs" --fetcher_cache_dir="/tmp/Endpoint_SlaveEndpointTest_NoAuthorizer_2_OKs4Vg/fetch"
--fetcher_cache_size="2GB" --fetcher_stall_timeout="1mins" --frameworks_home="" --gc_delay="1weeks"
--gc_disk_headroom="0.1" --help="false" --hostname_lookup="true" --http_command_executor="false"
--http_credentials="/tmp/Endpoint_SlaveEndpointTest_NoAuthorizer_2_OKs4Vg/http_credentials"
--http_heartbeat_interval="30secs" --initialize_driver_logging="true" --isolation="posix/cpu,posix/mem"
--launcher="posix" --launcher_dir="/tmp/SRC/build/mesos-1.7.0/_build/sub/src" --logbufsecs="0"
--logging_level="INFO" --max_completed_executors_per_framework="150" --memory_profiling="false"
--oversubscribed_resources_interval="15secs" --perf_duration="10secs" --perf_interval="1mins"
--port="5051" --qos_correction_interval_min="0ns" --quiet="false" --reconfiguration_policy="equal"
--recover="reconnect" --recovery_timeout="15mins" --registration_backoff_factor="10ms" --resources="cpus:2;gpus:0;mem:1024;disk:1024;ports:[31000-32000]"
--revocable_cpu_low_priority="true" --runtime_dir="/tmp/Endpoint_SlaveEndpointTest_NoAuthorizer_2_OKs4Vg"
--sandbox_directory="/mnt/mesos/sandbox" --strict="true" --switch_user="true" --systemd_enable_support="true"
--systemd_runtime_directory="/run/systemd/system" --version="false" --work_dir="/tmp/Endpoint_SlaveEndpointTest_NoAuthorizer_2_nBdq7F"
--zk_session_timeout="10secs"
I0615 22:03:45.687083 18265 credentials.hpp:86] Loading credential for authentication from
'/tmp/Endpoint_SlaveEndpointTest_NoAuthorizer_2_OKs4Vg/credential'
I0615 22:03:45.687280 18265 slave.cpp:301] Agent using credential for: test-principal
I0615 22:03:45.687307 18265 credentials.hpp:37] Loading credentials for authentication from
'/tmp/Endpoint_SlaveEndpointTest_NoAuthorizer_2_OKs4Vg/http_credentials'
I0615 22:03:45.687552 18265 http.cpp:959] Creating default 'basic' HTTP authenticator for
realm 'mesos-agent-readonly'
I0615 22:03:45.687921 18265 disk_profile_adaptor.cpp:80] Creating default disk profile adaptor
module
I0615 22:03:45.689218 18265 slave.cpp:616] Agent resources: [{"name":"cpus","scalar":{"value":2.0},"type":"SCALAR"},{"name":"mem","scalar":{"value":1024.0},"type":"SCALAR"},{"name":"disk","scalar":{"value":1024.0},"type":"SCALAR"},{"name":"ports","ranges":{"range":[{"begin":31000,"end":32000}]},"type":"RANGES"}]
I0615 22:03:45.689431 18265 slave.cpp:624] Agent attributes: [  ]
I0615 22:03:45.689460 18265 slave.cpp:633] Agent hostname: faa026331144
I0615 22:03:45.689641 18274 task_status_update_manager.cpp:181] Pausing sending task status
updates
I0615 22:03:45.691238 18272 state.cpp:66] Recovering state from '/tmp/Endpoint_SlaveEndpointTest_NoAuthorizer_2_nBdq7F/meta'
I0615 22:03:45.691440 18284 slave.cpp:6929] Finished recovering checkpointed state from '/tmp/Endpoint_SlaveEndpointTest_NoAuthorizer_2_nBdq7F/meta',
beginning agent recovery
I0615 22:03:45.691588 18276 task_status_update_manager.cpp:207] Recovering task status update
manager
I0615 22:03:45.691881 18273 containerizer.cpp:717] Recovering Mesos containers
I0615 22:03:45.692155 18273 containerizer.cpp:1024] Recovering isolators
I0615 22:03:45.692703 18287 containerizer.cpp:1063] Recovering provisioner
I0615 22:03:45.693346 18274 provisioner.cpp:494] Provisioner recovery complete
I0615 22:03:45.694047 18284 composing.cpp:339] Finished recovering all containerizers
I0615 22:03:45.694192 18276 slave.cpp:7158] Recovering executors
I0615 22:03:45.694360 18276 slave.cpp:7311] Finished recovery
I0615 22:03:45.697389 18281 process.cpp:3583] Handling HTTP event for process 'slave(999)'
with path: '/slave(999)/containers'
I0615 22:03:45.698904 18288 http.cpp:1099] HTTP GET for /slave(999)/containers from 172.17.0.2:33554
I0615 22:03:45.698992 18288 http.cpp:936] Authorizing principal 'test-principal' to GET the
'/containers' endpoint
I0615 22:03:45.702548 18284 slave.cpp:931] Agent terminating
[       OK ] Endpoint/SlaveEndpointTest.NoAuthorizer/2 (33 ms)
[----------] 9 tests from Endpoint/SlaveEndpointTest (300 ms total)

[----------] 2 tests from ContainerizerType/DefaultContainerDNSFlagTest
[ RUN      ] ContainerizerType/DefaultContainerDNSFlagTest.ValidateFlag/0
[       OK ] ContainerizerType/DefaultContainerDNSFlagTest.ValidateFlag/0 (9 ms)
[ RUN      ] ContainerizerType/DefaultContainerDNSFlagTest.ValidateFlag/1
[       OK ] ContainerizerType/DefaultContainerDNSFlagTest.ValidateFlag/1 (10 ms)
[----------] 2 tests from ContainerizerType/DefaultContainerDNSFlagTest (19 ms total)

[----------] Global test environment tear-down
[==========] 1960 tests from 200 test cases ran. (1044300 ms total)
[  PASSED  ] 1959 tests.
[  FAILED  ] 1 test, listed below:
[  FAILED  ] SlaveRecoveryTest/0.RecoverSlaveState, where TypeParam = mesos::internal::slave::MesosContainerizer

 1 FAILED TEST
  YOU HAVE 22 DISABLED TESTS

I0615 22:03:45.783021 18289 process.cpp:940] Stopped the socket accept loop
Makefile:14789: recipe for target 'check-local' failed
make[4]: *** [check-local] Error 1
make[4]: Leaving directory '/tmp/SRC/build/mesos-1.7.0/_build/sub/src'
Makefile:13903: recipe for target 'check-am' failed
make[3]: *** [check-am] Error 2
make[3]: Leaving directory '/tmp/SRC/build/mesos-1.7.0/_build/sub/src'
Makefile:13907: recipe for target 'check' failed
make[2]: *** [check] Error 2
make[2]: Leaving directory '/tmp/SRC/build/mesos-1.7.0/_build/sub/src'
Makefile:777: recipe for target 'check-recursive' failed
make[1]: *** [check-recursive] Error 1
make[1]: Leaving directory '/tmp/SRC/build/mesos-1.7.0/_build/sub'
Makefile:983: recipe for target 'distcheck' failed
make: *** [distcheck] Error 1
Error response from daemon: conflict: unable to delete 4ecb5a128921 (cannot be forced) - image
is being used by running container 97342eb47c59
Build step 'Execute shell' marked build as failure


Mime
View raw message