mesos-builds mailing list archives

Site index · List index
Message view « Date » · « Thread »
Top « Date » · « Thread »
From Apache Jenkins Server <jenk...@builds.apache.org>
Subject Build failed in Jenkins: Mesos-Reviewbot #22663
Date Fri, 08 Jun 2018 17:23:03 GMT
See <https://builds.apache.org/job/Mesos-Reviewbot/22663/display/redirect>

------------------------------------------
[...truncated 37.21 MB...]
I0608 17:22:46.394398 18508 slave.cpp:616] Agent resources: [{"name":"cpus","scalar":{"value":2.0},"type":"SCALAR"},{"name":"mem","scalar":{"value":1024.0},"type":"SCALAR"},{"name":"disk","scalar":{"value":1024.0},"type":"SCALAR"},{"name":"ports","ranges":{"range":[{"begin":31000,"end":32000}]},"type":"RANGES"}]
I0608 17:22:46.394673 18508 slave.cpp:624] Agent attributes: [  ]
I0608 17:22:46.394688 18508 slave.cpp:633] Agent hostname: d52ad8fbdce0
I0608 17:22:46.394937 18510 task_status_update_manager.cpp:181] Pausing sending task status
updates
I0608 17:22:46.396795 18515 state.cpp:66] Recovering state from '/tmp/Endpoint_SlaveEndpointTest_AuthorizedRequest_2_9c1ub1/meta'
I0608 17:22:46.397066 18517 slave.cpp:6929] Finished recovering checkpointed state from '/tmp/Endpoint_SlaveEndpointTest_AuthorizedRequest_2_9c1ub1/meta',
beginning agent recovery
I0608 17:22:46.397322 18505 task_status_update_manager.cpp:207] Recovering task status update
manager
I0608 17:22:46.397734 18512 containerizer.cpp:717] Recovering Mesos containers
I0608 17:22:46.398124 18512 containerizer.cpp:1024] Recovering isolators
I0608 17:22:46.399032 18507 containerizer.cpp:1063] Recovering provisioner
I0608 17:22:46.399951 18509 provisioner.cpp:494] Provisioner recovery complete
I0608 17:22:46.400894 18508 composing.cpp:339] Finished recovering all containerizers
I0608 17:22:46.401062 18513 slave.cpp:7158] Recovering executors
I0608 17:22:46.401340 18513 slave.cpp:7311] Finished recovery
I0608 17:22:46.405112 18504 process.cpp:3583] Handling HTTP event for process 'slave(993)'
with path: '/slave(993)/containers'
I0608 17:22:46.407022 18505 http.cpp:1099] HTTP GET for /slave(993)/containers from 172.17.0.2:54441
I0608 17:22:46.407119 18505 http.cpp:936] Authorizing principal 'test-principal' to GET the
'/containers' endpoint
I0608 17:22:46.411782 18503 slave.cpp:931] Agent terminating
[       OK ] Endpoint/SlaveEndpointTest.AuthorizedRequest/2 (41 ms)
[ RUN      ] Endpoint/SlaveEndpointTest.UnauthorizedRequest/0
I0608 17:22:46.428211 18501 containerizer.cpp:300] Using isolation { environment_secret, posix/cpu,
posix/mem, filesystem/posix, network/cni }
W0608 17:22:46.428700 18501 backend.cpp:76] Failed to create 'aufs' backend: AufsBackend requires
root privileges
W0608 17:22:46.428723 18501 backend.cpp:76] Failed to create 'bind' backend: BindBackend requires
root privileges
I0608 17:22:46.428748 18501 provisioner.cpp:298] Using default backend 'copy'
I0608 17:22:46.432505 18509 slave.cpp:268] Mesos agent started on (994)@172.17.0.2:52752
I0608 17:22:46.432538 18509 slave.cpp:269] Flags at startup: --acls="" --appc_simple_discovery_uri_prefix="http://"
--appc_store_dir="/tmp/Endpoint_SlaveEndpointTest_UnauthorizedRequest_0_QvRim2/store/appc"
--authenticate_http_readonly="true" --authenticate_http_readwrite="false" --authenticatee="crammd5"
--authentication_backoff_factor="1secs" --authorizer="local" --cgroups_cpu_enable_pids_and_tids_count="false"
--cgroups_enable_cfs="false" --cgroups_hierarchy="/sys/fs/cgroup" --cgroups_limit_swap="false"
--cgroups_root="mesos" --container_disk_watch_interval="15secs" --containerizers="mesos" --credential="/tmp/Endpoint_SlaveEndpointTest_UnauthorizedRequest_0_QvRim2/credential"
--default_role="*" --disallow_sharing_agent_pid_namespace="false" --disk_watch_interval="1mins"
--docker="docker" --docker_kill_orphans="true" --docker_registry="https://registry-1.docker.io"
--docker_remove_delay="6hrs" --docker_socket="/var/run/docker.sock" --docker_stop_timeout="0ns"
--docker_store_dir="/tmp/Endpoint_SlaveEndpointTest_UnauthorizedRequest_0_QvRim2/store/docker"
--docker_volume_checkpoint_dir="/var/run/mesos/isolators/docker/volume" --enforce_container_disk_quota="false"
--executor_registration_timeout="1mins" --executor_reregistration_timeout="2secs" --executor_shutdown_grace_period="5secs"
--fetcher_cache_dir="/tmp/Endpoint_SlaveEndpointTest_UnauthorizedRequest_0_QvRim2/fetch" --fetcher_cache_size="2GB"
--fetcher_stall_timeout="1mins" --frameworks_home="" --gc_delay="1weeks" --gc_disk_headroom="0.1"
--help="false" --hostname_lookup="true" --http_command_executor="false" --http_credentials="/tmp/Endpoint_SlaveEndpointTest_UnauthorizedRequest_0_QvRim2/http_credentials"
--http_heartbeat_interval="30secs" --initialize_driver_logging="true" --isolation="posix/cpu,posix/mem"
--launcher="posix" --launcher_dir="/tmp/SRC/build/mesos-1.7.0/_build/sub/src" --logbufsecs="0"
--logging_level="INFO" --max_completed_executors_per_framework="150" --memory_profiling="false"
--oversubscribed_resources_interval="15secs" --perf_duration="10secs" --perf_interval="1mins"
--port="5051" --qos_correction_interval_min="0ns" --quiet="false" --reconfiguration_policy="equal"
--recover="reconnect" --recovery_timeout="15mins" --registration_backoff_factor="10ms" --resources="cpus:2;gpus:0;mem:1024;disk:1024;ports:[31000-32000]"
--revocable_cpu_low_priority="true" --runtime_dir="/tmp/Endpoint_SlaveEndpointTest_UnauthorizedRequest_0_QvRim2"
--sandbox_directory="/mnt/mesos/sandbox" --strict="true" --switch_user="true" --systemd_enable_support="true"
--systemd_runtime_directory="/run/systemd/system" --version="false" --work_dir="/tmp/Endpoint_SlaveEndpointTest_UnauthorizedRequest_0_N6Bz51"
--zk_session_timeout="10secs"
I0608 17:22:46.433166 18509 credentials.hpp:86] Loading credential for authentication from
'/tmp/Endpoint_SlaveEndpointTest_UnauthorizedRequest_0_QvRim2/credential'
I0608 17:22:46.433362 18509 slave.cpp:301] Agent using credential for: test-principal
I0608 17:22:46.433394 18509 credentials.hpp:37] Loading credentials for authentication from
'/tmp/Endpoint_SlaveEndpointTest_UnauthorizedRequest_0_QvRim2/http_credentials'
I0608 17:22:46.433764 18509 http.cpp:959] Creating default 'basic' HTTP authenticator for
realm 'mesos-agent-readonly'
I0608 17:22:46.434279 18509 disk_profile_adaptor.cpp:80] Creating default disk profile adaptor
module
I0608 17:22:46.436033 18509 slave.cpp:616] Agent resources: [{"name":"cpus","scalar":{"value":2.0},"type":"SCALAR"},{"name":"mem","scalar":{"value":1024.0},"type":"SCALAR"},{"name":"disk","scalar":{"value":1024.0},"type":"SCALAR"},{"name":"ports","ranges":{"range":[{"begin":31000,"end":32000}]},"type":"RANGES"}]
I0608 17:22:46.436316 18509 slave.cpp:624] Agent attributes: [  ]
I0608 17:22:46.436332 18509 slave.cpp:633] Agent hostname: d52ad8fbdce0
I0608 17:22:46.436584 18506 task_status_update_manager.cpp:181] Pausing sending task status
updates
I0608 17:22:46.438308 18514 state.cpp:66] Recovering state from '/tmp/Endpoint_SlaveEndpointTest_UnauthorizedRequest_0_N6Bz51/meta'
I0608 17:22:46.438556 18515 slave.cpp:6929] Finished recovering checkpointed state from '/tmp/Endpoint_SlaveEndpointTest_UnauthorizedRequest_0_N6Bz51/meta',
beginning agent recovery
I0608 17:22:46.438756 18512 task_status_update_manager.cpp:207] Recovering task status update
manager
I0608 17:22:46.439210 18503 containerizer.cpp:717] Recovering Mesos containers
I0608 17:22:46.439604 18503 containerizer.cpp:1024] Recovering isolators
I0608 17:22:46.440445 18516 containerizer.cpp:1063] Recovering provisioner
I0608 17:22:46.441282 18515 provisioner.cpp:494] Provisioner recovery complete
I0608 17:22:46.442200 18517 composing.cpp:339] Finished recovering all containerizers
I0608 17:22:46.442394 18507 slave.cpp:7158] Recovering executors
I0608 17:22:46.442569 18507 slave.cpp:7311] Finished recovery
I0608 17:22:46.446223 18506 process.cpp:3583] Handling HTTP event for process 'slave(994)'
with path: '/slave(994)/monitor/statistics'
I0608 17:22:46.448350 18508 http.cpp:1099] HTTP GET for /slave(994)/monitor/statistics from
172.17.0.2:54442
I0608 17:22:46.448452 18508 http.cpp:936] Authorizing principal 'test-principal' to GET the
'/monitor/statistics' endpoint
I0608 17:22:46.450908 18503 slave.cpp:931] Agent terminating
[       OK ] Endpoint/SlaveEndpointTest.UnauthorizedRequest/0 (39 ms)
[ RUN      ] Endpoint/SlaveEndpointTest.UnauthorizedRequest/1
I0608 17:22:46.467227 18501 containerizer.cpp:300] Using isolation { environment_secret, posix/cpu,
posix/mem, filesystem/posix, network/cni }
W0608 17:22:46.467761 18501 backend.cpp:76] Failed to create 'aufs' backend: AufsBackend requires
root privileges
W0608 17:22:46.467785 18501 backend.cpp:76] Failed to create 'bind' backend: BindBackend requires
root privileges
I0608 17:22:46.467813 18501 provisioner.cpp:298] Using default backend 'copy'
I0608 17:22:46.471869 18504 slave.cpp:268] Mesos agent started on (995)@172.17.0.2:52752
I0608 17:22:46.472012 18504 slave.cpp:269] Flags at startup: --acls="" --appc_simple_discovery_uri_prefix="http://"
--appc_store_dir="/tmp/Endpoint_SlaveEndpointTest_UnauthorizedRequest_1_ShccN3/store/appc"
--authenticate_http_readonly="true" --authenticate_http_readwrite="false" --authenticatee="crammd5"
--authentication_backoff_factor="1secs" --authorizer="local" --cgroups_cpu_enable_pids_and_tids_count="false"
--cgroups_enable_cfs="false" --cgroups_hierarchy="/sys/fs/cgroup" --cgroups_limit_swap="false"
--cgroups_root="mesos" --container_disk_watch_interval="15secs" --containerizers="mesos" --credential="/tmp/Endpoint_SlaveEndpointTest_UnauthorizedRequest_1_ShccN3/credential"
--default_role="*" --disallow_sharing_agent_pid_namespace="false" --disk_watch_interval="1mins"
--docker="docker" --docker_kill_orphans="true" --docker_registry="https://registry-1.docker.io"
--docker_remove_delay="6hrs" --docker_socket="/var/run/docker.sock" --docker_stop_timeout="0ns"
--docker_store_dir="/tmp/Endpoint_SlaveEndpointTest_UnauthorizedRequest_1_ShccN3/store/docker"
--docker_volume_checkpoint_dir="/var/run/mesos/isolators/docker/volume" --enforce_container_disk_quota="false"
--executor_registration_timeout="1mins" --executor_reregistration_timeout="2secs" --executor_shutdown_grace_period="5secs"
--fetcher_cache_dir="/tmp/Endpoint_SlaveEndpointTest_UnauthorizedRequest_1_ShccN3/fetch" --fetcher_cache_size="2GB"
--fetcher_stall_timeout="1mins" --frameworks_home="" --gc_delay="1weeks" --gc_disk_headroom="0.1"
--help="false" --hostname_lookup="true" --http_command_executor="false" --http_credentials="/tmp/Endpoint_SlaveEndpointTest_UnauthorizedRequest_1_ShccN3/http_credentials"
--http_heartbeat_interval="30secs" --initialize_driver_logging="true" --isolation="posix/cpu,posix/mem"
--launcher="posix" --launcher_dir="/tmp/SRC/build/mesos-1.7.0/_build/sub/src" --logbufsecs="0"
--logging_level="INFO" --max_completed_executors_per_framework="150" --memory_profiling="false"
--oversubscribed_resources_interval="15secs" --perf_duration="10secs" --perf_interval="1mins"
--port="5051" --qos_correction_interval_min="0ns" --quiet="false" --reconfiguration_policy="equal"
--recover="reconnect" --recovery_timeout="15mins" --registration_backoff_factor="10ms" --resources="cpus:2;gpus:0;mem:1024;disk:1024;ports:[31000-32000]"
--revocable_cpu_low_priority="true" --runtime_dir="/tmp/Endpoint_SlaveEndpointTest_UnauthorizedRequest_1_ShccN3"
--sandbox_directory="/mnt/mesos/sandbox" --strict="true" --switch_user="true" --systemd_enable_support="true"
--systemd_runtime_directory="/run/systemd/system" --version="false" --work_dir="/tmp/Endpoint_SlaveEndpointTest_UnauthorizedRequest_1_TLTYp3"
--zk_session_timeout="10secs"
I0608 17:22:46.472410 18504 credentials.hpp:86] Loading credential for authentication from
'/tmp/Endpoint_SlaveEndpointTest_UnauthorizedRequest_1_ShccN3/credential'
I0608 17:22:46.472618 18504 slave.cpp:301] Agent using credential for: test-principal
I0608 17:22:46.472651 18504 credentials.hpp:37] Loading credentials for authentication from
'/tmp/Endpoint_SlaveEndpointTest_UnauthorizedRequest_1_ShccN3/http_credentials'
I0608 17:22:46.472930 18504 http.cpp:959] Creating default 'basic' HTTP authenticator for
realm 'mesos-agent-readonly'
I0608 17:22:46.473260 18504 disk_profile_adaptor.cpp:80] Creating default disk profile adaptor
module
I0608 17:22:46.474568 18504 slave.cpp:616] Agent resources: [{"name":"cpus","scalar":{"value":2.0},"type":"SCALAR"},{"name":"mem","scalar":{"value":1024.0},"type":"SCALAR"},{"name":"disk","scalar":{"value":1024.0},"type":"SCALAR"},{"name":"ports","ranges":{"range":[{"begin":31000,"end":32000}]},"type":"RANGES"}]
I0608 17:22:46.474778 18504 slave.cpp:624] Agent attributes: [  ]
I0608 17:22:46.474802 18504 slave.cpp:633] Agent hostname: d52ad8fbdce0
I0608 17:22:46.474932 18503 task_status_update_manager.cpp:181] Pausing sending task status
updates
I0608 17:22:46.476397 18502 state.cpp:66] Recovering state from '/tmp/Endpoint_SlaveEndpointTest_UnauthorizedRequest_1_TLTYp3/meta'
I0608 17:22:46.476657 18505 slave.cpp:6929] Finished recovering checkpointed state from '/tmp/Endpoint_SlaveEndpointTest_UnauthorizedRequest_1_TLTYp3/meta',
beginning agent recovery
I0608 17:22:46.476841 18514 task_status_update_manager.cpp:207] Recovering task status update
manager
I0608 17:22:46.477175 18512 containerizer.cpp:717] Recovering Mesos containers
I0608 17:22:46.477507 18512 containerizer.cpp:1024] Recovering isolators
I0608 17:22:46.478328 18511 containerizer.cpp:1063] Recovering provisioner
I0608 17:22:46.479264 18505 provisioner.cpp:494] Provisioner recovery complete
I0608 17:22:46.480403 18509 composing.cpp:339] Finished recovering all containerizers
I0608 17:22:46.480609 18508 slave.cpp:7158] Recovering executors
I0608 17:22:46.480824 18508 slave.cpp:7311] Finished recovery
I0608 17:22:46.484113 18503 process.cpp:3583] Handling HTTP event for process 'slave(995)'
with path: '/slave(995)/monitor/statistics.json'
I0608 17:22:46.485713 18507 http.cpp:1099] HTTP GET for /slave(995)/monitor/statistics.json
from 172.17.0.2:54443
I0608 17:22:46.485797 18507 http.cpp:936] Authorizing principal 'test-principal' to GET the
'/monitor/statistics.json' endpoint
I0608 17:22:46.488065 18501 slave.cpp:931] Agent terminating
[       OK ] Endpoint/SlaveEndpointTest.UnauthorizedRequest/1 (36 ms)
[ RUN      ] Endpoint/SlaveEndpointTest.UnauthorizedRequest/2
I0608 17:22:46.504751 18501 containerizer.cpp:300] Using isolation { environment_secret, posix/cpu,
posix/mem, filesystem/posix, network/cni }
W0608 17:22:46.505300 18501 backend.cpp:76] Failed to create 'aufs' backend: AufsBackend requires
root privileges
W0608 17:22:46.505323 18501 backend.cpp:76] Failed to create 'bind' backend: BindBackend requires
root privileges
I0608 17:22:46.505350 18501 provisioner.cpp:298] Using default backend 'copy'
I0608 17:22:46.509178 18513 slave.cpp:268] Mesos agent started on (996)@172.17.0.2:52752
I0608 17:22:46.509205 18513 slave.cpp:269] Flags at startup: --acls="" --appc_simple_discovery_uri_prefix="http://"
--appc_store_dir="/tmp/Endpoint_SlaveEndpointTest_UnauthorizedRequest_2_KMG9B5/store/appc"
--authenticate_http_readonly="true" --authenticate_http_readwrite="false" --authenticatee="crammd5"
--authentication_backoff_factor="1secs" --authorizer="local" --cgroups_cpu_enable_pids_and_tids_count="false"
--cgroups_enable_cfs="false" --cgroups_hierarchy="/sys/fs/cgroup" --cgroups_limit_swap="false"
--cgroups_root="mesos" --container_disk_watch_interval="15secs" --containerizers="mesos" --credential="/tmp/Endpoint_SlaveEndpointTest_UnauthorizedRequest_2_KMG9B5/credential"
--default_role="*" --disallow_sharing_agent_pid_namespace="false" --disk_watch_interval="1mins"
--docker="docker" --docker_kill_orphans="true" --docker_registry="https://registry-1.docker.io"
--docker_remove_delay="6hrs" --docker_socket="/var/run/docker.sock" --docker_stop_timeout="0ns"
--docker_store_dir="/tmp/Endpoint_SlaveEndpointTest_UnauthorizedRequest_2_KMG9B5/store/docker"
--docker_volume_checkpoint_dir="/var/run/mesos/isolators/docker/volume" --enforce_container_disk_quota="false"
--executor_registration_timeout="1mins" --executor_reregistration_timeout="2secs" --executor_shutdown_grace_period="5secs"
--fetcher_cache_dir="/tmp/Endpoint_SlaveEndpointTest_UnauthorizedRequest_2_KMG9B5/fetch" --fetcher_cache_size="2GB"
--fetcher_stall_timeout="1mins" --frameworks_home="" --gc_delay="1weeks" --gc_disk_headroom="0.1"
--help="false" --hostname_lookup="true" --http_command_executor="false" --http_credentials="/tmp/Endpoint_SlaveEndpointTest_UnauthorizedRequest_2_KMG9B5/http_credentials"
--http_heartbeat_interval="30secs" --initialize_driver_logging="true" --isolation="posix/cpu,posix/mem"
--launcher="posix" --launcher_dir="/tmp/SRC/build/mesos-1.7.0/_build/sub/src" --logbufsecs="0"
--logging_level="INFO" --max_completed_executors_per_framework="150" --memory_profiling="false"
--oversubscribed_resources_interval="15secs" --perf_duration="10secs" --perf_interval="1mins"
--port="5051" --qos_correction_interval_min="0ns" --quiet="false" --reconfiguration_policy="equal"
--recover="reconnect" --recovery_timeout="15mins" --registration_backoff_factor="10ms" --resources="cpus:2;gpus:0;mem:1024;disk:1024;ports:[31000-32000]"
--revocable_cpu_low_priority="true" --runtime_dir="/tmp/Endpoint_SlaveEndpointTest_UnauthorizedRequest_2_KMG9B5"
--sandbox_directory="/mnt/mesos/sandbox" --strict="true" --switch_user="true" --systemd_enable_support="true"
--systemd_runtime_directory="/run/systemd/system" --version="false" --work_dir="/tmp/Endpoint_SlaveEndpointTest_UnauthorizedRequest_2_f22Y84"
--zk_session_timeout="10secs"
I0608 17:22:46.509606 18513 credentials.hpp:86] Loading credential for authentication from
'/tmp/Endpoint_SlaveEndpointTest_UnauthorizedRequest_2_KMG9B5/credential'
I0608 17:22:46.509766 18513 slave.cpp:301] Agent using credential for: test-principal
I0608 17:22:46.509809 18513 credentials.hpp:37] Loading credentials for authentication from
'/tmp/Endpoint_SlaveEndpointTest_UnauthorizedRequest_2_KMG9B5/http_credentials'
I0608 17:22:46.510049 18513 http.cpp:959] Creating default 'basic' HTTP authenticator for
realm 'mesos-agent-readonly'
I0608 17:22:46.510349 18513 disk_profile_adaptor.cpp:80] Creating default disk profile adaptor
module
I0608 17:22:46.511596 18513 slave.cpp:616] Agent resources: [{"name":"cpus","scalar":{"value":2.0},"type":"SCALAR"},{"name":"mem","scalar":{"value":1024.0},"type":"SCALAR"},{"name":"disk","scalar":{"value":1024.0},"type":"SCALAR"},{"name":"ports","ranges":{"range":[{"begin":31000,"end":32000}]},"type":"RANGES"}]
I0608 17:22:46.511796 18513 slave.cpp:624] Agent attributes: [  ]
I0608 17:22:46.511811 18513 slave.cpp:633] Agent hostname: d52ad8fbdce0
I0608 17:22:46.512042 18505 task_status_update_manager.cpp:181] Pausing sending task status
updates
I0608 17:22:46.513471 18511 state.cpp:66] Recovering state from '/tmp/Endpoint_SlaveEndpointTest_UnauthorizedRequest_2_f22Y84/meta'
I0608 17:22:46.513732 18508 slave.cpp:6929] Finished recovering checkpointed state from '/tmp/Endpoint_SlaveEndpointTest_UnauthorizedRequest_2_f22Y84/meta',
beginning agent recovery
I0608 17:22:46.513903 18512 task_status_update_manager.cpp:207] Recovering task status update
manager
I0608 17:22:46.514431 18517 containerizer.cpp:717] Recovering Mesos containers
I0608 17:22:46.514752 18517 containerizer.cpp:1024] Recovering isolators
I0608 17:22:46.515524 18513 containerizer.cpp:1063] Recovering provisioner
I0608 17:22:46.516446 18512 provisioner.cpp:494] Provisioner recovery complete
I0608 17:22:46.517350 18507 composing.cpp:339] Finished recovering all containerizers
I0608 17:22:46.517575 18509 slave.cpp:7158] Recovering executors
I0608 17:22:46.517751 18509 slave.cpp:7311] Finished recovery
I0608 17:22:46.521409 18512 process.cpp:3583] Handling HTTP event for process 'slave(996)'
with path: '/slave(996)/containers'
I0608 17:22:46.523519 18511 http.cpp:1099] HTTP GET for /slave(996)/containers from 172.17.0.2:54444
I0608 17:22:46.523619 18511 http.cpp:936] Authorizing principal 'test-principal' to GET the
'/containers' endpoint
I0608 17:22:46.526072 18515 slave.cpp:931] Agent terminating
[       OK ] Endpoint/SlaveEndpointTest.UnauthorizedRequest/2 (38 ms)
[ RUN      ] Endpoint/SlaveEndpointTest.NoAuthorizer/0
I0608 17:22:46.544772 18501 containerizer.cpp:300] Using isolation { environment_secret, posix/cpu,
posix/mem, filesystem/posix, network/cni }
W0608 17:22:46.545603 18501 backend.cpp:76] Failed to create 'aufs' backend: AufsBackend requires
root privileges
W0608 17:22:46.545637 18501 backend.cpp:76] Failed to create 'bind' backend: BindBackend requires
root privileges
I0608 17:22:46.545671 18501 provisioner.cpp:298] Using default backend 'copy'
I0608 17:22:46.548254 18501 cluster.cpp:479] Creating default 'local' authorizer
I0608 17:22:46.550814 18514 slave.cpp:268] Mesos agent started on (997)@172.17.0.2:52752
I0608 17:22:46.550838 18514 slave.cpp:269] Flags at startup: --acls="" --appc_simple_discovery_uri_prefix="http://"
--appc_store_dir="/tmp/Endpoint_SlaveEndpointTest_NoAuthorizer_0_0sjfQ7/store/appc" --authenticate_http_readonly="true"
--authenticate_http_readwrite="false" --authenticatee="crammd5" --authentication_backoff_factor="1secs"
--authorizer="local" --cgroups_cpu_enable_pids_and_tids_count="false" --cgroups_enable_cfs="false"
--cgroups_hierarchy="/sys/fs/cgroup" --cgroups_limit_swap="false" --cgroups_root="mesos" --container_disk_watch_interval="15secs"
--containerizers="mesos" --credential="/tmp/Endpoint_SlaveEndpointTest_NoAuthorizer_0_0sjfQ7/credential"
--default_role="*" --disallow_sharing_agent_pid_namespace="false" --disk_watch_interval="1mins"
--docker="docker" --docker_kill_orphans="true" --docker_registry="https://registry-1.docker.io"
--docker_remove_delay="6hrs" --docker_socket="/var/run/docker.sock" --docker_stop_timeout="0ns"
--docker_store_dir="/tmp/Endpoint_SlaveEndpointTest_NoAuthorizer_0_0sjfQ7/store/docker" --docker_volume_checkpoint_dir="/var/run/mesos/isolators/docker/volume"
--enforce_container_disk_quota="false" --executor_registration_timeout="1mins" --executor_reregistration_timeout="2secs"
--executor_shutdown_grace_period="5secs" --fetcher_cache_dir="/tmp/Endpoint_SlaveEndpointTest_NoAuthorizer_0_0sjfQ7/fetch"
--fetcher_cache_size="2GB" --fetcher_stall_timeout="1mins" --frameworks_home="" --gc_delay="1weeks"
--gc_disk_headroom="0.1" --help="false" --hostname_lookup="true" --http_command_executor="false"
--http_credentials="/tmp/Endpoint_SlaveEndpointTest_NoAuthorizer_0_0sjfQ7/http_credentials"
--http_heartbeat_interval="30secs" --initialize_driver_logging="true" --isolation="posix/cpu,posix/mem"
--launcher="posix" --launcher_dir="/tmp/SRC/build/mesos-1.7.0/_build/sub/src" --logbufsecs="0"
--logging_level="INFO" --max_completed_executors_per_framework="150" --memory_profiling="false"
--oversubscribed_resources_interval="15secs" --perf_duration="10secs" --perf_interval="1mins"
--port="5051" --qos_correction_interval_min="0ns" --quiet="false" --reconfiguration_policy="equal"
--recover="reconnect" --recovery_timeout="15mins" --registration_backoff_factor="10ms" --resources="cpus:2;gpus:0;mem:1024;disk:1024;ports:[31000-32000]"
--revocable_cpu_low_priority="true" --runtime_dir="/tmp/Endpoint_SlaveEndpointTest_NoAuthorizer_0_0sjfQ7"
--sandbox_directory="/mnt/mesos/sandbox" --strict="true" --switch_user="true" --systemd_enable_support="true"
--systemd_runtime_directory="/run/systemd/system" --version="false" --work_dir="/tmp/Endpoint_SlaveEndpointTest_NoAuthorizer_0_tF4Gg7"
--zk_session_timeout="10secs"
I0608 17:22:46.551198 18514 credentials.hpp:86] Loading credential for authentication from
'/tmp/Endpoint_SlaveEndpointTest_NoAuthorizer_0_0sjfQ7/credential'
I0608 17:22:46.551343 18514 slave.cpp:301] Agent using credential for: test-principal
I0608 17:22:46.551367 18514 credentials.hpp:37] Loading credentials for authentication from
'/tmp/Endpoint_SlaveEndpointTest_NoAuthorizer_0_0sjfQ7/http_credentials'
I0608 17:22:46.551586 18514 http.cpp:959] Creating default 'basic' HTTP authenticator for
realm 'mesos-agent-readonly'
I0608 17:22:46.552011 18514 disk_profile_adaptor.cpp:80] Creating default disk profile adaptor
module
I0608 17:22:46.553794 18514 slave.cpp:616] Agent resources: [{"name":"cpus","scalar":{"value":2.0},"type":"SCALAR"},{"name":"mem","scalar":{"value":1024.0},"type":"SCALAR"},{"name":"disk","scalar":{"value":1024.0},"type":"SCALAR"},{"name":"ports","ranges":{"range":[{"begin":31000,"end":32000}]},"type":"RANGES"}]
I0608 17:22:46.554078 18514 slave.cpp:624] Agent attributes: [  ]
I0608 17:22:46.554095 18514 slave.cpp:633] Agent hostname: d52ad8fbdce0
I0608 17:22:46.554301 18513 task_status_update_manager.cpp:181] Pausing sending task status
updates
I0608 17:22:46.556066 18509 state.cpp:66] Recovering state from '/tmp/Endpoint_SlaveEndpointTest_NoAuthorizer_0_tF4Gg7/meta'
I0608 17:22:46.556303 18502 slave.cpp:6929] Finished recovering checkpointed state from '/tmp/Endpoint_SlaveEndpointTest_NoAuthorizer_0_tF4Gg7/meta',
beginning agent recovery
I0608 17:22:46.556485 18503 task_status_update_manager.cpp:207] Recovering task status update
manager
I0608 17:22:46.556987 18512 containerizer.cpp:717] Recovering Mesos containers
I0608 17:22:46.557327 18512 containerizer.cpp:1024] Recovering isolators
I0608 17:22:46.558243 18514 containerizer.cpp:1063] Recovering provisioner
I0608 17:22:46.559136 18502 provisioner.cpp:494] Provisioner recovery complete
I0608 17:22:46.560145 18516 composing.cpp:339] Finished recovering all containerizers
I0608 17:22:46.560398 18510 slave.cpp:7158] Recovering executors
I0608 17:22:46.560567 18510 slave.cpp:7311] Finished recovery
I0608 17:22:46.563987 18506 process.cpp:3583] Handling HTTP event for process 'slave(997)'
with path: '/slave(997)/monitor/statistics'
I0608 17:22:46.565721 18503 http.cpp:1099] HTTP GET for /slave(997)/monitor/statistics from
172.17.0.2:54445
I0608 17:22:46.565809 18503 http.cpp:936] Authorizing principal 'test-principal' to GET the
'/monitor/statistics' endpoint
I0608 17:22:46.569231 18514 slave.cpp:931] Agent terminating
[       OK ] Endpoint/SlaveEndpointTest.NoAuthorizer/0 (42 ms)
[ RUN      ] Endpoint/SlaveEndpointTest.NoAuthorizer/1
I0608 17:22:46.587086 18501 containerizer.cpp:300] Using isolation { environment_secret, posix/cpu,
posix/mem, filesystem/posix, network/cni }
W0608 17:22:46.587735 18501 backend.cpp:76] Failed to create 'aufs' backend: AufsBackend requires
root privileges
W0608 17:22:46.587764 18501 backend.cpp:76] Failed to create 'bind' backend: BindBackend requires
root privileges
I0608 17:22:46.587795 18501 provisioner.cpp:298] Using default backend 'copy'
I0608 17:22:46.589999 18501 cluster.cpp:479] Creating default 'local' authorizer
I0608 17:22:46.592733 18505 slave.cpp:268] Mesos agent started on (998)@172.17.0.2:52752
I0608 17:22:46.592767 18505 slave.cpp:269] Flags at startup: --acls="" --appc_simple_discovery_uri_prefix="http://"
--appc_store_dir="/tmp/Endpoint_SlaveEndpointTest_NoAuthorizer_1_8AGawa/store/appc" --authenticate_http_readonly="true"
--authenticate_http_readwrite="false" --authenticatee="crammd5" --authentication_backoff_factor="1secs"
--authorizer="local" --cgroups_cpu_enable_pids_and_tids_count="false" --cgroups_enable_cfs="false"
--cgroups_hierarchy="/sys/fs/cgroup" --cgroups_limit_swap="false" --cgroups_root="mesos" --container_disk_watch_interval="15secs"
--containerizers="mesos" --credential="/tmp/Endpoint_SlaveEndpointTest_NoAuthorizer_1_8AGawa/credential"
--default_role="*" --disallow_sharing_agent_pid_namespace="false" --disk_watch_interval="1mins"
--docker="docker" --docker_kill_orphans="true" --docker_registry="https://registry-1.docker.io"
--docker_remove_delay="6hrs" --docker_socket="/var/run/docker.sock" --docker_stop_timeout="0ns"
--docker_store_dir="/tmp/Endpoint_SlaveEndpointTest_NoAuthorizer_1_8AGawa/store/docker" --docker_volume_checkpoint_dir="/var/run/mesos/isolators/docker/volume"
--enforce_container_disk_quota="false" --executor_registration_timeout="1mins" --executor_reregistration_timeout="2secs"
--executor_shutdown_grace_period="5secs" --fetcher_cache_dir="/tmp/Endpoint_SlaveEndpointTest_NoAuthorizer_1_8AGawa/fetch"
--fetcher_cache_size="2GB" --fetcher_stall_timeout="1mins" --frameworks_home="" --gc_delay="1weeks"
--gc_disk_headroom="0.1" --help="false" --hostname_lookup="true" --http_command_executor="false"
--http_credentials="/tmp/Endpoint_SlaveEndpointTest_NoAuthorizer_1_8AGawa/http_credentials"
--http_heartbeat_interval="30secs" --initialize_driver_logging="true" --isolation="posix/cpu,posix/mem"
--launcher="posix" --launcher_dir="/tmp/SRC/build/mesos-1.7.0/_build/sub/src" --logbufsecs="0"
--logging_level="INFO" --max_completed_executors_per_framework="150" --memory_profiling="false"
--oversubscribed_resources_interval="15secs" --perf_duration="10secs" --perf_interval="1mins"
--port="5051" --qos_correction_interval_min="0ns" --quiet="false" --reconfiguration_policy="equal"
--recover="reconnect" --recovery_timeout="15mins" --registration_backoff_factor="10ms" --resources="cpus:2;gpus:0;mem:1024;disk:1024;ports:[31000-32000]"
--revocable_cpu_low_priority="true" --runtime_dir="/tmp/Endpoint_SlaveEndpointTest_NoAuthorizer_1_8AGawa"
--sandbox_directory="/mnt/mesos/sandbox" --strict="true" --switch_user="true" --systemd_enable_support="true"
--systemd_runtime_directory="/run/systemd/system" --version="false" --work_dir="/tmp/Endpoint_SlaveEndpointTest_NoAuthorizer_1_jsqFP9"
--zk_session_timeout="10secs"
I0608 17:22:46.593302 18505 credentials.hpp:86] Loading credential for authentication from
'/tmp/Endpoint_SlaveEndpointTest_NoAuthorizer_1_8AGawa/credential'
I0608 17:22:46.593497 18505 slave.cpp:301] Agent using credential for: test-principal
I0608 17:22:46.593524 18505 credentials.hpp:37] Loading credentials for authentication from
'/tmp/Endpoint_SlaveEndpointTest_NoAuthorizer_1_8AGawa/http_credentials'
I0608 17:22:46.593821 18505 http.cpp:959] Creating default 'basic' HTTP authenticator for
realm 'mesos-agent-readonly'
I0608 17:22:46.594221 18505 disk_profile_adaptor.cpp:80] Creating default disk profile adaptor
module
I0608 17:22:46.595974 18505 slave.cpp:616] Agent resources: [{"name":"cpus","scalar":{"value":2.0},"type":"SCALAR"},{"name":"mem","scalar":{"value":1024.0},"type":"SCALAR"},{"name":"disk","scalar":{"value":1024.0},"type":"SCALAR"},{"name":"ports","ranges":{"range":[{"begin":31000,"end":32000}]},"type":"RANGES"}]
I0608 17:22:46.596261 18505 slave.cpp:624] Agent attributes: [  ]
I0608 17:22:46.596278 18505 slave.cpp:633] Agent hostname: d52ad8fbdce0
I0608 17:22:46.596487 18512 task_status_update_manager.cpp:181] Pausing sending task status
updates
I0608 17:22:46.598232 18517 state.cpp:66] Recovering state from '/tmp/Endpoint_SlaveEndpointTest_NoAuthorizer_1_jsqFP9/meta'
I0608 17:22:46.598497 18516 slave.cpp:6929] Finished recovering checkpointed state from '/tmp/Endpoint_SlaveEndpointTest_NoAuthorizer_1_jsqFP9/meta',
beginning agent recovery
I0608 17:22:46.598649 18517 task_status_update_manager.cpp:207] Recovering task status update
manager
I0608 17:22:46.599084 18510 containerizer.cpp:717] Recovering Mesos containers
I0608 17:22:46.599391 18510 containerizer.cpp:1024] Recovering isolators
I0608 17:22:46.600267 18515 containerizer.cpp:1063] Recovering provisioner
I0608 17:22:46.601192 18516 provisioner.cpp:494] Provisioner recovery complete
I0608 17:22:46.602149 18507 composing.cpp:339] Finished recovering all containerizers
I0608 17:22:46.602313 18505 slave.cpp:7158] Recovering executors
I0608 17:22:46.602530 18505 slave.cpp:7311] Finished recovery
I0608 17:22:46.606274 18502 process.cpp:3583] Handling HTTP event for process 'slave(998)'
with path: '/slave(998)/monitor/statistics.json'
I0608 17:22:46.608213 18513 http.cpp:1099] HTTP GET for /slave(998)/monitor/statistics.json
from 172.17.0.2:54446
I0608 17:22:46.608305 18513 http.cpp:936] Authorizing principal 'test-principal' to GET the
'/monitor/statistics.json' endpoint
I0608 17:22:46.612179 18509 slave.cpp:931] Agent terminating
[       OK ] Endpoint/SlaveEndpointTest.NoAuthorizer/1 (42 ms)
[ RUN      ] Endpoint/SlaveEndpointTest.NoAuthorizer/2
I0608 17:22:46.630326 18501 containerizer.cpp:300] Using isolation { environment_secret, posix/cpu,
posix/mem, filesystem/posix, network/cni }
W0608 17:22:46.631079 18501 backend.cpp:76] Failed to create 'aufs' backend: AufsBackend requires
root privileges
W0608 17:22:46.631114 18501 backend.cpp:76] Failed to create 'bind' backend: BindBackend requires
root privileges
I0608 17:22:46.631170 18501 provisioner.cpp:298] Using default backend 'copy'
I0608 17:22:46.633666 18501 cluster.cpp:479] Creating default 'local' authorizer
I0608 17:22:46.636447 18502 slave.cpp:268] Mesos agent started on (999)@172.17.0.2:52752
I0608 17:22:46.636471 18502 slave.cpp:269] Flags at startup: --acls="" --appc_simple_discovery_uri_prefix="http://"
--appc_store_dir="/tmp/Endpoint_SlaveEndpointTest_NoAuthorizer_2_al3MDd/store/appc" --authenticate_http_readonly="true"
--authenticate_http_readwrite="false" --authenticatee="crammd5" --authentication_backoff_factor="1secs"
--authorizer="local" --cgroups_cpu_enable_pids_and_tids_count="false" --cgroups_enable_cfs="false"
--cgroups_hierarchy="/sys/fs/cgroup" --cgroups_limit_swap="false" --cgroups_root="mesos" --container_disk_watch_interval="15secs"
--containerizers="mesos" --credential="/tmp/Endpoint_SlaveEndpointTest_NoAuthorizer_2_al3MDd/credential"
--default_role="*" --disallow_sharing_agent_pid_namespace="false" --disk_watch_interval="1mins"
--docker="docker" --docker_kill_orphans="true" --docker_registry="https://registry-1.docker.io"
--docker_remove_delay="6hrs" --docker_socket="/var/run/docker.sock" --docker_stop_timeout="0ns"
--docker_store_dir="/tmp/Endpoint_SlaveEndpointTest_NoAuthorizer_2_al3MDd/store/docker" --docker_volume_checkpoint_dir="/var/run/mesos/isolators/docker/volume"
--enforce_container_disk_quota="false" --executor_registration_timeout="1mins" --executor_reregistration_timeout="2secs"
--executor_shutdown_grace_period="5secs" --fetcher_cache_dir="/tmp/Endpoint_SlaveEndpointTest_NoAuthorizer_2_al3MDd/fetch"
--fetcher_cache_size="2GB" --fetcher_stall_timeout="1mins" --frameworks_home="" --gc_delay="1weeks"
--gc_disk_headroom="0.1" --help="false" --hostname_lookup="true" --http_command_executor="false"
--http_credentials="/tmp/Endpoint_SlaveEndpointTest_NoAuthorizer_2_al3MDd/http_credentials"
--http_heartbeat_interval="30secs" --initialize_driver_logging="true" --isolation="posix/cpu,posix/mem"
--launcher="posix" --launcher_dir="/tmp/SRC/build/mesos-1.7.0/_build/sub/src" --logbufsecs="0"
--logging_level="INFO" --max_completed_executors_per_framework="150" --memory_profiling="false"
--oversubscribed_resources_interval="15secs" --perf_duration="10secs" --perf_interval="1mins"
--port="5051" --qos_correction_interval_min="0ns" --quiet="false" --reconfiguration_policy="equal"
--recover="reconnect" --recovery_timeout="15mins" --registration_backoff_factor="10ms" --resources="cpus:2;gpus:0;mem:1024;disk:1024;ports:[31000-32000]"
--revocable_cpu_low_priority="true" --runtime_dir="/tmp/Endpoint_SlaveEndpointTest_NoAuthorizer_2_al3MDd"
--sandbox_directory="/mnt/mesos/sandbox" --strict="true" --switch_user="true" --systemd_enable_support="true"
--systemd_runtime_directory="/run/systemd/system" --version="false" --work_dir="/tmp/Endpoint_SlaveEndpointTest_NoAuthorizer_2_HGckQc"
--zk_session_timeout="10secs"
I0608 17:22:46.636858 18502 credentials.hpp:86] Loading credential for authentication from
'/tmp/Endpoint_SlaveEndpointTest_NoAuthorizer_2_al3MDd/credential'
I0608 17:22:46.637121 18502 slave.cpp:301] Agent using credential for: test-principal
I0608 17:22:46.637156 18502 credentials.hpp:37] Loading credentials for authentication from
'/tmp/Endpoint_SlaveEndpointTest_NoAuthorizer_2_al3MDd/http_credentials'
I0608 17:22:46.637506 18502 http.cpp:959] Creating default 'basic' HTTP authenticator for
realm 'mesos-agent-readonly'
I0608 17:22:46.637970 18502 disk_profile_adaptor.cpp:80] Creating default disk profile adaptor
module
I0608 17:22:46.639765 18502 slave.cpp:616] Agent resources: [{"name":"cpus","scalar":{"value":2.0},"type":"SCALAR"},{"name":"mem","scalar":{"value":1024.0},"type":"SCALAR"},{"name":"disk","scalar":{"value":1024.0},"type":"SCALAR"},{"name":"ports","ranges":{"range":[{"begin":31000,"end":32000}]},"type":"RANGES"}]
I0608 17:22:46.640103 18502 slave.cpp:624] Agent attributes: [  ]
I0608 17:22:46.640121 18502 slave.cpp:633] Agent hostname: d52ad8fbdce0
I0608 17:22:46.640321 18508 task_status_update_manager.cpp:181] Pausing sending task status
updates
I0608 17:22:46.642202 18505 state.cpp:66] Recovering state from '/tmp/Endpoint_SlaveEndpointTest_NoAuthorizer_2_HGckQc/meta'
I0608 17:22:46.642488 18504 slave.cpp:6929] Finished recovering checkpointed state from '/tmp/Endpoint_SlaveEndpointTest_NoAuthorizer_2_HGckQc/meta',
beginning agent recovery
I0608 17:22:46.642674 18513 task_status_update_manager.cpp:207] Recovering task status update
manager
I0608 17:22:46.643105 18511 containerizer.cpp:717] Recovering Mesos containers
I0608 17:22:46.643378 18511 containerizer.cpp:1024] Recovering isolators
I0608 17:22:46.644268 18506 containerizer.cpp:1063] Recovering provisioner
I0608 17:22:46.645200 18504 provisioner.cpp:494] Provisioner recovery complete
I0608 17:22:46.646080 18508 composing.cpp:339] Finished recovering all containerizers
I0608 17:22:46.646255 18511 slave.cpp:7158] Recovering executors
I0608 17:22:46.646440 18511 slave.cpp:7311] Finished recovery
I0608 17:22:46.650180 18502 process.cpp:3583] Handling HTTP event for process 'slave(999)'
with path: '/slave(999)/containers'
I0608 17:22:46.652038 18512 http.cpp:1099] HTTP GET for /slave(999)/containers from 172.17.0.2:54447
I0608 17:22:46.652137 18512 http.cpp:936] Authorizing principal 'test-principal' to GET the
'/containers' endpoint
I0608 17:22:46.657007 18507 slave.cpp:931] Agent terminating
[       OK ] Endpoint/SlaveEndpointTest.NoAuthorizer/2 (43 ms)
[----------] 9 tests from Endpoint/SlaveEndpointTest (369 ms total)

[----------] 2 tests from ContainerizerType/DefaultContainerDNSFlagTest
[ RUN      ] ContainerizerType/DefaultContainerDNSFlagTest.ValidateFlag/0
[       OK ] ContainerizerType/DefaultContainerDNSFlagTest.ValidateFlag/0 (10 ms)
[ RUN      ] ContainerizerType/DefaultContainerDNSFlagTest.ValidateFlag/1
[       OK ] ContainerizerType/DefaultContainerDNSFlagTest.ValidateFlag/1 (9 ms)
[----------] 2 tests from ContainerizerType/DefaultContainerDNSFlagTest (19 ms total)

[----------] Global test environment tear-down
[==========] 1960 tests from 200 test cases ran. (597034 ms total)
[  PASSED  ] 1959 tests.
[  FAILED  ] 1 test, listed below:
[  FAILED  ] ExamplesTest.PersistentVolumeFramework

 1 FAILED TEST
  YOU HAVE 22 DISABLED TESTS

I0608 17:22:46.755686 18518 process.cpp:940] Stopped the socket accept loop
Makefile:14788: recipe for target 'check-local' failed
make[4]: *** [check-local] Error 1
make[4]: Leaving directory '/tmp/SRC/build/mesos-1.7.0/_build/sub/src'
Makefile:13902: recipe for target 'check-am' failed
make[3]: *** [check-am] Error 2
make[3]: Leaving directory '/tmp/SRC/build/mesos-1.7.0/_build/sub/src'
Makefile:13906: recipe for target 'check' failed
make[2]: *** [check] Error 2
make[2]: Leaving directory '/tmp/SRC/build/mesos-1.7.0/_build/sub/src'
Makefile:776: recipe for target 'check-recursive' failed
make[1]: *** [check-recursive] Error 1
make[1]: Leaving directory '/tmp/SRC/build/mesos-1.7.0/_build/sub'
Makefile:982: recipe for target 'distcheck' failed
make: *** [distcheck] Error 1
Untagged: mesos/mesos-build:ubuntu-16.04
Untagged: mesos/mesos-build@sha256:8685ea3c3e17663e4a1764d08df701102b4e9286c6c1a7116afccbe382777290
Deleted: sha256:4ecb5a128921ae9aad805a57a0e4d24dbcfbe84b09304997c7e2798819aa155a
Deleted: sha256:91a3c8a13a99414ff67baa2d1c6a6a82b43c237327a78d7f815414e155578ac1
Deleted: sha256:d05373b7ffe6961840e0962d4b16df22a14b1bbba3416f5aee58b579f08a2bcd
Deleted: sha256:db96690681268d3c4fdd48cd5edc2ca128c6b2493c67333983b63119622cc485
Deleted: sha256:70f40beaddd4e8dc15479d4f78d75b121fd4428c7bb29319a0fae0babd257e37
Build step 'Execute shell' marked build as failure


Mime
View raw message