mesos-builds mailing list archives

Site index · List index
Message view « Date » · « Thread »
Top « Date » · « Thread »
From Apache Jenkins Server <jenk...@builds.apache.org>
Subject Build failed in Jenkins: Mesos-Reviewbot #22370
Date Fri, 04 May 2018 15:51:08 GMT
See <https://builds.apache.org/job/Mesos-Reviewbot/22370/display/redirect?page=changes>

Changes:

[bbannier] Changed failure check for a call to os::system().

[bbannier] Added missing test expectation.

[bbannier] Correctly reconciled dropped operation after agent failover.

------------------------------------------
[...truncated 36.44 MB...]
I0504 15:50:17.537206  6098 slave.cpp:299] Agent using credential for: test-principal
I0504 15:50:17.537241  6098 credentials.hpp:37] Loading credentials for authentication from
'/tmp/Endpoint_SlaveEndpointTest_AuthorizedRequest_1_7RVWeG/http_credentials'
I0504 15:50:17.537562  6098 http.cpp:959] Creating default 'basic' HTTP authenticator for
realm 'mesos-agent-readonly'
I0504 15:50:17.538030  6098 disk_profile_adaptor.cpp:80] Creating default disk profile adaptor
module
I0504 15:50:17.539762  6098 slave.cpp:614] Agent resources: [{"name":"cpus","scalar":{"value":2.0},"type":"SCALAR"},{"name":"mem","scalar":{"value":1024.0},"type":"SCALAR"},{"name":"disk","scalar":{"value":1024.0},"type":"SCALAR"},{"name":"ports","ranges":{"range":[{"begin":31000,"end":32000}]},"type":"RANGES"}]
I0504 15:50:17.540055  6098 slave.cpp:622] Agent attributes: [  ]
I0504 15:50:17.540074  6098 slave.cpp:631] Agent hostname: 7017961a2443
I0504 15:50:17.540333  6095 task_status_update_manager.cpp:181] Pausing sending task status
updates
I0504 15:50:17.542194  6100 state.cpp:66] Recovering state from '/tmp/Endpoint_SlaveEndpointTest_AuthorizedRequest_1_0auNL6/meta'
I0504 15:50:17.542690  6100 task_status_update_manager.cpp:207] Recovering task status update
manager
I0504 15:50:17.543031  6104 containerizer.cpp:712] Recovering containerizer
I0504 15:50:17.545042  6102 provisioner.cpp:495] Provisioner recovery complete
I0504 15:50:17.545574  6091 slave.cpp:7302] Finished recovery
I0504 15:50:17.549437  6094 process.cpp:3583] Handling HTTP event for process 'slave(990)'
with path: '/slave(990)/monitor/statistics.json'
I0504 15:50:17.551525  6102 http.cpp:1099] HTTP GET for /slave(990)/monitor/statistics.json
from 172.17.0.2:33126
I0504 15:50:17.551623  6102 http.cpp:936] Authorizing principal 'test-principal' to GET the
'/monitor/statistics.json' endpoint
I0504 15:50:17.554919  6082 slave.cpp:929] Agent terminating
[       OK ] Endpoint/SlaveEndpointTest.AuthorizedRequest/1 (41 ms)
[ RUN      ] Endpoint/SlaveEndpointTest.AuthorizedRequest/2
I0504 15:50:17.569926  6082 containerizer.cpp:296] Using isolation { environment_secret, posix/cpu,
posix/mem, filesystem/posix, network/cni }
W0504 15:50:17.570477  6082 backend.cpp:76] Failed to create 'aufs' backend: AufsBackend requires
root privileges
W0504 15:50:17.570507  6082 backend.cpp:76] Failed to create 'bind' backend: BindBackend requires
root privileges
I0504 15:50:17.570535  6082 provisioner.cpp:299] Using default backend 'copy'
I0504 15:50:17.574867  6087 slave.cpp:266] Mesos agent started on (991)@172.17.0.2:43632
I0504 15:50:17.574900  6087 slave.cpp:267] Flags at startup: --acls="" --appc_simple_discovery_uri_prefix="http://"
--appc_store_dir="/tmp/Endpoint_SlaveEndpointTest_AuthorizedRequest_2_ckiFrY/store/appc" --authenticate_http_readonly="true"
--authenticate_http_readwrite="false" --authenticatee="crammd5" --authentication_backoff_factor="1secs"
--authorizer="local" --cgroups_cpu_enable_pids_and_tids_count="false" --cgroups_enable_cfs="false"
--cgroups_hierarchy="/sys/fs/cgroup" --cgroups_limit_swap="false" --cgroups_root="mesos" --container_disk_watch_interval="15secs"
--containerizers="mesos" --credential="/tmp/Endpoint_SlaveEndpointTest_AuthorizedRequest_2_ckiFrY/credential"
--default_role="*" --disallow_sharing_agent_pid_namespace="false" --disk_watch_interval="1mins"
--docker="docker" --docker_kill_orphans="true" --docker_registry="https://registry-1.docker.io"
--docker_remove_delay="6hrs" --docker_socket="/var/run/docker.sock" --docker_stop_timeout="0ns"
--docker_store_dir="/tmp/Endpoint_SlaveEndpointTest_AuthorizedRequest_2_ckiFrY/store/docker"
--docker_volume_checkpoint_dir="/var/run/mesos/isolators/docker/volume" --enforce_container_disk_quota="false"
--executor_registration_timeout="1mins" --executor_reregistration_timeout="2secs" --executor_shutdown_grace_period="5secs"
--fetcher_cache_dir="/tmp/Endpoint_SlaveEndpointTest_AuthorizedRequest_2_ckiFrY/fetch" --fetcher_cache_size="2GB"
--fetcher_stall_timeout="1mins" --frameworks_home="" --gc_delay="1weeks" --gc_disk_headroom="0.1"
--hadoop_home="" --help="false" --hostname_lookup="true" --http_command_executor="false" --http_credentials="/tmp/Endpoint_SlaveEndpointTest_AuthorizedRequest_2_ckiFrY/http_credentials"
--http_heartbeat_interval="30secs" --initialize_driver_logging="true" --isolation="posix/cpu,posix/mem"
--launcher="posix" --launcher_dir="/tmp/SRC/build/mesos-1.6.0/_build/sub/src" --logbufsecs="0"
--logging_level="INFO" --max_completed_executors_per_framework="150" --memory_profiling="false"
--oversubscribed_resources_interval="15secs" --perf_duration="10secs" --perf_interval="1mins"
--port="5051" --qos_correction_interval_min="0ns" --quiet="false" --reconfiguration_policy="equal"
--recover="reconnect" --recovery_timeout="15mins" --registration_backoff_factor="10ms" --resources="cpus:2;gpus:0;mem:1024;disk:1024;ports:[31000-32000]"
--revocable_cpu_low_priority="true" --runtime_dir="/tmp/Endpoint_SlaveEndpointTest_AuthorizedRequest_2_ckiFrY"
--sandbox_directory="/mnt/mesos/sandbox" --strict="true" --switch_user="true" --systemd_enable_support="true"
--systemd_runtime_directory="/run/systemd/system" --version="false" --work_dir="/tmp/Endpoint_SlaveEndpointTest_AuthorizedRequest_2_qkrFSo"
--zk_session_timeout="10secs"
I0504 15:50:17.575383  6087 credentials.hpp:86] Loading credential for authentication from
'/tmp/Endpoint_SlaveEndpointTest_AuthorizedRequest_2_ckiFrY/credential'
I0504 15:50:17.575554  6087 slave.cpp:299] Agent using credential for: test-principal
I0504 15:50:17.575583  6087 credentials.hpp:37] Loading credentials for authentication from
'/tmp/Endpoint_SlaveEndpointTest_AuthorizedRequest_2_ckiFrY/http_credentials'
I0504 15:50:17.575840  6087 http.cpp:959] Creating default 'basic' HTTP authenticator for
realm 'mesos-agent-readonly'
I0504 15:50:17.576215  6087 disk_profile_adaptor.cpp:80] Creating default disk profile adaptor
module
I0504 15:50:17.577761  6087 slave.cpp:614] Agent resources: [{"name":"cpus","scalar":{"value":2.0},"type":"SCALAR"},{"name":"mem","scalar":{"value":1024.0},"type":"SCALAR"},{"name":"disk","scalar":{"value":1024.0},"type":"SCALAR"},{"name":"ports","ranges":{"range":[{"begin":31000,"end":32000}]},"type":"RANGES"}]
I0504 15:50:17.578006  6087 slave.cpp:622] Agent attributes: [  ]
I0504 15:50:17.578022  6087 slave.cpp:631] Agent hostname: 7017961a2443
I0504 15:50:17.578233  6105 task_status_update_manager.cpp:181] Pausing sending task status
updates
I0504 15:50:17.579913  6089 state.cpp:66] Recovering state from '/tmp/Endpoint_SlaveEndpointTest_AuthorizedRequest_2_qkrFSo/meta'
I0504 15:50:17.580222  6088 task_status_update_manager.cpp:207] Recovering task status update
manager
I0504 15:50:17.580498  6101 containerizer.cpp:712] Recovering containerizer
I0504 15:50:17.582372  6097 provisioner.cpp:495] Provisioner recovery complete
I0504 15:50:17.582787  6105 slave.cpp:7302] Finished recovery
I0504 15:50:17.586793  6099 process.cpp:3583] Handling HTTP event for process 'slave(991)'
with path: '/slave(991)/containers'
I0504 15:50:17.588609  6086 http.cpp:1099] HTTP GET for /slave(991)/containers from 172.17.0.2:33128
I0504 15:50:17.588739  6086 http.cpp:936] Authorizing principal 'test-principal' to GET the
'/containers' endpoint
I0504 15:50:17.593011  6082 slave.cpp:929] Agent terminating
[       OK ] Endpoint/SlaveEndpointTest.AuthorizedRequest/2 (38 ms)
[ RUN      ] Endpoint/SlaveEndpointTest.UnauthorizedRequest/0
I0504 15:50:17.607033  6082 containerizer.cpp:296] Using isolation { environment_secret, posix/cpu,
posix/mem, filesystem/posix, network/cni }
W0504 15:50:17.607578  6082 backend.cpp:76] Failed to create 'aufs' backend: AufsBackend requires
root privileges
W0504 15:50:17.607607  6082 backend.cpp:76] Failed to create 'bind' backend: BindBackend requires
root privileges
I0504 15:50:17.607635  6082 provisioner.cpp:299] Using default backend 'copy'
I0504 15:50:17.611896  6101 slave.cpp:266] Mesos agent started on (992)@172.17.0.2:43632
I0504 15:50:17.611938  6101 slave.cpp:267] Flags at startup: --acls="" --appc_simple_discovery_uri_prefix="http://"
--appc_store_dir="/tmp/Endpoint_SlaveEndpointTest_UnauthorizedRequest_0_jd8GZg/store/appc"
--authenticate_http_readonly="true" --authenticate_http_readwrite="false" --authenticatee="crammd5"
--authentication_backoff_factor="1secs" --authorizer="local" --cgroups_cpu_enable_pids_and_tids_count="false"
--cgroups_enable_cfs="false" --cgroups_hierarchy="/sys/fs/cgroup" --cgroups_limit_swap="false"
--cgroups_root="mesos" --container_disk_watch_interval="15secs" --containerizers="mesos" --credential="/tmp/Endpoint_SlaveEndpointTest_UnauthorizedRequest_0_jd8GZg/credential"
--default_role="*" --disallow_sharing_agent_pid_namespace="false" --disk_watch_interval="1mins"
--docker="docker" --docker_kill_orphans="true" --docker_registry="https://registry-1.docker.io"
--docker_remove_delay="6hrs" --docker_socket="/var/run/docker.sock" --docker_stop_timeout="0ns"
--docker_store_dir="/tmp/Endpoint_SlaveEndpointTest_UnauthorizedRequest_0_jd8GZg/store/docker"
--docker_volume_checkpoint_dir="/var/run/mesos/isolators/docker/volume" --enforce_container_disk_quota="false"
--executor_registration_timeout="1mins" --executor_reregistration_timeout="2secs" --executor_shutdown_grace_period="5secs"
--fetcher_cache_dir="/tmp/Endpoint_SlaveEndpointTest_UnauthorizedRequest_0_jd8GZg/fetch" --fetcher_cache_size="2GB"
--fetcher_stall_timeout="1mins" --frameworks_home="" --gc_delay="1weeks" --gc_disk_headroom="0.1"
--hadoop_home="" --help="false" --hostname_lookup="true" --http_command_executor="false" --http_credentials="/tmp/Endpoint_SlaveEndpointTest_UnauthorizedRequest_0_jd8GZg/http_credentials"
--http_heartbeat_interval="30secs" --initialize_driver_logging="true" --isolation="posix/cpu,posix/mem"
--launcher="posix" --launcher_dir="/tmp/SRC/build/mesos-1.6.0/_build/sub/src" --logbufsecs="0"
--logging_level="INFO" --max_completed_executors_per_framework="150" --memory_profiling="false"
--oversubscribed_resources_interval="15secs" --perf_duration="10secs" --perf_interval="1mins"
--port="5051" --qos_correction_interval_min="0ns" --quiet="false" --reconfiguration_policy="equal"
--recover="reconnect" --recovery_timeout="15mins" --registration_backoff_factor="10ms" --resources="cpus:2;gpus:0;mem:1024;disk:1024;ports:[31000-32000]"
--revocable_cpu_low_priority="true" --runtime_dir="/tmp/Endpoint_SlaveEndpointTest_UnauthorizedRequest_0_jd8GZg"
--sandbox_directory="/mnt/mesos/sandbox" --strict="true" --switch_user="true" --systemd_enable_support="true"
--systemd_runtime_directory="/run/systemd/system" --version="false" --work_dir="/tmp/Endpoint_SlaveEndpointTest_UnauthorizedRequest_0_wqomlH"
--zk_session_timeout="10secs"
I0504 15:50:17.612540  6101 credentials.hpp:86] Loading credential for authentication from
'/tmp/Endpoint_SlaveEndpointTest_UnauthorizedRequest_0_jd8GZg/credential'
I0504 15:50:17.612758  6101 slave.cpp:299] Agent using credential for: test-principal
I0504 15:50:17.612797  6101 credentials.hpp:37] Loading credentials for authentication from
'/tmp/Endpoint_SlaveEndpointTest_UnauthorizedRequest_0_jd8GZg/http_credentials'
I0504 15:50:17.613122  6101 http.cpp:959] Creating default 'basic' HTTP authenticator for
realm 'mesos-agent-readonly'
I0504 15:50:17.613584  6101 disk_profile_adaptor.cpp:80] Creating default disk profile adaptor
module
I0504 15:50:17.615867  6101 slave.cpp:614] Agent resources: [{"name":"cpus","scalar":{"value":2.0},"type":"SCALAR"},{"name":"mem","scalar":{"value":1024.0},"type":"SCALAR"},{"name":"disk","scalar":{"value":1024.0},"type":"SCALAR"},{"name":"ports","ranges":{"range":[{"begin":31000,"end":32000}]},"type":"RANGES"}]
I0504 15:50:17.616255  6101 slave.cpp:622] Agent attributes: [  ]
I0504 15:50:17.616278  6101 slave.cpp:631] Agent hostname: 7017961a2443
I0504 15:50:17.616519  6102 task_status_update_manager.cpp:181] Pausing sending task status
updates
I0504 15:50:17.618551  6094 state.cpp:66] Recovering state from '/tmp/Endpoint_SlaveEndpointTest_UnauthorizedRequest_0_wqomlH/meta'
I0504 15:50:17.618911  6094 task_status_update_manager.cpp:207] Recovering task status update
manager
I0504 15:50:17.619108  6095 containerizer.cpp:712] Recovering containerizer
I0504 15:50:17.621193  6090 provisioner.cpp:495] Provisioner recovery complete
I0504 15:50:17.621850  6091 slave.cpp:7302] Finished recovery
I0504 15:50:17.627049  6095 process.cpp:3583] Handling HTTP event for process 'slave(992)'
with path: '/slave(992)/monitor/statistics'
I0504 15:50:17.629820  6090 http.cpp:1099] HTTP GET for /slave(992)/monitor/statistics from
172.17.0.2:33130
I0504 15:50:17.629954  6090 http.cpp:936] Authorizing principal 'test-principal' to GET the
'/monitor/statistics' endpoint
I0504 15:50:17.632856  6100 slave.cpp:929] Agent terminating
[       OK ] Endpoint/SlaveEndpointTest.UnauthorizedRequest/0 (44 ms)
[ RUN      ] Endpoint/SlaveEndpointTest.UnauthorizedRequest/1
I0504 15:50:17.656671  6082 containerizer.cpp:296] Using isolation { environment_secret, posix/cpu,
posix/mem, filesystem/posix, network/cni }
W0504 15:50:17.657647  6082 backend.cpp:76] Failed to create 'aufs' backend: AufsBackend requires
root privileges
W0504 15:50:17.657738  6082 backend.cpp:76] Failed to create 'bind' backend: BindBackend requires
root privileges
I0504 15:50:17.657791  6082 provisioner.cpp:299] Using default backend 'copy'
I0504 15:50:17.664867  6105 slave.cpp:266] Mesos agent started on (993)@172.17.0.2:43632
I0504 15:50:17.664911  6105 slave.cpp:267] Flags at startup: --acls="" --appc_simple_discovery_uri_prefix="http://"
--appc_store_dir="/tmp/Endpoint_SlaveEndpointTest_UnauthorizedRequest_1_zVW6Wz/store/appc"
--authenticate_http_readonly="true" --authenticate_http_readwrite="false" --authenticatee="crammd5"
--authentication_backoff_factor="1secs" --authorizer="local" --cgroups_cpu_enable_pids_and_tids_count="false"
--cgroups_enable_cfs="false" --cgroups_hierarchy="/sys/fs/cgroup" --cgroups_limit_swap="false"
--cgroups_root="mesos" --container_disk_watch_interval="15secs" --containerizers="mesos" --credential="/tmp/Endpoint_SlaveEndpointTest_UnauthorizedRequest_1_zVW6Wz/credential"
--default_role="*" --disallow_sharing_agent_pid_namespace="false" --disk_watch_interval="1mins"
--docker="docker" --docker_kill_orphans="true" --docker_registry="https://registry-1.docker.io"
--docker_remove_delay="6hrs" --docker_socket="/var/run/docker.sock" --docker_stop_timeout="0ns"
--docker_store_dir="/tmp/Endpoint_SlaveEndpointTest_UnauthorizedRequest_1_zVW6Wz/store/docker"
--docker_volume_checkpoint_dir="/var/run/mesos/isolators/docker/volume" --enforce_container_disk_quota="false"
--executor_registration_timeout="1mins" --executor_reregistration_timeout="2secs" --executor_shutdown_grace_period="5secs"
--fetcher_cache_dir="/tmp/Endpoint_SlaveEndpointTest_UnauthorizedRequest_1_zVW6Wz/fetch" --fetcher_cache_size="2GB"
--fetcher_stall_timeout="1mins" --frameworks_home="" --gc_delay="1weeks" --gc_disk_headroom="0.1"
--hadoop_home="" --help="false" --hostname_lookup="true" --http_command_executor="false" --http_credentials="/tmp/Endpoint_SlaveEndpointTest_UnauthorizedRequest_1_zVW6Wz/http_credentials"
--http_heartbeat_interval="30secs" --initialize_driver_logging="true" --isolation="posix/cpu,posix/mem"
--launcher="posix" --launcher_dir="/tmp/SRC/build/mesos-1.6.0/_build/sub/src" --logbufsecs="0"
--logging_level="INFO" --max_completed_executors_per_framework="150" --memory_profiling="false"
--oversubscribed_resources_interval="15secs" --perf_duration="10secs" --perf_interval="1mins"
--port="5051" --qos_correction_interval_min="0ns" --quiet="false" --reconfiguration_policy="equal"
--recover="reconnect" --recovery_timeout="15mins" --registration_backoff_factor="10ms" --resources="cpus:2;gpus:0;mem:1024;disk:1024;ports:[31000-32000]"
--revocable_cpu_low_priority="true" --runtime_dir="/tmp/Endpoint_SlaveEndpointTest_UnauthorizedRequest_1_zVW6Wz"
--sandbox_directory="/mnt/mesos/sandbox" --strict="true" --switch_user="true" --systemd_enable_support="true"
--systemd_runtime_directory="/run/systemd/system" --version="false" --work_dir="/tmp/Endpoint_SlaveEndpointTest_UnauthorizedRequest_1_zVR4b0"
--zk_session_timeout="10secs"
I0504 15:50:17.665565  6105 credentials.hpp:86] Loading credential for authentication from
'/tmp/Endpoint_SlaveEndpointTest_UnauthorizedRequest_1_zVW6Wz/credential'
I0504 15:50:17.665882  6105 slave.cpp:299] Agent using credential for: test-principal
I0504 15:50:17.665931  6105 credentials.hpp:37] Loading credentials for authentication from
'/tmp/Endpoint_SlaveEndpointTest_UnauthorizedRequest_1_zVW6Wz/http_credentials'
I0504 15:50:17.666348  6105 http.cpp:959] Creating default 'basic' HTTP authenticator for
realm 'mesos-agent-readonly'
I0504 15:50:17.666934  6105 disk_profile_adaptor.cpp:80] Creating default disk profile adaptor
module
I0504 15:50:17.669353  6105 slave.cpp:614] Agent resources: [{"name":"cpus","scalar":{"value":2.0},"type":"SCALAR"},{"name":"mem","scalar":{"value":1024.0},"type":"SCALAR"},{"name":"disk","scalar":{"value":1024.0},"type":"SCALAR"},{"name":"ports","ranges":{"range":[{"begin":31000,"end":32000}]},"type":"RANGES"}]
I0504 15:50:17.669777  6105 slave.cpp:622] Agent attributes: [  ]
I0504 15:50:17.669805  6105 slave.cpp:631] Agent hostname: 7017961a2443
I0504 15:50:17.670063  6100 task_status_update_manager.cpp:181] Pausing sending task status
updates
I0504 15:50:17.672675  6098 state.cpp:66] Recovering state from '/tmp/Endpoint_SlaveEndpointTest_UnauthorizedRequest_1_zVR4b0/meta'
I0504 15:50:17.673156  6098 task_status_update_manager.cpp:207] Recovering task status update
manager
I0504 15:50:17.673486  6097 containerizer.cpp:712] Recovering containerizer
I0504 15:50:17.675979  6104 provisioner.cpp:495] Provisioner recovery complete
I0504 15:50:17.676671  6086 slave.cpp:7302] Finished recovery
I0504 15:50:17.681128  6084 process.cpp:3583] Handling HTTP event for process 'slave(993)'
with path: '/slave(993)/monitor/statistics.json'
I0504 15:50:17.683315  6099 http.cpp:1099] HTTP GET for /slave(993)/monitor/statistics.json
from 172.17.0.2:33132
I0504 15:50:17.683423  6099 http.cpp:936] Authorizing principal 'test-principal' to GET the
'/monitor/statistics.json' endpoint
I0504 15:50:17.685873  6098 slave.cpp:929] Agent terminating
[       OK ] Endpoint/SlaveEndpointTest.UnauthorizedRequest/1 (49 ms)
[ RUN      ] Endpoint/SlaveEndpointTest.UnauthorizedRequest/2
I0504 15:50:17.702570  6082 containerizer.cpp:296] Using isolation { environment_secret, posix/cpu,
posix/mem, filesystem/posix, network/cni }
W0504 15:50:17.703205  6082 backend.cpp:76] Failed to create 'aufs' backend: AufsBackend requires
root privileges
W0504 15:50:17.703239  6082 backend.cpp:76] Failed to create 'bind' backend: BindBackend requires
root privileges
I0504 15:50:17.703272  6082 provisioner.cpp:299] Using default backend 'copy'
I0504 15:50:17.708184  6095 slave.cpp:266] Mesos agent started on (994)@172.17.0.2:43632
I0504 15:50:17.708233  6095 slave.cpp:267] Flags at startup: --acls="" --appc_simple_discovery_uri_prefix="http://"
--appc_store_dir="/tmp/Endpoint_SlaveEndpointTest_UnauthorizedRequest_2_tpgVmT/store/appc"
--authenticate_http_readonly="true" --authenticate_http_readwrite="false" --authenticatee="crammd5"
--authentication_backoff_factor="1secs" --authorizer="local" --cgroups_cpu_enable_pids_and_tids_count="false"
--cgroups_enable_cfs="false" --cgroups_hierarchy="/sys/fs/cgroup" --cgroups_limit_swap="false"
--cgroups_root="mesos" --container_disk_watch_interval="15secs" --containerizers="mesos" --credential="/tmp/Endpoint_SlaveEndpointTest_UnauthorizedRequest_2_tpgVmT/credential"
--default_role="*" --disallow_sharing_agent_pid_namespace="false" --disk_watch_interval="1mins"
--docker="docker" --docker_kill_orphans="true" --docker_registry="https://registry-1.docker.io"
--docker_remove_delay="6hrs" --docker_socket="/var/run/docker.sock" --docker_stop_timeout="0ns"
--docker_store_dir="/tmp/Endpoint_SlaveEndpointTest_UnauthorizedRequest_2_tpgVmT/store/docker"
--docker_volume_checkpoint_dir="/var/run/mesos/isolators/docker/volume" --enforce_container_disk_quota="false"
--executor_registration_timeout="1mins" --executor_reregistration_timeout="2secs" --executor_shutdown_grace_period="5secs"
--fetcher_cache_dir="/tmp/Endpoint_SlaveEndpointTest_UnauthorizedRequest_2_tpgVmT/fetch" --fetcher_cache_size="2GB"
--fetcher_stall_timeout="1mins" --frameworks_home="" --gc_delay="1weeks" --gc_disk_headroom="0.1"
--hadoop_home="" --help="false" --hostname_lookup="true" --http_command_executor="false" --http_credentials="/tmp/Endpoint_SlaveEndpointTest_UnauthorizedRequest_2_tpgVmT/http_credentials"
--http_heartbeat_interval="30secs" --initialize_driver_logging="true" --isolation="posix/cpu,posix/mem"
--launcher="posix" --launcher_dir="/tmp/SRC/build/mesos-1.6.0/_build/sub/src" --logbufsecs="0"
--logging_level="INFO" --max_completed_executors_per_framework="150" --memory_profiling="false"
--oversubscribed_resources_interval="15secs" --perf_duration="10secs" --perf_interval="1mins"
--port="5051" --qos_correction_interval_min="0ns" --quiet="false" --reconfiguration_policy="equal"
--recover="reconnect" --recovery_timeout="15mins" --registration_backoff_factor="10ms" --resources="cpus:2;gpus:0;mem:1024;disk:1024;ports:[31000-32000]"
--revocable_cpu_low_priority="true" --runtime_dir="/tmp/Endpoint_SlaveEndpointTest_UnauthorizedRequest_2_tpgVmT"
--sandbox_directory="/mnt/mesos/sandbox" --strict="true" --switch_user="true" --systemd_enable_support="true"
--systemd_runtime_directory="/run/systemd/system" --version="false" --work_dir="/tmp/Endpoint_SlaveEndpointTest_UnauthorizedRequest_2_kxP5uj"
--zk_session_timeout="10secs"
I0504 15:50:17.708878  6095 credentials.hpp:86] Loading credential for authentication from
'/tmp/Endpoint_SlaveEndpointTest_UnauthorizedRequest_2_tpgVmT/credential'
I0504 15:50:17.709115  6095 slave.cpp:299] Agent using credential for: test-principal
I0504 15:50:17.709156  6095 credentials.hpp:37] Loading credentials for authentication from
'/tmp/Endpoint_SlaveEndpointTest_UnauthorizedRequest_2_tpgVmT/http_credentials'
I0504 15:50:17.709503  6095 http.cpp:959] Creating default 'basic' HTTP authenticator for
realm 'mesos-agent-readonly'
I0504 15:50:17.710093  6095 disk_profile_adaptor.cpp:80] Creating default disk profile adaptor
module
I0504 15:50:17.712342  6095 slave.cpp:614] Agent resources: [{"name":"cpus","scalar":{"value":2.0},"type":"SCALAR"},{"name":"mem","scalar":{"value":1024.0},"type":"SCALAR"},{"name":"disk","scalar":{"value":1024.0},"type":"SCALAR"},{"name":"ports","ranges":{"range":[{"begin":31000,"end":32000}]},"type":"RANGES"}]
I0504 15:50:17.712720  6095 slave.cpp:622] Agent attributes: [  ]
I0504 15:50:17.712744  6095 slave.cpp:631] Agent hostname: 7017961a2443
I0504 15:50:17.712913  6093 task_status_update_manager.cpp:181] Pausing sending task status
updates
I0504 15:50:17.715435  6102 state.cpp:66] Recovering state from '/tmp/Endpoint_SlaveEndpointTest_UnauthorizedRequest_2_kxP5uj/meta'
I0504 15:50:17.715911  6089 task_status_update_manager.cpp:207] Recovering task status update
manager
I0504 15:50:17.716305  6099 containerizer.cpp:712] Recovering containerizer
I0504 15:50:17.718785  6101 provisioner.cpp:495] Provisioner recovery complete
I0504 15:50:17.719316  6101 slave.cpp:7302] Finished recovery
I0504 15:50:17.723381  6086 process.cpp:3583] Handling HTTP event for process 'slave(994)'
with path: '/slave(994)/containers'
I0504 15:50:17.725765  6093 http.cpp:1099] HTTP GET for /slave(994)/containers from 172.17.0.2:33134
I0504 15:50:17.725841  6093 http.cpp:936] Authorizing principal 'test-principal' to GET the
'/containers' endpoint
I0504 15:50:17.727996  6092 slave.cpp:929] Agent terminating
[       OK ] Endpoint/SlaveEndpointTest.UnauthorizedRequest/2 (40 ms)
[ RUN      ] Endpoint/SlaveEndpointTest.NoAuthorizer/0
I0504 15:50:17.742708  6082 containerizer.cpp:296] Using isolation { environment_secret, posix/cpu,
posix/mem, filesystem/posix, network/cni }
W0504 15:50:17.743629  6082 backend.cpp:76] Failed to create 'aufs' backend: AufsBackend requires
root privileges
W0504 15:50:17.743680  6082 backend.cpp:76] Failed to create 'bind' backend: BindBackend requires
root privileges
I0504 15:50:17.743737  6082 provisioner.cpp:299] Using default backend 'copy'
I0504 15:50:17.746544  6082 cluster.cpp:460] Creating default 'local' authorizer
I0504 15:50:17.749342  6102 slave.cpp:266] Mesos agent started on (995)@172.17.0.2:43632
I0504 15:50:17.749377  6102 slave.cpp:267] Flags at startup: --acls="" --appc_simple_discovery_uri_prefix="http://"
--appc_store_dir="/tmp/Endpoint_SlaveEndpointTest_NoAuthorizer_0_s0TT9c/store/appc" --authenticate_http_readonly="true"
--authenticate_http_readwrite="false" --authenticatee="crammd5" --authentication_backoff_factor="1secs"
--authorizer="local" --cgroups_cpu_enable_pids_and_tids_count="false" --cgroups_enable_cfs="false"
--cgroups_hierarchy="/sys/fs/cgroup" --cgroups_limit_swap="false" --cgroups_root="mesos" --container_disk_watch_interval="15secs"
--containerizers="mesos" --credential="/tmp/Endpoint_SlaveEndpointTest_NoAuthorizer_0_s0TT9c/credential"
--default_role="*" --disallow_sharing_agent_pid_namespace="false" --disk_watch_interval="1mins"
--docker="docker" --docker_kill_orphans="true" --docker_registry="https://registry-1.docker.io"
--docker_remove_delay="6hrs" --docker_socket="/var/run/docker.sock" --docker_stop_timeout="0ns"
--docker_store_dir="/tmp/Endpoint_SlaveEndpointTest_NoAuthorizer_0_s0TT9c/store/docker" --docker_volume_checkpoint_dir="/var/run/mesos/isolators/docker/volume"
--enforce_container_disk_quota="false" --executor_registration_timeout="1mins" --executor_reregistration_timeout="2secs"
--executor_shutdown_grace_period="5secs" --fetcher_cache_dir="/tmp/Endpoint_SlaveEndpointTest_NoAuthorizer_0_s0TT9c/fetch"
--fetcher_cache_size="2GB" --fetcher_stall_timeout="1mins" --frameworks_home="" --gc_delay="1weeks"
--gc_disk_headroom="0.1" --hadoop_home="" --help="false" --hostname_lookup="true" --http_command_executor="false"
--http_credentials="/tmp/Endpoint_SlaveEndpointTest_NoAuthorizer_0_s0TT9c/http_credentials"
--http_heartbeat_interval="30secs" --initialize_driver_logging="true" --isolation="posix/cpu,posix/mem"
--launcher="posix" --launcher_dir="/tmp/SRC/build/mesos-1.6.0/_build/sub/src" --logbufsecs="0"
--logging_level="INFO" --max_completed_executors_per_framework="150" --memory_profiling="false"
--oversubscribed_resources_interval="15secs" --perf_duration="10secs" --perf_interval="1mins"
--port="5051" --qos_correction_interval_min="0ns" --quiet="false" --reconfiguration_policy="equal"
--recover="reconnect" --recovery_timeout="15mins" --registration_backoff_factor="10ms" --resources="cpus:2;gpus:0;mem:1024;disk:1024;ports:[31000-32000]"
--revocable_cpu_low_priority="true" --runtime_dir="/tmp/Endpoint_SlaveEndpointTest_NoAuthorizer_0_s0TT9c"
--sandbox_directory="/mnt/mesos/sandbox" --strict="true" --switch_user="true" --systemd_enable_support="true"
--systemd_runtime_directory="/run/systemd/system" --version="false" --work_dir="/tmp/Endpoint_SlaveEndpointTest_NoAuthorizer_0_oTkocD"
--zk_session_timeout="10secs"
I0504 15:50:17.749861  6102 credentials.hpp:86] Loading credential for authentication from
'/tmp/Endpoint_SlaveEndpointTest_NoAuthorizer_0_s0TT9c/credential'
I0504 15:50:17.750041  6102 slave.cpp:299] Agent using credential for: test-principal
I0504 15:50:17.750071  6102 credentials.hpp:37] Loading credentials for authentication from
'/tmp/Endpoint_SlaveEndpointTest_NoAuthorizer_0_s0TT9c/http_credentials'
I0504 15:50:17.750330  6102 http.cpp:959] Creating default 'basic' HTTP authenticator for
realm 'mesos-agent-readonly'
I0504 15:50:17.750696  6102 disk_profile_adaptor.cpp:80] Creating default disk profile adaptor
module
I0504 15:50:17.752213  6102 slave.cpp:614] Agent resources: [{"name":"cpus","scalar":{"value":2.0},"type":"SCALAR"},{"name":"mem","scalar":{"value":1024.0},"type":"SCALAR"},{"name":"disk","scalar":{"value":1024.0},"type":"SCALAR"},{"name":"ports","ranges":{"range":[{"begin":31000,"end":32000}]},"type":"RANGES"}]
I0504 15:50:17.752466  6102 slave.cpp:622] Agent attributes: [  ]
I0504 15:50:17.752485  6102 slave.cpp:631] Agent hostname: 7017961a2443
I0504 15:50:17.752629  6096 task_status_update_manager.cpp:181] Pausing sending task status
updates
I0504 15:50:17.754446  6083 state.cpp:66] Recovering state from '/tmp/Endpoint_SlaveEndpointTest_NoAuthorizer_0_oTkocD/meta'
I0504 15:50:17.754822  6101 task_status_update_manager.cpp:207] Recovering task status update
manager
I0504 15:50:17.755086  6095 containerizer.cpp:712] Recovering containerizer
I0504 15:50:17.756959  6092 provisioner.cpp:495] Provisioner recovery complete
I0504 15:50:17.757504  6092 slave.cpp:7302] Finished recovery
I0504 15:50:17.760854  6100 process.cpp:3583] Handling HTTP event for process 'slave(995)'
with path: '/slave(995)/monitor/statistics'
I0504 15:50:17.762770  6096 http.cpp:1099] HTTP GET for /slave(995)/monitor/statistics from
172.17.0.2:33136
I0504 15:50:17.762887  6096 http.cpp:936] Authorizing principal 'test-principal' to GET the
'/monitor/statistics' endpoint
I0504 15:50:17.766782  6082 slave.cpp:929] Agent terminating
[       OK ] Endpoint/SlaveEndpointTest.NoAuthorizer/0 (40 ms)
[ RUN      ] Endpoint/SlaveEndpointTest.NoAuthorizer/1
I0504 15:50:17.786197  6082 containerizer.cpp:296] Using isolation { environment_secret, posix/cpu,
posix/mem, filesystem/posix, network/cni }
W0504 15:50:17.787030  6082 backend.cpp:76] Failed to create 'aufs' backend: AufsBackend requires
root privileges
W0504 15:50:17.787075  6082 backend.cpp:76] Failed to create 'bind' backend: BindBackend requires
root privileges
I0504 15:50:17.787117  6082 provisioner.cpp:299] Using default backend 'copy'
I0504 15:50:17.790179  6082 cluster.cpp:460] Creating default 'local' authorizer
I0504 15:50:17.793900  6098 slave.cpp:266] Mesos agent started on (996)@172.17.0.2:43632
I0504 15:50:17.793943  6098 slave.cpp:267] Flags at startup: --acls="" --appc_simple_discovery_uri_prefix="http://"
--appc_store_dir="/tmp/Endpoint_SlaveEndpointTest_NoAuthorizer_1_EPVXjx/store/appc" --authenticate_http_readonly="true"
--authenticate_http_readwrite="false" --authenticatee="crammd5" --authentication_backoff_factor="1secs"
--authorizer="local" --cgroups_cpu_enable_pids_and_tids_count="false" --cgroups_enable_cfs="false"
--cgroups_hierarchy="/sys/fs/cgroup" --cgroups_limit_swap="false" --cgroups_root="mesos" --container_disk_watch_interval="15secs"
--containerizers="mesos" --credential="/tmp/Endpoint_SlaveEndpointTest_NoAuthorizer_1_EPVXjx/credential"
--default_role="*" --disallow_sharing_agent_pid_namespace="false" --disk_watch_interval="1mins"
--docker="docker" --docker_kill_orphans="true" --docker_registry="https://registry-1.docker.io"
--docker_remove_delay="6hrs" --docker_socket="/var/run/docker.sock" --docker_stop_timeout="0ns"
--docker_store_dir="/tmp/Endpoint_SlaveEndpointTest_NoAuthorizer_1_EPVXjx/store/docker" --docker_volume_checkpoint_dir="/var/run/mesos/isolators/docker/volume"
--enforce_container_disk_quota="false" --executor_registration_timeout="1mins" --executor_reregistration_timeout="2secs"
--executor_shutdown_grace_period="5secs" --fetcher_cache_dir="/tmp/Endpoint_SlaveEndpointTest_NoAuthorizer_1_EPVXjx/fetch"
--fetcher_cache_size="2GB" --fetcher_stall_timeout="1mins" --frameworks_home="" --gc_delay="1weeks"
--gc_disk_headroom="0.1" --hadoop_home="" --help="false" --hostname_lookup="true" --http_command_executor="false"
--http_credentials="/tmp/Endpoint_SlaveEndpointTest_NoAuthorizer_1_EPVXjx/http_credentials"
--http_heartbeat_interval="30secs" --initialize_driver_logging="true" --isolation="posix/cpu,posix/mem"
--launcher="posix" --launcher_dir="/tmp/SRC/build/mesos-1.6.0/_build/sub/src" --logbufsecs="0"
--logging_level="INFO" --max_completed_executors_per_framework="150" --memory_profiling="false"
--oversubscribed_resources_interval="15secs" --perf_duration="10secs" --perf_interval="1mins"
--port="5051" --qos_correction_interval_min="0ns" --quiet="false" --reconfiguration_policy="equal"
--recover="reconnect" --recovery_timeout="15mins" --registration_backoff_factor="10ms" --resources="cpus:2;gpus:0;mem:1024;disk:1024;ports:[31000-32000]"
--revocable_cpu_low_priority="true" --runtime_dir="/tmp/Endpoint_SlaveEndpointTest_NoAuthorizer_1_EPVXjx"
--sandbox_directory="/mnt/mesos/sandbox" --strict="true" --switch_user="true" --systemd_enable_support="true"
--systemd_runtime_directory="/run/systemd/system" --version="false" --work_dir="/tmp/Endpoint_SlaveEndpointTest_NoAuthorizer_1_DarvgX"
--zk_session_timeout="10secs"
I0504 15:50:17.794513  6098 credentials.hpp:86] Loading credential for authentication from
'/tmp/Endpoint_SlaveEndpointTest_NoAuthorizer_1_EPVXjx/credential'
I0504 15:50:17.794744  6098 slave.cpp:299] Agent using credential for: test-principal
I0504 15:50:17.794782  6098 credentials.hpp:37] Loading credentials for authentication from
'/tmp/Endpoint_SlaveEndpointTest_NoAuthorizer_1_EPVXjx/http_credentials'
I0504 15:50:17.795116  6098 http.cpp:959] Creating default 'basic' HTTP authenticator for
realm 'mesos-agent-readonly'
I0504 15:50:17.795600  6098 disk_profile_adaptor.cpp:80] Creating default disk profile adaptor
module
I0504 15:50:17.797588  6098 slave.cpp:614] Agent resources: [{"name":"cpus","scalar":{"value":2.0},"type":"SCALAR"},{"name":"mem","scalar":{"value":1024.0},"type":"SCALAR"},{"name":"disk","scalar":{"value":1024.0},"type":"SCALAR"},{"name":"ports","ranges":{"range":[{"begin":31000,"end":32000}]},"type":"RANGES"}]
I0504 15:50:17.797935  6098 slave.cpp:622] Agent attributes: [  ]
I0504 15:50:17.797956  6098 slave.cpp:631] Agent hostname: 7017961a2443
I0504 15:50:17.798156  6093 task_status_update_manager.cpp:181] Pausing sending task status
updates
I0504 15:50:17.800065  6088 state.cpp:66] Recovering state from '/tmp/Endpoint_SlaveEndpointTest_NoAuthorizer_1_DarvgX/meta'
I0504 15:50:17.800426  6084 task_status_update_manager.cpp:207] Recovering task status update
manager
I0504 15:50:17.800704  6096 containerizer.cpp:712] Recovering containerizer
I0504 15:50:17.802480  6103 provisioner.cpp:495] Provisioner recovery complete
I0504 15:50:17.802914  6089 slave.cpp:7302] Finished recovery
I0504 15:50:17.806455  6083 process.cpp:3583] Handling HTTP event for process 'slave(996)'
with path: '/slave(996)/monitor/statistics.json'
I0504 15:50:17.808594  6092 http.cpp:1099] HTTP GET for /slave(996)/monitor/statistics.json
from 172.17.0.2:33138
I0504 15:50:17.808691  6092 http.cpp:936] Authorizing principal 'test-principal' to GET the
'/monitor/statistics.json' endpoint
I0504 15:50:17.812155  6101 slave.cpp:929] Agent terminating
[       OK ] Endpoint/SlaveEndpointTest.NoAuthorizer/1 (45 ms)
[ RUN      ] Endpoint/SlaveEndpointTest.NoAuthorizer/2
I0504 15:50:17.830947  6082 containerizer.cpp:296] Using isolation { environment_secret, posix/cpu,
posix/mem, filesystem/posix, network/cni }
W0504 15:50:17.831650  6082 backend.cpp:76] Failed to create 'aufs' backend: AufsBackend requires
root privileges
W0504 15:50:17.831687  6082 backend.cpp:76] Failed to create 'bind' backend: BindBackend requires
root privileges
I0504 15:50:17.831724  6082 provisioner.cpp:299] Using default backend 'copy'
I0504 15:50:17.834177  6082 cluster.cpp:460] Creating default 'local' authorizer
I0504 15:50:17.836983  6085 slave.cpp:266] Mesos agent started on (997)@172.17.0.2:43632
I0504 15:50:17.837023  6085 slave.cpp:267] Flags at startup: --acls="" --appc_simple_discovery_uri_prefix="http://"
--appc_store_dir="/tmp/Endpoint_SlaveEndpointTest_NoAuthorizer_2_vMz1TR/store/appc" --authenticate_http_readonly="true"
--authenticate_http_readwrite="false" --authenticatee="crammd5" --authentication_backoff_factor="1secs"
--authorizer="local" --cgroups_cpu_enable_pids_and_tids_count="false" --cgroups_enable_cfs="false"
--cgroups_hierarchy="/sys/fs/cgroup" --cgroups_limit_swap="false" --cgroups_root="mesos" --container_disk_watch_interval="15secs"
--containerizers="mesos" --credential="/tmp/Endpoint_SlaveEndpointTest_NoAuthorizer_2_vMz1TR/credential"
--default_role="*" --disallow_sharing_agent_pid_namespace="false" --disk_watch_interval="1mins"
--docker="docker" --docker_kill_orphans="true" --docker_registry="https://registry-1.docker.io"
--docker_remove_delay="6hrs" --docker_socket="/var/run/docker.sock" --docker_stop_timeout="0ns"
--docker_store_dir="/tmp/Endpoint_SlaveEndpointTest_NoAuthorizer_2_vMz1TR/store/docker" --docker_volume_checkpoint_dir="/var/run/mesos/isolators/docker/volume"
--enforce_container_disk_quota="false" --executor_registration_timeout="1mins" --executor_reregistration_timeout="2secs"
--executor_shutdown_grace_period="5secs" --fetcher_cache_dir="/tmp/Endpoint_SlaveEndpointTest_NoAuthorizer_2_vMz1TR/fetch"
--fetcher_cache_size="2GB" --fetcher_stall_timeout="1mins" --frameworks_home="" --gc_delay="1weeks"
--gc_disk_headroom="0.1" --hadoop_home="" --help="false" --hostname_lookup="true" --http_command_executor="false"
--http_credentials="/tmp/Endpoint_SlaveEndpointTest_NoAuthorizer_2_vMz1TR/http_credentials"
--http_heartbeat_interval="30secs" --initialize_driver_logging="true" --isolation="posix/cpu,posix/mem"
--launcher="posix" --launcher_dir="/tmp/SRC/build/mesos-1.6.0/_build/sub/src" --logbufsecs="0"
--logging_level="INFO" --max_completed_executors_per_framework="150" --memory_profiling="false"
--oversubscribed_resources_interval="15secs" --perf_duration="10secs" --perf_interval="1mins"
--port="5051" --qos_correction_interval_min="0ns" --quiet="false" --reconfiguration_policy="equal"
--recover="reconnect" --recovery_timeout="15mins" --registration_backoff_factor="10ms" --resources="cpus:2;gpus:0;mem:1024;disk:1024;ports:[31000-32000]"
--revocable_cpu_low_priority="true" --runtime_dir="/tmp/Endpoint_SlaveEndpointTest_NoAuthorizer_2_vMz1TR"
--sandbox_directory="/mnt/mesos/sandbox" --strict="true" --switch_user="true" --systemd_enable_support="true"
--systemd_runtime_directory="/run/systemd/system" --version="false" --work_dir="/tmp/Endpoint_SlaveEndpointTest_NoAuthorizer_2_eXz4Jh"
--zk_session_timeout="10secs"
I0504 15:50:17.837728  6085 credentials.hpp:86] Loading credential for authentication from
'/tmp/Endpoint_SlaveEndpointTest_NoAuthorizer_2_vMz1TR/credential'
I0504 15:50:17.837962  6085 slave.cpp:299] Agent using credential for: test-principal
I0504 15:50:17.838003  6085 credentials.hpp:37] Loading credentials for authentication from
'/tmp/Endpoint_SlaveEndpointTest_NoAuthorizer_2_vMz1TR/http_credentials'
I0504 15:50:17.838364  6085 http.cpp:959] Creating default 'basic' HTTP authenticator for
realm 'mesos-agent-readonly'
I0504 15:50:17.838878  6085 disk_profile_adaptor.cpp:80] Creating default disk profile adaptor
module
I0504 15:50:17.840987  6085 slave.cpp:614] Agent resources: [{"name":"cpus","scalar":{"value":2.0},"type":"SCALAR"},{"name":"mem","scalar":{"value":1024.0},"type":"SCALAR"},{"name":"disk","scalar":{"value":1024.0},"type":"SCALAR"},{"name":"ports","ranges":{"range":[{"begin":31000,"end":32000}]},"type":"RANGES"}]
I0504 15:50:17.841346  6085 slave.cpp:622] Agent attributes: [  ]
I0504 15:50:17.841372  6085 slave.cpp:631] Agent hostname: 7017961a2443
I0504 15:50:17.841612  6090 task_status_update_manager.cpp:181] Pausing sending task status
updates
I0504 15:50:17.844099  6106 state.cpp:66] Recovering state from '/tmp/Endpoint_SlaveEndpointTest_NoAuthorizer_2_eXz4Jh/meta'
I0504 15:50:17.844565  6100 task_status_update_manager.cpp:207] Recovering task status update
manager
I0504 15:50:17.844983  6105 containerizer.cpp:712] Recovering containerizer
I0504 15:50:17.847633  6087 provisioner.cpp:495] Provisioner recovery complete
I0504 15:50:17.848301  6090 slave.cpp:7302] Finished recovery
I0504 15:50:17.852620  6097 process.cpp:3583] Handling HTTP event for process 'slave(997)'
with path: '/slave(997)/containers'
I0504 15:50:17.854670  6087 http.cpp:1099] HTTP GET for /slave(997)/containers from 172.17.0.2:33140
I0504 15:50:17.854799  6087 http.cpp:936] Authorizing principal 'test-principal' to GET the
'/containers' endpoint
I0504 15:50:17.860461  6096 slave.cpp:929] Agent terminating
[       OK ] Endpoint/SlaveEndpointTest.NoAuthorizer/2 (47 ms)
[----------] 9 tests from Endpoint/SlaveEndpointTest (402 ms total)

[----------] 2 tests from ContainerizerType/DefaultContainerDNSFlagTest
[ RUN      ] ContainerizerType/DefaultContainerDNSFlagTest.ValidateFlag/0
[       OK ] ContainerizerType/DefaultContainerDNSFlagTest.ValidateFlag/0 (15 ms)
[ RUN      ] ContainerizerType/DefaultContainerDNSFlagTest.ValidateFlag/1
[       OK ] ContainerizerType/DefaultContainerDNSFlagTest.ValidateFlag/1 (14 ms)
[----------] 2 tests from ContainerizerType/DefaultContainerDNSFlagTest (29 ms total)

[----------] Global test environment tear-down
[==========] 1950 tests from 197 test cases ran. (1064744 ms total)
[  PASSED  ] 1949 tests.
[  FAILED  ] 1 test, listed below:
[  FAILED  ] ExamplesTest.PersistentVolumeFramework

 1 FAILED TEST
  YOU HAVE 22 DISABLED TESTS

I0504 15:50:17.977003  6107 process.cpp:940] Stopped the socket accept loop
Makefile:14693: recipe for target 'check-local' failed
make[4]: *** [check-local] Error 1
make[4]: Leaving directory '/tmp/SRC/build/mesos-1.6.0/_build/sub/src'
Makefile:13809: recipe for target 'check-am' failed
make[3]: *** [check-am] Error 2
make[3]: Leaving directory '/tmp/SRC/build/mesos-1.6.0/_build/sub/src'
Makefile:13813: recipe for target 'check' failed
make[2]: *** [check] Error 2
make[2]: Leaving directory '/tmp/SRC/build/mesos-1.6.0/_build/sub/src'
Makefile:776: recipe for target 'check-recursive' failed
make[1]: *** [check-recursive] Error 1
make[1]: Leaving directory '/tmp/SRC/build/mesos-1.6.0/_build/sub'
Makefile:982: recipe for target 'distcheck' failed
make: *** [distcheck] Error 1
Untagged: mesos/mesos-build:ubuntu-16.04
Untagged: mesos/mesos-build@sha256:8685ea3c3e17663e4a1764d08df701102b4e9286c6c1a7116afccbe382777290
Deleted: sha256:4ecb5a128921ae9aad805a57a0e4d24dbcfbe84b09304997c7e2798819aa155a
Deleted: sha256:91a3c8a13a99414ff67baa2d1c6a6a82b43c237327a78d7f815414e155578ac1
Deleted: sha256:d05373b7ffe6961840e0962d4b16df22a14b1bbba3416f5aee58b579f08a2bcd
Deleted: sha256:db96690681268d3c4fdd48cd5edc2ca128c6b2493c67333983b63119622cc485
Deleted: sha256:70f40beaddd4e8dc15479d4f78d75b121fd4428c7bb29319a0fae0babd257e37
Deleted: sha256:77e6ddba346d8ad1e436256f6373dede5af4002006981b7d4116c561c759cefa
Deleted: sha256:8db758ab2fdb54da0aec53aeac876934337e6170f5a8c8872b3d4171e3d465b7
Deleted: sha256:a7fc6b405fe8ef71edfa6163d1dc9f1cb1df426049eefaa7d388e9df21a061ad
Deleted: sha256:5a3e35538f7f2e2727c8ac92f08c30002b9e8a77737de0dab91244344d59f69b
Deleted: sha256:ff986b10a018b48074e6d3a68b39aad8ccc002cdad912d4148c0f92b3729323e
Build step 'Execute shell' marked build as failure


Mime
View raw message