mesos-builds mailing list archives

Site index · List index
Message view « Date » · « Thread »
Top « Date » · « Thread »
From Apache Jenkins Server <jenk...@builds.apache.org>
Subject Build failed in Jenkins: Mesos-Reviewbot #22538
Date Thu, 24 May 2018 23:49:56 GMT
See <https://builds.apache.org/job/Mesos-Reviewbot/22538/display/redirect?page=changes>

Changes:

[bmahler] Fixed a performance issue in collect/await.

[andrew] Added support script to check if Python >= 3.6 is available.

[andrew] Updated support scripts to check for Python 3.

[andrew] Added python3 to list of Pylint excluded files.

[andrew] Ported all support scripts to Python 3.

[andrew] Added warning to Python version checker script.

[bmahler] Added MESOS-8952 to the 1.6.1 CHANGELOG.

[bmahler] Added MESOS-8952 to the 1.5.2 CHANGELOG.

[bmahler] Added MESOS-8952 to the 1.4.2 CHANGELOG.

------------------------------------------
[...truncated 37.22 MB...]
[       OK ] Endpoint/SlaveEndpointTest.AuthorizedRequest/1 (33 ms)
[ RUN      ] Endpoint/SlaveEndpointTest.AuthorizedRequest/2
I0524 23:49:12.848246  6097 containerizer.cpp:300] Using isolation { environment_secret, posix/cpu,
posix/mem, filesystem/posix, network/cni }
W0524 23:49:12.848870  6097 backend.cpp:76] Failed to create 'aufs' backend: AufsBackend requires
root privileges
W0524 23:49:12.848912  6097 backend.cpp:76] Failed to create 'bind' backend: BindBackend requires
root privileges
I0524 23:49:12.848943  6097 provisioner.cpp:299] Using default backend 'copy'
I0524 23:49:12.853564  6099 slave.cpp:266] Mesos agent started on (991)@172.17.0.2:36514
I0524 23:49:12.853595  6099 slave.cpp:267] Flags at startup: --acls="" --appc_simple_discovery_uri_prefix="http://"
--appc_store_dir="/tmp/Endpoint_SlaveEndpointTest_AuthorizedRequest_2_BfE40N/store/appc" --authenticate_http_readonly="true"
--authenticate_http_readwrite="false" --authenticatee="crammd5" --authentication_backoff_factor="1secs"
--authorizer="local" --cgroups_cpu_enable_pids_and_tids_count="false" --cgroups_enable_cfs="false"
--cgroups_hierarchy="/sys/fs/cgroup" --cgroups_limit_swap="false" --cgroups_root="mesos" --container_disk_watch_interval="15secs"
--containerizers="mesos" --credential="/tmp/Endpoint_SlaveEndpointTest_AuthorizedRequest_2_BfE40N/credential"
--default_role="*" --disallow_sharing_agent_pid_namespace="false" --disk_watch_interval="1mins"
--docker="docker" --docker_kill_orphans="true" --docker_registry="https://registry-1.docker.io"
--docker_remove_delay="6hrs" --docker_socket="/var/run/docker.sock" --docker_stop_timeout="0ns"
--docker_store_dir="/tmp/Endpoint_SlaveEndpointTest_AuthorizedRequest_2_BfE40N/store/docker"
--docker_volume_checkpoint_dir="/var/run/mesos/isolators/docker/volume" --enforce_container_disk_quota="false"
--executor_registration_timeout="1mins" --executor_reregistration_timeout="2secs" --executor_shutdown_grace_period="5secs"
--fetcher_cache_dir="/tmp/Endpoint_SlaveEndpointTest_AuthorizedRequest_2_BfE40N/fetch" --fetcher_cache_size="2GB"
--fetcher_stall_timeout="1mins" --frameworks_home="" --gc_delay="1weeks" --gc_disk_headroom="0.1"
--hadoop_home="" --help="false" --hostname_lookup="true" --http_command_executor="false" --http_credentials="/tmp/Endpoint_SlaveEndpointTest_AuthorizedRequest_2_BfE40N/http_credentials"
--http_heartbeat_interval="30secs" --initialize_driver_logging="true" --isolation="posix/cpu,posix/mem"
--launcher="posix" --launcher_dir="/tmp/SRC/build/mesos-1.7.0/_build/sub/src" --logbufsecs="0"
--logging_level="INFO" --max_completed_executors_per_framework="150" --memory_profiling="false"
--oversubscribed_resources_interval="15secs" --perf_duration="10secs" --perf_interval="1mins"
--port="5051" --qos_correction_interval_min="0ns" --quiet="false" --reconfiguration_policy="equal"
--recover="reconnect" --recovery_timeout="15mins" --registration_backoff_factor="10ms" --resources="cpus:2;gpus:0;mem:1024;disk:1024;ports:[31000-32000]"
--revocable_cpu_low_priority="true" --runtime_dir="/tmp/Endpoint_SlaveEndpointTest_AuthorizedRequest_2_BfE40N"
--sandbox_directory="/mnt/mesos/sandbox" --strict="true" --switch_user="true" --systemd_enable_support="true"
--systemd_runtime_directory="/run/systemd/system" --version="false" --work_dir="/tmp/Endpoint_SlaveEndpointTest_AuthorizedRequest_2_TppykU"
--zk_session_timeout="10secs"
I0524 23:49:12.853997  6099 credentials.hpp:86] Loading credential for authentication from
'/tmp/Endpoint_SlaveEndpointTest_AuthorizedRequest_2_BfE40N/credential'
I0524 23:49:12.854162  6099 slave.cpp:299] Agent using credential for: test-principal
I0524 23:49:12.854187  6099 credentials.hpp:37] Loading credentials for authentication from
'/tmp/Endpoint_SlaveEndpointTest_AuthorizedRequest_2_BfE40N/http_credentials'
I0524 23:49:12.854400  6099 http.cpp:959] Creating default 'basic' HTTP authenticator for
realm 'mesos-agent-readonly'
I0524 23:49:12.854722  6099 disk_profile_adaptor.cpp:80] Creating default disk profile adaptor
module
I0524 23:49:12.855928  6099 slave.cpp:614] Agent resources: [{"name":"cpus","scalar":{"value":2.0},"type":"SCALAR"},{"name":"mem","scalar":{"value":1024.0},"type":"SCALAR"},{"name":"disk","scalar":{"value":1024.0},"type":"SCALAR"},{"name":"ports","ranges":{"range":[{"begin":31000,"end":32000}]},"type":"RANGES"}]
I0524 23:49:12.856133  6099 slave.cpp:622] Agent attributes: [  ]
I0524 23:49:12.856150  6099 slave.cpp:631] Agent hostname: 0b835e88faa6
I0524 23:49:12.856294  6118 task_status_update_manager.cpp:181] Pausing sending task status
updates
I0524 23:49:12.857662  6116 state.cpp:66] Recovering state from '/tmp/Endpoint_SlaveEndpointTest_AuthorizedRequest_2_TppykU/meta'
I0524 23:49:12.857849  6119 slave.cpp:6925] Finished recovering checkpointed state from '/tmp/Endpoint_SlaveEndpointTest_AuthorizedRequest_2_TppykU/meta',
beginning agent recovery
I0524 23:49:12.858019  6103 task_status_update_manager.cpp:207] Recovering task status update
manager
I0524 23:49:12.858224  6121 containerizer.cpp:716] Recovering Mesos containers
I0524 23:49:12.858494  6121 containerizer.cpp:1023] Recovering isolators
I0524 23:49:12.859038  6109 containerizer.cpp:1062] Recovering provisioner
I0524 23:49:12.859717  6098 provisioner.cpp:495] Provisioner recovery complete
I0524 23:49:12.859990  6106 slave.cpp:7154] Recovering executors
I0524 23:49:12.860116  6106 slave.cpp:7307] Finished recovery
I0524 23:49:12.863991  6115 process.cpp:3583] Handling HTTP event for process 'slave(991)'
with path: '/slave(991)/containers'
I0524 23:49:12.865440  6098 http.cpp:1099] HTTP GET for /slave(991)/containers from 172.17.0.2:47924
I0524 23:49:12.865514  6098 http.cpp:936] Authorizing principal 'test-principal' to GET the
'/containers' endpoint
I0524 23:49:12.868782  6118 slave.cpp:929] Agent terminating
[       OK ] Endpoint/SlaveEndpointTest.AuthorizedRequest/2 (34 ms)
[ RUN      ] Endpoint/SlaveEndpointTest.UnauthorizedRequest/0
I0524 23:49:12.882472  6097 containerizer.cpp:300] Using isolation { environment_secret, posix/cpu,
posix/mem, filesystem/posix, network/cni }
W0524 23:49:12.883085  6097 backend.cpp:76] Failed to create 'aufs' backend: AufsBackend requires
root privileges
W0524 23:49:12.883116  6097 backend.cpp:76] Failed to create 'bind' backend: BindBackend requires
root privileges
I0524 23:49:12.883162  6097 provisioner.cpp:299] Using default backend 'copy'
I0524 23:49:12.887409  6115 slave.cpp:266] Mesos agent started on (992)@172.17.0.2:36514
I0524 23:49:12.887434  6115 slave.cpp:267] Flags at startup: --acls="" --appc_simple_discovery_uri_prefix="http://"
--appc_store_dir="/tmp/Endpoint_SlaveEndpointTest_UnauthorizedRequest_0_fQOd2o/store/appc"
--authenticate_http_readonly="true" --authenticate_http_readwrite="false" --authenticatee="crammd5"
--authentication_backoff_factor="1secs" --authorizer="local" --cgroups_cpu_enable_pids_and_tids_count="false"
--cgroups_enable_cfs="false" --cgroups_hierarchy="/sys/fs/cgroup" --cgroups_limit_swap="false"
--cgroups_root="mesos" --container_disk_watch_interval="15secs" --containerizers="mesos" --credential="/tmp/Endpoint_SlaveEndpointTest_UnauthorizedRequest_0_fQOd2o/credential"
--default_role="*" --disallow_sharing_agent_pid_namespace="false" --disk_watch_interval="1mins"
--docker="docker" --docker_kill_orphans="true" --docker_registry="https://registry-1.docker.io"
--docker_remove_delay="6hrs" --docker_socket="/var/run/docker.sock" --docker_stop_timeout="0ns"
--docker_store_dir="/tmp/Endpoint_SlaveEndpointTest_UnauthorizedRequest_0_fQOd2o/store/docker"
--docker_volume_checkpoint_dir="/var/run/mesos/isolators/docker/volume" --enforce_container_disk_quota="false"
--executor_registration_timeout="1mins" --executor_reregistration_timeout="2secs" --executor_shutdown_grace_period="5secs"
--fetcher_cache_dir="/tmp/Endpoint_SlaveEndpointTest_UnauthorizedRequest_0_fQOd2o/fetch" --fetcher_cache_size="2GB"
--fetcher_stall_timeout="1mins" --frameworks_home="" --gc_delay="1weeks" --gc_disk_headroom="0.1"
--hadoop_home="" --help="false" --hostname_lookup="true" --http_command_executor="false" --http_credentials="/tmp/Endpoint_SlaveEndpointTest_UnauthorizedRequest_0_fQOd2o/http_credentials"
--http_heartbeat_interval="30secs" --initialize_driver_logging="true" --isolation="posix/cpu,posix/mem"
--launcher="posix" --launcher_dir="/tmp/SRC/build/mesos-1.7.0/_build/sub/src" --logbufsecs="0"
--logging_level="INFO" --max_completed_executors_per_framework="150" --memory_profiling="false"
--oversubscribed_resources_interval="15secs" --perf_duration="10secs" --perf_interval="1mins"
--port="5051" --qos_correction_interval_min="0ns" --quiet="false" --reconfiguration_policy="equal"
--recover="reconnect" --recovery_timeout="15mins" --registration_backoff_factor="10ms" --resources="cpus:2;gpus:0;mem:1024;disk:1024;ports:[31000-32000]"
--revocable_cpu_low_priority="true" --runtime_dir="/tmp/Endpoint_SlaveEndpointTest_UnauthorizedRequest_0_fQOd2o"
--sandbox_directory="/mnt/mesos/sandbox" --strict="true" --switch_user="true" --systemd_enable_support="true"
--systemd_runtime_directory="/run/systemd/system" --version="false" --work_dir="/tmp/Endpoint_SlaveEndpointTest_UnauthorizedRequest_0_M7TDgv"
--zk_session_timeout="10secs"
I0524 23:49:12.887799  6115 credentials.hpp:86] Loading credential for authentication from
'/tmp/Endpoint_SlaveEndpointTest_UnauthorizedRequest_0_fQOd2o/credential'
I0524 23:49:12.887959  6115 slave.cpp:299] Agent using credential for: test-principal
I0524 23:49:12.887984  6115 credentials.hpp:37] Loading credentials for authentication from
'/tmp/Endpoint_SlaveEndpointTest_UnauthorizedRequest_0_fQOd2o/http_credentials'
I0524 23:49:12.888204  6115 http.cpp:959] Creating default 'basic' HTTP authenticator for
realm 'mesos-agent-readonly'
I0524 23:49:12.888515  6115 disk_profile_adaptor.cpp:80] Creating default disk profile adaptor
module
I0524 23:49:12.889732  6115 slave.cpp:614] Agent resources: [{"name":"cpus","scalar":{"value":2.0},"type":"SCALAR"},{"name":"mem","scalar":{"value":1024.0},"type":"SCALAR"},{"name":"disk","scalar":{"value":1024.0},"type":"SCALAR"},{"name":"ports","ranges":{"range":[{"begin":31000,"end":32000}]},"type":"RANGES"}]
I0524 23:49:12.889940  6115 slave.cpp:622] Agent attributes: [  ]
I0524 23:49:12.889956  6115 slave.cpp:631] Agent hostname: 0b835e88faa6
I0524 23:49:12.890075  6117 task_status_update_manager.cpp:181] Pausing sending task status
updates
I0524 23:49:12.891526  6104 state.cpp:66] Recovering state from '/tmp/Endpoint_SlaveEndpointTest_UnauthorizedRequest_0_M7TDgv/meta'
I0524 23:49:12.891708  6098 slave.cpp:6925] Finished recovering checkpointed state from '/tmp/Endpoint_SlaveEndpointTest_UnauthorizedRequest_0_M7TDgv/meta',
beginning agent recovery
I0524 23:49:12.891844  6099 task_status_update_manager.cpp:207] Recovering task status update
manager
I0524 23:49:12.892030  6102 containerizer.cpp:716] Recovering Mesos containers
I0524 23:49:12.892283  6102 containerizer.cpp:1023] Recovering isolators
I0524 23:49:12.892912  6108 containerizer.cpp:1062] Recovering provisioner
I0524 23:49:12.893592  6118 provisioner.cpp:495] Provisioner recovery complete
I0524 23:49:12.893884  6117 slave.cpp:7154] Recovering executors
I0524 23:49:12.894028  6117 slave.cpp:7307] Finished recovery
I0524 23:49:12.898193  6121 process.cpp:3583] Handling HTTP event for process 'slave(992)'
with path: '/slave(992)/monitor/statistics'
I0524 23:49:12.899804  6100 http.cpp:1099] HTTP GET for /slave(992)/monitor/statistics from
172.17.0.2:47926
I0524 23:49:12.899914  6100 http.cpp:936] Authorizing principal 'test-principal' to GET the
'/monitor/statistics' endpoint
I0524 23:49:12.901589  6119 slave.cpp:929] Agent terminating
[       OK ] Endpoint/SlaveEndpointTest.UnauthorizedRequest/0 (32 ms)
[ RUN      ] Endpoint/SlaveEndpointTest.UnauthorizedRequest/1
I0524 23:49:12.913511  6097 containerizer.cpp:300] Using isolation { environment_secret, posix/cpu,
posix/mem, filesystem/posix, network/cni }
W0524 23:49:12.914034  6097 backend.cpp:76] Failed to create 'aufs' backend: AufsBackend requires
root privileges
W0524 23:49:12.914067  6097 backend.cpp:76] Failed to create 'bind' backend: BindBackend requires
root privileges
I0524 23:49:12.914113  6097 provisioner.cpp:299] Using default backend 'copy'
I0524 23:49:12.917831  6117 slave.cpp:266] Mesos agent started on (993)@172.17.0.2:36514
I0524 23:49:12.917896  6117 slave.cpp:267] Flags at startup: --acls="" --appc_simple_discovery_uri_prefix="http://"
--appc_store_dir="/tmp/Endpoint_SlaveEndpointTest_UnauthorizedRequest_1_vkDCm0/store/appc"
--authenticate_http_readonly="true" --authenticate_http_readwrite="false" --authenticatee="crammd5"
--authentication_backoff_factor="1secs" --authorizer="local" --cgroups_cpu_enable_pids_and_tids_count="false"
--cgroups_enable_cfs="false" --cgroups_hierarchy="/sys/fs/cgroup" --cgroups_limit_swap="false"
--cgroups_root="mesos" --container_disk_watch_interval="15secs" --containerizers="mesos" --credential="/tmp/Endpoint_SlaveEndpointTest_UnauthorizedRequest_1_vkDCm0/credential"
--default_role="*" --disallow_sharing_agent_pid_namespace="false" --disk_watch_interval="1mins"
--docker="docker" --docker_kill_orphans="true" --docker_registry="https://registry-1.docker.io"
--docker_remove_delay="6hrs" --docker_socket="/var/run/docker.sock" --docker_stop_timeout="0ns"
--docker_store_dir="/tmp/Endpoint_SlaveEndpointTest_UnauthorizedRequest_1_vkDCm0/store/docker"
--docker_volume_checkpoint_dir="/var/run/mesos/isolators/docker/volume" --enforce_container_disk_quota="false"
--executor_registration_timeout="1mins" --executor_reregistration_timeout="2secs" --executor_shutdown_grace_period="5secs"
--fetcher_cache_dir="/tmp/Endpoint_SlaveEndpointTest_UnauthorizedRequest_1_vkDCm0/fetch" --fetcher_cache_size="2GB"
--fetcher_stall_timeout="1mins" --frameworks_home="" --gc_delay="1weeks" --gc_disk_headroom="0.1"
--hadoop_home="" --help="false" --hostname_lookup="true" --http_command_executor="false" --http_credentials="/tmp/Endpoint_SlaveEndpointTest_UnauthorizedRequest_1_vkDCm0/http_credentials"
--http_heartbeat_interval="30secs" --initialize_driver_logging="true" --isolation="posix/cpu,posix/mem"
--launcher="posix" --launcher_dir="/tmp/SRC/build/mesos-1.7.0/_build/sub/src" --logbufsecs="0"
--logging_level="INFO" --max_completed_executors_per_framework="150" --memory_profiling="false"
--oversubscribed_resources_interval="15secs" --perf_duration="10secs" --perf_interval="1mins"
--port="5051" --qos_correction_interval_min="0ns" --quiet="false" --reconfiguration_policy="equal"
--recover="reconnect" --recovery_timeout="15mins" --registration_backoff_factor="10ms" --resources="cpus:2;gpus:0;mem:1024;disk:1024;ports:[31000-32000]"
--revocable_cpu_low_priority="true" --runtime_dir="/tmp/Endpoint_SlaveEndpointTest_UnauthorizedRequest_1_vkDCm0"
--sandbox_directory="/mnt/mesos/sandbox" --strict="true" --switch_user="true" --systemd_enable_support="true"
--systemd_runtime_directory="/run/systemd/system" --version="false" --work_dir="/tmp/Endpoint_SlaveEndpointTest_UnauthorizedRequest_1_0Gtkw6"
--zk_session_timeout="10secs"
I0524 23:49:12.918409  6117 credentials.hpp:86] Loading credential for authentication from
'/tmp/Endpoint_SlaveEndpointTest_UnauthorizedRequest_1_vkDCm0/credential'
I0524 23:49:12.918639  6117 slave.cpp:299] Agent using credential for: test-principal
I0524 23:49:12.918665  6117 credentials.hpp:37] Loading credentials for authentication from
'/tmp/Endpoint_SlaveEndpointTest_UnauthorizedRequest_1_vkDCm0/http_credentials'
I0524 23:49:12.918920  6117 http.cpp:959] Creating default 'basic' HTTP authenticator for
realm 'mesos-agent-readonly'
I0524 23:49:12.919396  6117 disk_profile_adaptor.cpp:80] Creating default disk profile adaptor
module
I0524 23:49:12.920774  6117 slave.cpp:614] Agent resources: [{"name":"cpus","scalar":{"value":2.0},"type":"SCALAR"},{"name":"mem","scalar":{"value":1024.0},"type":"SCALAR"},{"name":"disk","scalar":{"value":1024.0},"type":"SCALAR"},{"name":"ports","ranges":{"range":[{"begin":31000,"end":32000}]},"type":"RANGES"}]
I0524 23:49:12.920997  6117 slave.cpp:622] Agent attributes: [  ]
I0524 23:49:12.921016  6117 slave.cpp:631] Agent hostname: 0b835e88faa6
I0524 23:49:12.921154  6098 task_status_update_manager.cpp:181] Pausing sending task status
updates
I0524 23:49:12.922971  6112 state.cpp:66] Recovering state from '/tmp/Endpoint_SlaveEndpointTest_UnauthorizedRequest_1_0Gtkw6/meta'
I0524 23:49:12.923178  6108 slave.cpp:6925] Finished recovering checkpointed state from '/tmp/Endpoint_SlaveEndpointTest_UnauthorizedRequest_1_0Gtkw6/meta',
beginning agent recovery
I0524 23:49:12.923303  6114 task_status_update_manager.cpp:207] Recovering task status update
manager
I0524 23:49:12.923493  6116 containerizer.cpp:716] Recovering Mesos containers
I0524 23:49:12.923750  6116 containerizer.cpp:1023] Recovering isolators
I0524 23:49:12.924293  6107 containerizer.cpp:1062] Recovering provisioner
I0524 23:49:12.924983  6120 provisioner.cpp:495] Provisioner recovery complete
I0524 23:49:12.925264  6098 slave.cpp:7154] Recovering executors
I0524 23:49:12.925395  6098 slave.cpp:7307] Finished recovery
I0524 23:49:12.929225  6113 process.cpp:3583] Handling HTTP event for process 'slave(993)'
with path: '/slave(993)/monitor/statistics.json'
I0524 23:49:12.930845  6121 http.cpp:1099] HTTP GET for /slave(993)/monitor/statistics.json
from 172.17.0.2:47928
I0524 23:49:12.930924  6121 http.cpp:936] Authorizing principal 'test-principal' to GET the
'/monitor/statistics.json' endpoint
I0524 23:49:12.932596  6109 slave.cpp:929] Agent terminating
[       OK ] Endpoint/SlaveEndpointTest.UnauthorizedRequest/1 (31 ms)
[ RUN      ] Endpoint/SlaveEndpointTest.UnauthorizedRequest/2
I0524 23:49:12.944844  6097 containerizer.cpp:300] Using isolation { environment_secret, posix/cpu,
posix/mem, filesystem/posix, network/cni }
W0524 23:49:12.945344  6097 backend.cpp:76] Failed to create 'aufs' backend: AufsBackend requires
root privileges
W0524 23:49:12.945374  6097 backend.cpp:76] Failed to create 'bind' backend: BindBackend requires
root privileges
I0524 23:49:12.945403  6097 provisioner.cpp:299] Using default backend 'copy'
I0524 23:49:12.949193  6120 slave.cpp:266] Mesos agent started on (994)@172.17.0.2:36514
I0524 23:49:12.949255  6120 slave.cpp:267] Flags at startup: --acls="" --appc_simple_discovery_uri_prefix="http://"
--appc_store_dir="/tmp/Endpoint_SlaveEndpointTest_UnauthorizedRequest_2_zsgHZB/store/appc"
--authenticate_http_readonly="true" --authenticate_http_readwrite="false" --authenticatee="crammd5"
--authentication_backoff_factor="1secs" --authorizer="local" --cgroups_cpu_enable_pids_and_tids_count="false"
--cgroups_enable_cfs="false" --cgroups_hierarchy="/sys/fs/cgroup" --cgroups_limit_swap="false"
--cgroups_root="mesos" --container_disk_watch_interval="15secs" --containerizers="mesos" --credential="/tmp/Endpoint_SlaveEndpointTest_UnauthorizedRequest_2_zsgHZB/credential"
--default_role="*" --disallow_sharing_agent_pid_namespace="false" --disk_watch_interval="1mins"
--docker="docker" --docker_kill_orphans="true" --docker_registry="https://registry-1.docker.io"
--docker_remove_delay="6hrs" --docker_socket="/var/run/docker.sock" --docker_stop_timeout="0ns"
--docker_store_dir="/tmp/Endpoint_SlaveEndpointTest_UnauthorizedRequest_2_zsgHZB/store/docker"
--docker_volume_checkpoint_dir="/var/run/mesos/isolators/docker/volume" --enforce_container_disk_quota="false"
--executor_registration_timeout="1mins" --executor_reregistration_timeout="2secs" --executor_shutdown_grace_period="5secs"
--fetcher_cache_dir="/tmp/Endpoint_SlaveEndpointTest_UnauthorizedRequest_2_zsgHZB/fetch" --fetcher_cache_size="2GB"
--fetcher_stall_timeout="1mins" --frameworks_home="" --gc_delay="1weeks" --gc_disk_headroom="0.1"
--hadoop_home="" --help="false" --hostname_lookup="true" --http_command_executor="false" --http_credentials="/tmp/Endpoint_SlaveEndpointTest_UnauthorizedRequest_2_zsgHZB/http_credentials"
--http_heartbeat_interval="30secs" --initialize_driver_logging="true" --isolation="posix/cpu,posix/mem"
--launcher="posix" --launcher_dir="/tmp/SRC/build/mesos-1.7.0/_build/sub/src" --logbufsecs="0"
--logging_level="INFO" --max_completed_executors_per_framework="150" --memory_profiling="false"
--oversubscribed_resources_interval="15secs" --perf_duration="10secs" --perf_interval="1mins"
--port="5051" --qos_correction_interval_min="0ns" --quiet="false" --reconfiguration_policy="equal"
--recover="reconnect" --recovery_timeout="15mins" --registration_backoff_factor="10ms" --resources="cpus:2;gpus:0;mem:1024;disk:1024;ports:[31000-32000]"
--revocable_cpu_low_priority="true" --runtime_dir="/tmp/Endpoint_SlaveEndpointTest_UnauthorizedRequest_2_zsgHZB"
--sandbox_directory="/mnt/mesos/sandbox" --strict="true" --switch_user="true" --systemd_enable_support="true"
--systemd_runtime_directory="/run/systemd/system" --version="false" --work_dir="/tmp/Endpoint_SlaveEndpointTest_UnauthorizedRequest_2_eAGJ4H"
--zk_session_timeout="10secs"
I0524 23:49:12.949760  6120 credentials.hpp:86] Loading credential for authentication from
'/tmp/Endpoint_SlaveEndpointTest_UnauthorizedRequest_2_zsgHZB/credential'
I0524 23:49:12.949992  6120 slave.cpp:299] Agent using credential for: test-principal
I0524 23:49:12.950019  6120 credentials.hpp:37] Loading credentials for authentication from
'/tmp/Endpoint_SlaveEndpointTest_UnauthorizedRequest_2_zsgHZB/http_credentials'
I0524 23:49:12.950276  6120 http.cpp:959] Creating default 'basic' HTTP authenticator for
realm 'mesos-agent-readonly'
I0524 23:49:12.950731  6120 disk_profile_adaptor.cpp:80] Creating default disk profile adaptor
module
I0524 23:49:12.952131  6120 slave.cpp:614] Agent resources: [{"name":"cpus","scalar":{"value":2.0},"type":"SCALAR"},{"name":"mem","scalar":{"value":1024.0},"type":"SCALAR"},{"name":"disk","scalar":{"value":1024.0},"type":"SCALAR"},{"name":"ports","ranges":{"range":[{"begin":31000,"end":32000}]},"type":"RANGES"}]
I0524 23:49:12.952353  6120 slave.cpp:622] Agent attributes: [  ]
I0524 23:49:12.952373  6120 slave.cpp:631] Agent hostname: 0b835e88faa6
I0524 23:49:12.952512  6104 task_status_update_manager.cpp:181] Pausing sending task status
updates
I0524 23:49:12.954351  6102 state.cpp:66] Recovering state from '/tmp/Endpoint_SlaveEndpointTest_UnauthorizedRequest_2_eAGJ4H/meta'
I0524 23:49:12.954531  6101 slave.cpp:6925] Finished recovering checkpointed state from '/tmp/Endpoint_SlaveEndpointTest_UnauthorizedRequest_2_eAGJ4H/meta',
beginning agent recovery
I0524 23:49:12.954644  6113 task_status_update_manager.cpp:207] Recovering task status update
manager
I0524 23:49:12.954825  6115 containerizer.cpp:716] Recovering Mesos containers
I0524 23:49:12.955062  6115 containerizer.cpp:1023] Recovering isolators
I0524 23:49:12.955646  6110 containerizer.cpp:1062] Recovering provisioner
I0524 23:49:12.956256  6098 provisioner.cpp:495] Provisioner recovery complete
I0524 23:49:12.956501  6104 slave.cpp:7154] Recovering executors
I0524 23:49:12.956647  6104 slave.cpp:7307] Finished recovery
I0524 23:49:12.960500  6105 process.cpp:3583] Handling HTTP event for process 'slave(994)'
with path: '/slave(994)/containers'
I0524 23:49:12.962282  6098 http.cpp:1099] HTTP GET for /slave(994)/containers from 172.17.0.2:47930
I0524 23:49:12.962378  6098 http.cpp:936] Authorizing principal 'test-principal' to GET the
'/containers' endpoint
I0524 23:49:12.963968  6112 slave.cpp:929] Agent terminating
[       OK ] Endpoint/SlaveEndpointTest.UnauthorizedRequest/2 (30 ms)
[ RUN      ] Endpoint/SlaveEndpointTest.NoAuthorizer/0
I0524 23:49:12.975947  6097 containerizer.cpp:300] Using isolation { environment_secret, posix/cpu,
posix/mem, filesystem/posix, network/cni }
W0524 23:49:12.976428  6097 backend.cpp:76] Failed to create 'aufs' backend: AufsBackend requires
root privileges
W0524 23:49:12.976457  6097 backend.cpp:76] Failed to create 'bind' backend: BindBackend requires
root privileges
I0524 23:49:12.976485  6097 provisioner.cpp:299] Using default backend 'copy'
I0524 23:49:12.978124  6097 cluster.cpp:460] Creating default 'local' authorizer
I0524 23:49:12.980289  6104 slave.cpp:266] Mesos agent started on (995)@172.17.0.2:36514
I0524 23:49:12.980347  6104 slave.cpp:267] Flags at startup: --acls="" --appc_simple_discovery_uri_prefix="http://"
--appc_store_dir="/tmp/Endpoint_SlaveEndpointTest_NoAuthorizer_0_CKedVd/store/appc" --authenticate_http_readonly="true"
--authenticate_http_readwrite="false" --authenticatee="crammd5" --authentication_backoff_factor="1secs"
--authorizer="local" --cgroups_cpu_enable_pids_and_tids_count="false" --cgroups_enable_cfs="false"
--cgroups_hierarchy="/sys/fs/cgroup" --cgroups_limit_swap="false" --cgroups_root="mesos" --container_disk_watch_interval="15secs"
--containerizers="mesos" --credential="/tmp/Endpoint_SlaveEndpointTest_NoAuthorizer_0_CKedVd/credential"
--default_role="*" --disallow_sharing_agent_pid_namespace="false" --disk_watch_interval="1mins"
--docker="docker" --docker_kill_orphans="true" --docker_registry="https://registry-1.docker.io"
--docker_remove_delay="6hrs" --docker_socket="/var/run/docker.sock" --docker_stop_timeout="0ns"
--docker_store_dir="/tmp/Endpoint_SlaveEndpointTest_NoAuthorizer_0_CKedVd/store/docker" --docker_volume_checkpoint_dir="/var/run/mesos/isolators/docker/volume"
--enforce_container_disk_quota="false" --executor_registration_timeout="1mins" --executor_reregistration_timeout="2secs"
--executor_shutdown_grace_period="5secs" --fetcher_cache_dir="/tmp/Endpoint_SlaveEndpointTest_NoAuthorizer_0_CKedVd/fetch"
--fetcher_cache_size="2GB" --fetcher_stall_timeout="1mins" --frameworks_home="" --gc_delay="1weeks"
--gc_disk_headroom="0.1" --hadoop_home="" --help="false" --hostname_lookup="true" --http_command_executor="false"
--http_credentials="/tmp/Endpoint_SlaveEndpointTest_NoAuthorizer_0_CKedVd/http_credentials"
--http_heartbeat_interval="30secs" --initialize_driver_logging="true" --isolation="posix/cpu,posix/mem"
--launcher="posix" --launcher_dir="/tmp/SRC/build/mesos-1.7.0/_build/sub/src" --logbufsecs="0"
--logging_level="INFO" --max_completed_executors_per_framework="150" --memory_profiling="false"
--oversubscribed_resources_interval="15secs" --perf_duration="10secs" --perf_interval="1mins"
--port="5051" --qos_correction_interval_min="0ns" --quiet="false" --reconfiguration_policy="equal"
--recover="reconnect" --recovery_timeout="15mins" --registration_backoff_factor="10ms" --resources="cpus:2;gpus:0;mem:1024;disk:1024;ports:[31000-32000]"
--revocable_cpu_low_priority="true" --runtime_dir="/tmp/Endpoint_SlaveEndpointTest_NoAuthorizer_0_CKedVd"
--sandbox_directory="/mnt/mesos/sandbox" --strict="true" --switch_user="true" --systemd_enable_support="true"
--systemd_runtime_directory="/run/systemd/system" --version="false" --work_dir="/tmp/Endpoint_SlaveEndpointTest_NoAuthorizer_0_DzcFVj"
--zk_session_timeout="10secs"
I0524 23:49:12.980918  6104 credentials.hpp:86] Loading credential for authentication from
'/tmp/Endpoint_SlaveEndpointTest_NoAuthorizer_0_CKedVd/credential'
I0524 23:49:12.981158  6104 slave.cpp:299] Agent using credential for: test-principal
I0524 23:49:12.981189  6104 credentials.hpp:37] Loading credentials for authentication from
'/tmp/Endpoint_SlaveEndpointTest_NoAuthorizer_0_CKedVd/http_credentials'
I0524 23:49:12.981464  6104 http.cpp:959] Creating default 'basic' HTTP authenticator for
realm 'mesos-agent-readonly'
I0524 23:49:12.981971  6104 disk_profile_adaptor.cpp:80] Creating default disk profile adaptor
module
I0524 23:49:12.983417  6104 slave.cpp:614] Agent resources: [{"name":"cpus","scalar":{"value":2.0},"type":"SCALAR"},{"name":"mem","scalar":{"value":1024.0},"type":"SCALAR"},{"name":"disk","scalar":{"value":1024.0},"type":"SCALAR"},{"name":"ports","ranges":{"range":[{"begin":31000,"end":32000}]},"type":"RANGES"}]
I0524 23:49:12.983676  6104 slave.cpp:622] Agent attributes: [  ]
I0524 23:49:12.983726  6104 slave.cpp:631] Agent hostname: 0b835e88faa6
I0524 23:49:12.983906  6118 task_status_update_manager.cpp:181] Pausing sending task status
updates
I0524 23:49:12.985970  6100 state.cpp:66] Recovering state from '/tmp/Endpoint_SlaveEndpointTest_NoAuthorizer_0_DzcFVj/meta'
I0524 23:49:12.986220  6109 slave.cpp:6925] Finished recovering checkpointed state from '/tmp/Endpoint_SlaveEndpointTest_NoAuthorizer_0_DzcFVj/meta',
beginning agent recovery
I0524 23:49:12.986377  6106 task_status_update_manager.cpp:207] Recovering task status update
manager
I0524 23:49:12.986618  6120 containerizer.cpp:716] Recovering Mesos containers
I0524 23:49:12.986939  6120 containerizer.cpp:1023] Recovering isolators
I0524 23:49:12.987501  6114 containerizer.cpp:1062] Recovering provisioner
I0524 23:49:12.988122  6107 provisioner.cpp:495] Provisioner recovery complete
I0524 23:49:12.988409  6118 slave.cpp:7154] Recovering executors
I0524 23:49:12.988534  6118 slave.cpp:7307] Finished recovery
I0524 23:49:12.992328  6099 process.cpp:3583] Handling HTTP event for process 'slave(995)'
with path: '/slave(995)/monitor/statistics'
I0524 23:49:12.994134  6107 http.cpp:1099] HTTP GET for /slave(995)/monitor/statistics from
172.17.0.2:47932
I0524 23:49:12.994225  6107 http.cpp:936] Authorizing principal 'test-principal' to GET the
'/monitor/statistics' endpoint
I0524 23:49:12.997175  6101 slave.cpp:929] Agent terminating
[       OK ] Endpoint/SlaveEndpointTest.NoAuthorizer/0 (34 ms)
[ RUN      ] Endpoint/SlaveEndpointTest.NoAuthorizer/1
I0524 23:49:13.011457  6097 containerizer.cpp:300] Using isolation { environment_secret, posix/cpu,
posix/mem, filesystem/posix, network/cni }
W0524 23:49:13.012070  6097 backend.cpp:76] Failed to create 'aufs' backend: AufsBackend requires
root privileges
W0524 23:49:13.012101  6097 backend.cpp:76] Failed to create 'bind' backend: BindBackend requires
root privileges
I0524 23:49:13.012135  6097 provisioner.cpp:299] Using default backend 'copy'
I0524 23:49:13.014279  6097 cluster.cpp:460] Creating default 'local' authorizer
I0524 23:49:13.016767  6112 slave.cpp:266] Mesos agent started on (996)@172.17.0.2:36514
I0524 23:49:13.016796  6112 slave.cpp:267] Flags at startup: --acls="" --appc_simple_discovery_uri_prefix="http://"
--appc_store_dir="/tmp/Endpoint_SlaveEndpointTest_NoAuthorizer_1_jFD3aQ/store/appc" --authenticate_http_readonly="true"
--authenticate_http_readwrite="false" --authenticatee="crammd5" --authentication_backoff_factor="1secs"
--authorizer="local" --cgroups_cpu_enable_pids_and_tids_count="false" --cgroups_enable_cfs="false"
--cgroups_hierarchy="/sys/fs/cgroup" --cgroups_limit_swap="false" --cgroups_root="mesos" --container_disk_watch_interval="15secs"
--containerizers="mesos" --credential="/tmp/Endpoint_SlaveEndpointTest_NoAuthorizer_1_jFD3aQ/credential"
--default_role="*" --disallow_sharing_agent_pid_namespace="false" --disk_watch_interval="1mins"
--docker="docker" --docker_kill_orphans="true" --docker_registry="https://registry-1.docker.io"
--docker_remove_delay="6hrs" --docker_socket="/var/run/docker.sock" --docker_stop_timeout="0ns"
--docker_store_dir="/tmp/Endpoint_SlaveEndpointTest_NoAuthorizer_1_jFD3aQ/store/docker" --docker_volume_checkpoint_dir="/var/run/mesos/isolators/docker/volume"
--enforce_container_disk_quota="false" --executor_registration_timeout="1mins" --executor_reregistration_timeout="2secs"
--executor_shutdown_grace_period="5secs" --fetcher_cache_dir="/tmp/Endpoint_SlaveEndpointTest_NoAuthorizer_1_jFD3aQ/fetch"
--fetcher_cache_size="2GB" --fetcher_stall_timeout="1mins" --frameworks_home="" --gc_delay="1weeks"
--gc_disk_headroom="0.1" --hadoop_home="" --help="false" --hostname_lookup="true" --http_command_executor="false"
--http_credentials="/tmp/Endpoint_SlaveEndpointTest_NoAuthorizer_1_jFD3aQ/http_credentials"
--http_heartbeat_interval="30secs" --initialize_driver_logging="true" --isolation="posix/cpu,posix/mem"
--launcher="posix" --launcher_dir="/tmp/SRC/build/mesos-1.7.0/_build/sub/src" --logbufsecs="0"
--logging_level="INFO" --max_completed_executors_per_framework="150" --memory_profiling="false"
--oversubscribed_resources_interval="15secs" --perf_duration="10secs" --perf_interval="1mins"
--port="5051" --qos_correction_interval_min="0ns" --quiet="false" --reconfiguration_policy="equal"
--recover="reconnect" --recovery_timeout="15mins" --registration_backoff_factor="10ms" --resources="cpus:2;gpus:0;mem:1024;disk:1024;ports:[31000-32000]"
--revocable_cpu_low_priority="true" --runtime_dir="/tmp/Endpoint_SlaveEndpointTest_NoAuthorizer_1_jFD3aQ"
--sandbox_directory="/mnt/mesos/sandbox" --strict="true" --switch_user="true" --systemd_enable_support="true"
--systemd_runtime_directory="/run/systemd/system" --version="false" --work_dir="/tmp/Endpoint_SlaveEndpointTest_NoAuthorizer_1_aBQh6V"
--zk_session_timeout="10secs"
I0524 23:49:13.017211  6112 credentials.hpp:86] Loading credential for authentication from
'/tmp/Endpoint_SlaveEndpointTest_NoAuthorizer_1_jFD3aQ/credential'
I0524 23:49:13.017395  6112 slave.cpp:299] Agent using credential for: test-principal
I0524 23:49:13.017419  6112 credentials.hpp:37] Loading credentials for authentication from
'/tmp/Endpoint_SlaveEndpointTest_NoAuthorizer_1_jFD3aQ/http_credentials'
I0524 23:49:13.017645  6112 http.cpp:959] Creating default 'basic' HTTP authenticator for
realm 'mesos-agent-readonly'
I0524 23:49:13.017962  6112 disk_profile_adaptor.cpp:80] Creating default disk profile adaptor
module
I0524 23:49:13.019202  6112 slave.cpp:614] Agent resources: [{"name":"cpus","scalar":{"value":2.0},"type":"SCALAR"},{"name":"mem","scalar":{"value":1024.0},"type":"SCALAR"},{"name":"disk","scalar":{"value":1024.0},"type":"SCALAR"},{"name":"ports","ranges":{"range":[{"begin":31000,"end":32000}]},"type":"RANGES"}]
I0524 23:49:13.019409  6112 slave.cpp:622] Agent attributes: [  ]
I0524 23:49:13.019428  6112 slave.cpp:631] Agent hostname: 0b835e88faa6
I0524 23:49:13.019549  6113 task_status_update_manager.cpp:181] Pausing sending task status
updates
I0524 23:49:13.021035  6120 state.cpp:66] Recovering state from '/tmp/Endpoint_SlaveEndpointTest_NoAuthorizer_1_aBQh6V/meta'
I0524 23:49:13.021201  6107 slave.cpp:6925] Finished recovering checkpointed state from '/tmp/Endpoint_SlaveEndpointTest_NoAuthorizer_1_aBQh6V/meta',
beginning agent recovery
I0524 23:49:13.021333  6119 task_status_update_manager.cpp:207] Recovering task status update
manager
I0524 23:49:13.021522  6100 containerizer.cpp:716] Recovering Mesos containers
I0524 23:49:13.021775  6100 containerizer.cpp:1023] Recovering isolators
I0524 23:49:13.022354  6106 containerizer.cpp:1062] Recovering provisioner
I0524 23:49:13.023085  6099 provisioner.cpp:495] Provisioner recovery complete
I0524 23:49:13.023339  6113 slave.cpp:7154] Recovering executors
I0524 23:49:13.023466  6113 slave.cpp:7307] Finished recovery
I0524 23:49:13.027220  6121 process.cpp:3583] Handling HTTP event for process 'slave(996)'
with path: '/slave(996)/monitor/statistics.json'
I0524 23:49:13.028893  6101 http.cpp:1099] HTTP GET for /slave(996)/monitor/statistics.json
from 172.17.0.2:47934
I0524 23:49:13.029000  6101 http.cpp:936] Authorizing principal 'test-principal' to GET the
'/monitor/statistics.json' endpoint
I0524 23:49:13.031826  6118 slave.cpp:929] Agent terminating
[       OK ] Endpoint/SlaveEndpointTest.NoAuthorizer/1 (34 ms)
[ RUN      ] Endpoint/SlaveEndpointTest.NoAuthorizer/2
I0524 23:49:13.046267  6097 containerizer.cpp:300] Using isolation { environment_secret, posix/cpu,
posix/mem, filesystem/posix, network/cni }
W0524 23:49:13.046880  6097 backend.cpp:76] Failed to create 'aufs' backend: AufsBackend requires
root privileges
W0524 23:49:13.046911  6097 backend.cpp:76] Failed to create 'bind' backend: BindBackend requires
root privileges
I0524 23:49:13.046944  6097 provisioner.cpp:299] Using default backend 'copy'
I0524 23:49:13.049157  6097 cluster.cpp:460] Creating default 'local' authorizer
I0524 23:49:13.051821  6109 slave.cpp:266] Mesos agent started on (997)@172.17.0.2:36514
I0524 23:49:13.051854  6109 slave.cpp:267] Flags at startup: --acls="" --appc_simple_discovery_uri_prefix="http://"
--appc_store_dir="/tmp/Endpoint_SlaveEndpointTest_NoAuthorizer_2_vSayLs/store/appc" --authenticate_http_readonly="true"
--authenticate_http_readwrite="false" --authenticatee="crammd5" --authentication_backoff_factor="1secs"
--authorizer="local" --cgroups_cpu_enable_pids_and_tids_count="false" --cgroups_enable_cfs="false"
--cgroups_hierarchy="/sys/fs/cgroup" --cgroups_limit_swap="false" --cgroups_root="mesos" --container_disk_watch_interval="15secs"
--containerizers="mesos" --credential="/tmp/Endpoint_SlaveEndpointTest_NoAuthorizer_2_vSayLs/credential"
--default_role="*" --disallow_sharing_agent_pid_namespace="false" --disk_watch_interval="1mins"
--docker="docker" --docker_kill_orphans="true" --docker_registry="https://registry-1.docker.io"
--docker_remove_delay="6hrs" --docker_socket="/var/run/docker.sock" --docker_stop_timeout="0ns"
--docker_store_dir="/tmp/Endpoint_SlaveEndpointTest_NoAuthorizer_2_vSayLs/store/docker" --docker_volume_checkpoint_dir="/var/run/mesos/isolators/docker/volume"
--enforce_container_disk_quota="false" --executor_registration_timeout="1mins" --executor_reregistration_timeout="2secs"
--executor_shutdown_grace_period="5secs" --fetcher_cache_dir="/tmp/Endpoint_SlaveEndpointTest_NoAuthorizer_2_vSayLs/fetch"
--fetcher_cache_size="2GB" --fetcher_stall_timeout="1mins" --frameworks_home="" --gc_delay="1weeks"
--gc_disk_headroom="0.1" --hadoop_home="" --help="false" --hostname_lookup="true" --http_command_executor="false"
--http_credentials="/tmp/Endpoint_SlaveEndpointTest_NoAuthorizer_2_vSayLs/http_credentials"
--http_heartbeat_interval="30secs" --initialize_driver_logging="true" --isolation="posix/cpu,posix/mem"
--launcher="posix" --launcher_dir="/tmp/SRC/build/mesos-1.7.0/_build/sub/src" --logbufsecs="0"
--logging_level="INFO" --max_completed_executors_per_framework="150" --memory_profiling="false"
--oversubscribed_resources_interval="15secs" --perf_duration="10secs" --perf_interval="1mins"
--port="5051" --qos_correction_interval_min="0ns" --quiet="false" --reconfiguration_policy="equal"
--recover="reconnect" --recovery_timeout="15mins" --registration_backoff_factor="10ms" --resources="cpus:2;gpus:0;mem:1024;disk:1024;ports:[31000-32000]"
--revocable_cpu_low_priority="true" --runtime_dir="/tmp/Endpoint_SlaveEndpointTest_NoAuthorizer_2_vSayLs"
--sandbox_directory="/mnt/mesos/sandbox" --strict="true" --switch_user="true" --systemd_enable_support="true"
--systemd_runtime_directory="/run/systemd/system" --version="false" --work_dir="/tmp/Endpoint_SlaveEndpointTest_NoAuthorizer_2_cHfDBy"
--zk_session_timeout="10secs"
I0524 23:49:13.052285  6109 credentials.hpp:86] Loading credential for authentication from
'/tmp/Endpoint_SlaveEndpointTest_NoAuthorizer_2_vSayLs/credential'
I0524 23:49:13.052495  6109 slave.cpp:299] Agent using credential for: test-principal
I0524 23:49:13.052520  6109 credentials.hpp:37] Loading credentials for authentication from
'/tmp/Endpoint_SlaveEndpointTest_NoAuthorizer_2_vSayLs/http_credentials'
I0524 23:49:13.052767  6109 http.cpp:959] Creating default 'basic' HTTP authenticator for
realm 'mesos-agent-readonly'
I0524 23:49:13.053135  6109 disk_profile_adaptor.cpp:80] Creating default disk profile adaptor
module
I0524 23:49:13.054447  6109 slave.cpp:614] Agent resources: [{"name":"cpus","scalar":{"value":2.0},"type":"SCALAR"},{"name":"mem","scalar":{"value":1024.0},"type":"SCALAR"},{"name":"disk","scalar":{"value":1024.0},"type":"SCALAR"},{"name":"ports","ranges":{"range":[{"begin":31000,"end":32000}]},"type":"RANGES"}]
I0524 23:49:13.054666  6109 slave.cpp:622] Agent attributes: [  ]
I0524 23:49:13.054684  6109 slave.cpp:631] Agent hostname: 0b835e88faa6
I0524 23:49:13.054833  6101 task_status_update_manager.cpp:181] Pausing sending task status
updates
I0524 23:49:13.056591  6102 state.cpp:66] Recovering state from '/tmp/Endpoint_SlaveEndpointTest_NoAuthorizer_2_cHfDBy/meta'
I0524 23:49:13.056807  6112 slave.cpp:6925] Finished recovering checkpointed state from '/tmp/Endpoint_SlaveEndpointTest_NoAuthorizer_2_cHfDBy/meta',
beginning agent recovery
I0524 23:49:13.056923  6099 task_status_update_manager.cpp:207] Recovering task status update
manager
I0524 23:49:13.057169  6117 containerizer.cpp:716] Recovering Mesos containers
I0524 23:49:13.057508  6117 containerizer.cpp:1023] Recovering isolators
I0524 23:49:13.058113  6119 containerizer.cpp:1062] Recovering provisioner
I0524 23:49:13.058926  6103 provisioner.cpp:495] Provisioner recovery complete
I0524 23:49:13.059269  6101 slave.cpp:7154] Recovering executors
I0524 23:49:13.059417  6101 slave.cpp:7307] Finished recovery
I0524 23:49:13.063349  6113 process.cpp:3583] Handling HTTP event for process 'slave(997)'
with path: '/slave(997)/containers'
I0524 23:49:13.064944  6098 http.cpp:1099] HTTP GET for /slave(997)/containers from 172.17.0.2:47936
I0524 23:49:13.065064  6098 http.cpp:936] Authorizing principal 'test-principal' to GET the
'/containers' endpoint
I0524 23:49:13.069540  6097 slave.cpp:929] Agent terminating
[       OK ] Endpoint/SlaveEndpointTest.NoAuthorizer/2 (36 ms)
[----------] 9 tests from Endpoint/SlaveEndpointTest (304 ms total)

[----------] 2 tests from ContainerizerType/DefaultContainerDNSFlagTest
[ RUN      ] ContainerizerType/DefaultContainerDNSFlagTest.ValidateFlag/0
[       OK ] ContainerizerType/DefaultContainerDNSFlagTest.ValidateFlag/0 (10 ms)
[ RUN      ] ContainerizerType/DefaultContainerDNSFlagTest.ValidateFlag/1
[       OK ] ContainerizerType/DefaultContainerDNSFlagTest.ValidateFlag/1 (9 ms)
[----------] 2 tests from ContainerizerType/DefaultContainerDNSFlagTest (19 ms total)

[----------] Global test environment tear-down
[==========] 1950 tests from 197 test cases ran. (1012360 ms total)
[  PASSED  ] 1949 tests.
[  FAILED  ] 1 test, listed below:
[  FAILED  ] UriDiskProfileAdaptorTest.FetchFromHTTP

 1 FAILED TEST
  YOU HAVE 22 DISABLED TESTS

I0524 23:49:13.149684  6122 process.cpp:940] Stopped the socket accept loop
Makefile:14693: recipe for target 'check-local' failed
make[4]: *** [check-local] Error 1
make[4]: Leaving directory '/tmp/SRC/build/mesos-1.7.0/_build/sub/src'
Makefile:13809: recipe for target 'check-am' failed
make[3]: *** [check-am] Error 2
make[3]: Leaving directory '/tmp/SRC/build/mesos-1.7.0/_build/sub/src'
Makefile:13813: recipe for target 'check' failed
make[2]: *** [check] Error 2
make[2]: Leaving directory '/tmp/SRC/build/mesos-1.7.0/_build/sub/src'
Makefile:776: recipe for target 'check-recursive' failed
make[1]: *** [check-recursive] Error 1
make[1]: Leaving directory '/tmp/SRC/build/mesos-1.7.0/_build/sub'
Makefile:982: recipe for target 'distcheck' failed
make: *** [distcheck] Error 1
Error response from daemon: conflict: unable to delete 4ecb5a128921 (cannot be forced) - image
is being used by running container 34dde9c523d3
Build step 'Execute shell' marked build as failure


Mime
View raw message