mesos-builds mailing list archives

Site index · List index
Message view « Date » · « Thread »
Top « Date » · « Thread »
From Apache Jenkins Server <jenk...@builds.apache.org>
Subject Build failed in Jenkins: Mesos-Reviewbot #22315
Date Fri, 27 Apr 2018 22:51:12 GMT
See <https://builds.apache.org/job/Mesos-Reviewbot/22315/display/redirect>

------------------------------------------
[...truncated 35.82 MB...]
I0427 22:51:05.209731  6079 slave.cpp:294] Agent using credential for: test-principal
I0427 22:51:05.209784  6079 credentials.hpp:37] Loading credentials for authentication from
'/tmp/Endpoint_SlaveEndpointTest_AuthorizedRequest_1_tHQsLv/http_credentials'
I0427 22:51:05.210141  6079 http.cpp:959] Creating default 'basic' HTTP authenticator for
realm 'mesos-agent-readonly'
I0427 22:51:05.210626  6079 disk_profile_adaptor.cpp:80] Creating default disk profile adaptor
module
I0427 22:51:05.212944  6079 slave.cpp:609] Agent resources: [{"name":"cpus","scalar":{"value":2.0},"type":"SCALAR"},{"name":"mem","scalar":{"value":1024.0},"type":"SCALAR"},{"name":"disk","scalar":{"value":1024.0},"type":"SCALAR"},{"name":"ports","ranges":{"range":[{"begin":31000,"end":32000}]},"type":"RANGES"}]
I0427 22:51:05.213333  6079 slave.cpp:617] Agent attributes: [  ]
I0427 22:51:05.213358  6079 slave.cpp:626] Agent hostname: b9f15d5df5da
I0427 22:51:05.213659  6082 task_status_update_manager.cpp:181] Pausing sending task status
updates
I0427 22:51:05.215951  6096 state.cpp:66] Recovering state from '/tmp/Endpoint_SlaveEndpointTest_AuthorizedRequest_1_bQ7e4S/meta'
I0427 22:51:05.216411  6094 task_status_update_manager.cpp:207] Recovering task status update
manager
I0427 22:51:05.216856  6089 containerizer.cpp:712] Recovering containerizer
I0427 22:51:05.219094  6088 provisioner.cpp:495] Provisioner recovery complete
I0427 22:51:05.219635  6093 slave.cpp:7262] Finished recovery
I0427 22:51:05.223812  6083 process.cpp:3580] Handling HTTP event for process 'slave(968)'
with path: '/slave(968)/monitor/statistics.json'
I0427 22:51:05.226060  6087 http.cpp:1099] HTTP GET for /slave(968)/monitor/statistics.json
from 172.17.0.2:35802
I0427 22:51:05.226213  6087 http.cpp:936] Authorizing principal 'test-principal' to GET the
'/monitor/statistics.json' endpoint
I0427 22:51:05.230321  6089 slave.cpp:919] Agent terminating
[       OK ] Endpoint/SlaveEndpointTest.AuthorizedRequest/1 (44 ms)
[ RUN      ] Endpoint/SlaveEndpointTest.AuthorizedRequest/2
I0427 22:51:05.251832  6072 containerizer.cpp:296] Using isolation { environment_secret, posix/cpu,
posix/mem, filesystem/posix, network/cni }
W0427 22:51:05.252729  6072 backend.cpp:76] Failed to create 'aufs' backend: AufsBackend requires
root privileges
W0427 22:51:05.252774  6072 backend.cpp:76] Failed to create 'bind' backend: BindBackend requires
root privileges
I0427 22:51:05.252816  6072 provisioner.cpp:299] Using default backend 'copy'
I0427 22:51:05.259289  6085 slave.cpp:261] Mesos agent started on (969)@172.17.0.2:37754
I0427 22:51:05.259335  6085 slave.cpp:262] Flags at startup: --acls="" --appc_simple_discovery_uri_prefix="http://"
--appc_store_dir="/tmp/Endpoint_SlaveEndpointTest_AuthorizedRequest_2_LxVpV0/store/appc" --authenticate_http_readonly="true"
--authenticate_http_readwrite="false" --authenticatee="crammd5" --authentication_backoff_factor="1secs"
--authorizer="local" --cgroups_cpu_enable_pids_and_tids_count="false" --cgroups_enable_cfs="false"
--cgroups_hierarchy="/sys/fs/cgroup" --cgroups_limit_swap="false" --cgroups_root="mesos" --container_disk_watch_interval="15secs"
--containerizers="mesos" --credential="/tmp/Endpoint_SlaveEndpointTest_AuthorizedRequest_2_LxVpV0/credential"
--default_role="*" --disallow_sharing_agent_pid_namespace="false" --disk_watch_interval="1mins"
--docker="docker" --docker_kill_orphans="true" --docker_registry="https://registry-1.docker.io"
--docker_remove_delay="6hrs" --docker_socket="/var/run/docker.sock" --docker_stop_timeout="0ns"
--docker_store_dir="/tmp/Endpoint_SlaveEndpointTest_AuthorizedRequest_2_LxVpV0/store/docker"
--docker_volume_checkpoint_dir="/var/run/mesos/isolators/docker/volume" --enforce_container_disk_quota="false"
--executor_registration_timeout="1mins" --executor_reregistration_timeout="2secs" --executor_shutdown_grace_period="5secs"
--fetcher_cache_dir="/tmp/Endpoint_SlaveEndpointTest_AuthorizedRequest_2_LxVpV0/fetch" --fetcher_cache_size="2GB"
--fetcher_stall_timeout="1mins" --frameworks_home="" --gc_delay="1weeks" --gc_disk_headroom="0.1"
--hadoop_home="" --help="false" --hostname_lookup="true" --http_command_executor="false" --http_credentials="/tmp/Endpoint_SlaveEndpointTest_AuthorizedRequest_2_LxVpV0/http_credentials"
--http_heartbeat_interval="30secs" --initialize_driver_logging="true" --isolation="posix/cpu,posix/mem"
--launcher="posix" --launcher_dir="/tmp/SRC/build/mesos-1.6.0/_build/sub/src" --logbufsecs="0"
--logging_level="INFO" --max_completed_executors_per_framework="150" --memory_profiling="false"
--oversubscribed_resources_interval="15secs" --perf_duration="10secs" --perf_interval="1mins"
--port="5051" --qos_correction_interval_min="0ns" --quiet="false" --reconfiguration_policy="equal"
--recover="reconnect" --recovery_timeout="15mins" --registration_backoff_factor="10ms" --resources="cpus:2;gpus:0;mem:1024;disk:1024;ports:[31000-32000]"
--revocable_cpu_low_priority="true" --runtime_dir="/tmp/Endpoint_SlaveEndpointTest_AuthorizedRequest_2_LxVpV0"
--sandbox_directory="/mnt/mesos/sandbox" --strict="true" --switch_user="true" --systemd_enable_support="true"
--systemd_runtime_directory="/run/systemd/system" --version="false" --work_dir="/tmp/Endpoint_SlaveEndpointTest_AuthorizedRequest_2_JFyh7n"
--zk_session_timeout="10secs"
I0427 22:51:05.260042  6085 credentials.hpp:86] Loading credential for authentication from
'/tmp/Endpoint_SlaveEndpointTest_AuthorizedRequest_2_LxVpV0/credential'
I0427 22:51:05.260349  6085 slave.cpp:294] Agent using credential for: test-principal
I0427 22:51:05.260375  6085 credentials.hpp:37] Loading credentials for authentication from
'/tmp/Endpoint_SlaveEndpointTest_AuthorizedRequest_2_LxVpV0/http_credentials'
I0427 22:51:05.262150  6085 http.cpp:959] Creating default 'basic' HTTP authenticator for
realm 'mesos-agent-readonly'
I0427 22:51:05.262692  6085 disk_profile_adaptor.cpp:80] Creating default disk profile adaptor
module
I0427 22:51:05.265188  6085 slave.cpp:609] Agent resources: [{"name":"cpus","scalar":{"value":2.0},"type":"SCALAR"},{"name":"mem","scalar":{"value":1024.0},"type":"SCALAR"},{"name":"disk","scalar":{"value":1024.0},"type":"SCALAR"},{"name":"ports","ranges":{"range":[{"begin":31000,"end":32000}]},"type":"RANGES"}]
I0427 22:51:05.265610  6085 slave.cpp:617] Agent attributes: [  ]
I0427 22:51:05.265637  6085 slave.cpp:626] Agent hostname: b9f15d5df5da
I0427 22:51:05.265877  6082 task_status_update_manager.cpp:181] Pausing sending task status
updates
I0427 22:51:05.268800  6081 state.cpp:66] Recovering state from '/tmp/Endpoint_SlaveEndpointTest_AuthorizedRequest_2_JFyh7n/meta'
I0427 22:51:05.269395  6081 task_status_update_manager.cpp:207] Recovering task status update
manager
I0427 22:51:05.269856  6093 containerizer.cpp:712] Recovering containerizer
I0427 22:51:05.272133  6084 provisioner.cpp:495] Provisioner recovery complete
I0427 22:51:05.272902  6082 slave.cpp:7262] Finished recovery
I0427 22:51:05.277334  6095 process.cpp:3580] Handling HTTP event for process 'slave(969)'
with path: '/slave(969)/containers'
I0427 22:51:05.279866  6084 http.cpp:1099] HTTP GET for /slave(969)/containers from 172.17.0.2:35804
I0427 22:51:05.280014  6084 http.cpp:936] Authorizing principal 'test-principal' to GET the
'/containers' endpoint
I0427 22:51:05.285861  6072 slave.cpp:919] Agent terminating
[       OK ] Endpoint/SlaveEndpointTest.AuthorizedRequest/2 (54 ms)
[ RUN      ] Endpoint/SlaveEndpointTest.UnauthorizedRequest/0
I0427 22:51:05.303930  6072 containerizer.cpp:296] Using isolation { environment_secret, posix/cpu,
posix/mem, filesystem/posix, network/cni }
W0427 22:51:05.304749  6072 backend.cpp:76] Failed to create 'aufs' backend: AufsBackend requires
root privileges
W0427 22:51:05.304778  6072 backend.cpp:76] Failed to create 'bind' backend: BindBackend requires
root privileges
I0427 22:51:05.304826  6072 provisioner.cpp:299] Using default backend 'copy'
I0427 22:51:05.309993  6090 slave.cpp:261] Mesos agent started on (970)@172.17.0.2:37754
I0427 22:51:05.310025  6090 slave.cpp:262] Flags at startup: --acls="" --appc_simple_discovery_uri_prefix="http://"
--appc_store_dir="/tmp/Endpoint_SlaveEndpointTest_UnauthorizedRequest_0_fBScBw/store/appc"
--authenticate_http_readonly="true" --authenticate_http_readwrite="false" --authenticatee="crammd5"
--authentication_backoff_factor="1secs" --authorizer="local" --cgroups_cpu_enable_pids_and_tids_count="false"
--cgroups_enable_cfs="false" --cgroups_hierarchy="/sys/fs/cgroup" --cgroups_limit_swap="false"
--cgroups_root="mesos" --container_disk_watch_interval="15secs" --containerizers="mesos" --credential="/tmp/Endpoint_SlaveEndpointTest_UnauthorizedRequest_0_fBScBw/credential"
--default_role="*" --disallow_sharing_agent_pid_namespace="false" --disk_watch_interval="1mins"
--docker="docker" --docker_kill_orphans="true" --docker_registry="https://registry-1.docker.io"
--docker_remove_delay="6hrs" --docker_socket="/var/run/docker.sock" --docker_stop_timeout="0ns"
--docker_store_dir="/tmp/Endpoint_SlaveEndpointTest_UnauthorizedRequest_0_fBScBw/store/docker"
--docker_volume_checkpoint_dir="/var/run/mesos/isolators/docker/volume" --enforce_container_disk_quota="false"
--executor_registration_timeout="1mins" --executor_reregistration_timeout="2secs" --executor_shutdown_grace_period="5secs"
--fetcher_cache_dir="/tmp/Endpoint_SlaveEndpointTest_UnauthorizedRequest_0_fBScBw/fetch" --fetcher_cache_size="2GB"
--fetcher_stall_timeout="1mins" --frameworks_home="" --gc_delay="1weeks" --gc_disk_headroom="0.1"
--hadoop_home="" --help="false" --hostname_lookup="true" --http_command_executor="false" --http_credentials="/tmp/Endpoint_SlaveEndpointTest_UnauthorizedRequest_0_fBScBw/http_credentials"
--http_heartbeat_interval="30secs" --initialize_driver_logging="true" --isolation="posix/cpu,posix/mem"
--launcher="posix" --launcher_dir="/tmp/SRC/build/mesos-1.6.0/_build/sub/src" --logbufsecs="0"
--logging_level="INFO" --max_completed_executors_per_framework="150" --memory_profiling="false"
--oversubscribed_resources_interval="15secs" --perf_duration="10secs" --perf_interval="1mins"
--port="5051" --qos_correction_interval_min="0ns" --quiet="false" --reconfiguration_policy="equal"
--recover="reconnect" --recovery_timeout="15mins" --registration_backoff_factor="10ms" --resources="cpus:2;gpus:0;mem:1024;disk:1024;ports:[31000-32000]"
--revocable_cpu_low_priority="true" --runtime_dir="/tmp/Endpoint_SlaveEndpointTest_UnauthorizedRequest_0_fBScBw"
--sandbox_directory="/mnt/mesos/sandbox" --strict="true" --switch_user="true" --systemd_enable_support="true"
--systemd_runtime_directory="/run/systemd/system" --version="false" --work_dir="/tmp/Endpoint_SlaveEndpointTest_UnauthorizedRequest_0_jDR8ET"
--zk_session_timeout="10secs"
I0427 22:51:05.310444  6090 credentials.hpp:86] Loading credential for authentication from
'/tmp/Endpoint_SlaveEndpointTest_UnauthorizedRequest_0_fBScBw/credential'
I0427 22:51:05.310603  6090 slave.cpp:294] Agent using credential for: test-principal
I0427 22:51:05.310629  6090 credentials.hpp:37] Loading credentials for authentication from
'/tmp/Endpoint_SlaveEndpointTest_UnauthorizedRequest_0_fBScBw/http_credentials'
I0427 22:51:05.310905  6090 http.cpp:959] Creating default 'basic' HTTP authenticator for
realm 'mesos-agent-readonly'
I0427 22:51:05.311290  6090 disk_profile_adaptor.cpp:80] Creating default disk profile adaptor
module
I0427 22:51:05.312849  6090 slave.cpp:609] Agent resources: [{"name":"cpus","scalar":{"value":2.0},"type":"SCALAR"},{"name":"mem","scalar":{"value":1024.0},"type":"SCALAR"},{"name":"disk","scalar":{"value":1024.0},"type":"SCALAR"},{"name":"ports","ranges":{"range":[{"begin":31000,"end":32000}]},"type":"RANGES"}]
I0427 22:51:05.313089  6090 slave.cpp:617] Agent attributes: [  ]
I0427 22:51:05.313107  6090 slave.cpp:626] Agent hostname: b9f15d5df5da
I0427 22:51:05.313390  6079 task_status_update_manager.cpp:181] Pausing sending task status
updates
I0427 22:51:05.314870  6092 state.cpp:66] Recovering state from '/tmp/Endpoint_SlaveEndpointTest_UnauthorizedRequest_0_jDR8ET/meta'
I0427 22:51:05.315446  6078 task_status_update_manager.cpp:207] Recovering task status update
manager
I0427 22:51:05.315801  6086 containerizer.cpp:712] Recovering containerizer
I0427 22:51:05.317992  6088 provisioner.cpp:495] Provisioner recovery complete
I0427 22:51:05.318687  6093 slave.cpp:7262] Finished recovery
I0427 22:51:05.322803  6083 process.cpp:3580] Handling HTTP event for process 'slave(970)'
with path: '/slave(970)/monitor/statistics'
I0427 22:51:05.324548  6077 http.cpp:1099] HTTP GET for /slave(970)/monitor/statistics from
172.17.0.2:35806
I0427 22:51:05.324662  6077 http.cpp:936] Authorizing principal 'test-principal' to GET the
'/monitor/statistics' endpoint
I0427 22:51:05.327250  6093 slave.cpp:919] Agent terminating
[       OK ] Endpoint/SlaveEndpointTest.UnauthorizedRequest/0 (44 ms)
[ RUN      ] Endpoint/SlaveEndpointTest.UnauthorizedRequest/1
I0427 22:51:05.351840  6072 containerizer.cpp:296] Using isolation { environment_secret, posix/cpu,
posix/mem, filesystem/posix, network/cni }
W0427 22:51:05.352722  6072 backend.cpp:76] Failed to create 'aufs' backend: AufsBackend requires
root privileges
W0427 22:51:05.352772  6072 backend.cpp:76] Failed to create 'bind' backend: BindBackend requires
root privileges
I0427 22:51:05.352825  6072 provisioner.cpp:299] Using default backend 'copy'
I0427 22:51:05.359944  6092 slave.cpp:261] Mesos agent started on (971)@172.17.0.2:37754
I0427 22:51:05.359974  6092 slave.cpp:262] Flags at startup: --acls="" --appc_simple_discovery_uri_prefix="http://"
--appc_store_dir="/tmp/Endpoint_SlaveEndpointTest_UnauthorizedRequest_1_sTplI2/store/appc"
--authenticate_http_readonly="true" --authenticate_http_readwrite="false" --authenticatee="crammd5"
--authentication_backoff_factor="1secs" --authorizer="local" --cgroups_cpu_enable_pids_and_tids_count="false"
--cgroups_enable_cfs="false" --cgroups_hierarchy="/sys/fs/cgroup" --cgroups_limit_swap="false"
--cgroups_root="mesos" --container_disk_watch_interval="15secs" --containerizers="mesos" --credential="/tmp/Endpoint_SlaveEndpointTest_UnauthorizedRequest_1_sTplI2/credential"
--default_role="*" --disallow_sharing_agent_pid_namespace="false" --disk_watch_interval="1mins"
--docker="docker" --docker_kill_orphans="true" --docker_registry="https://registry-1.docker.io"
--docker_remove_delay="6hrs" --docker_socket="/var/run/docker.sock" --docker_stop_timeout="0ns"
--docker_store_dir="/tmp/Endpoint_SlaveEndpointTest_UnauthorizedRequest_1_sTplI2/store/docker"
--docker_volume_checkpoint_dir="/var/run/mesos/isolators/docker/volume" --enforce_container_disk_quota="false"
--executor_registration_timeout="1mins" --executor_reregistration_timeout="2secs" --executor_shutdown_grace_period="5secs"
--fetcher_cache_dir="/tmp/Endpoint_SlaveEndpointTest_UnauthorizedRequest_1_sTplI2/fetch" --fetcher_cache_size="2GB"
--fetcher_stall_timeout="1mins" --frameworks_home="" --gc_delay="1weeks" --gc_disk_headroom="0.1"
--hadoop_home="" --help="false" --hostname_lookup="true" --http_command_executor="false" --http_credentials="/tmp/Endpoint_SlaveEndpointTest_UnauthorizedRequest_1_sTplI2/http_credentials"
--http_heartbeat_interval="30secs" --initialize_driver_logging="true" --isolation="posix/cpu,posix/mem"
--launcher="posix" --launcher_dir="/tmp/SRC/build/mesos-1.6.0/_build/sub/src" --logbufsecs="0"
--logging_level="INFO" --max_completed_executors_per_framework="150" --memory_profiling="false"
--oversubscribed_resources_interval="15secs" --perf_duration="10secs" --perf_interval="1mins"
--port="5051" --qos_correction_interval_min="0ns" --quiet="false" --reconfiguration_policy="equal"
--recover="reconnect" --recovery_timeout="15mins" --registration_backoff_factor="10ms" --resources="cpus:2;gpus:0;mem:1024;disk:1024;ports:[31000-32000]"
--revocable_cpu_low_priority="true" --runtime_dir="/tmp/Endpoint_SlaveEndpointTest_UnauthorizedRequest_1_sTplI2"
--sandbox_directory="/mnt/mesos/sandbox" --strict="true" --switch_user="true" --systemd_enable_support="true"
--systemd_runtime_directory="/run/systemd/system" --version="false" --work_dir="/tmp/Endpoint_SlaveEndpointTest_UnauthorizedRequest_1_atZmFp"
--zk_session_timeout="10secs"
I0427 22:51:05.360394  6092 credentials.hpp:86] Loading credential for authentication from
'/tmp/Endpoint_SlaveEndpointTest_UnauthorizedRequest_1_sTplI2/credential'
I0427 22:51:05.360553  6092 slave.cpp:294] Agent using credential for: test-principal
I0427 22:51:05.360579  6092 credentials.hpp:37] Loading credentials for authentication from
'/tmp/Endpoint_SlaveEndpointTest_UnauthorizedRequest_1_sTplI2/http_credentials'
I0427 22:51:05.360860  6092 http.cpp:959] Creating default 'basic' HTTP authenticator for
realm 'mesos-agent-readonly'
I0427 22:51:05.361198  6092 disk_profile_adaptor.cpp:80] Creating default disk profile adaptor
module
I0427 22:51:05.362540  6092 slave.cpp:609] Agent resources: [{"name":"cpus","scalar":{"value":2.0},"type":"SCALAR"},{"name":"mem","scalar":{"value":1024.0},"type":"SCALAR"},{"name":"disk","scalar":{"value":1024.0},"type":"SCALAR"},{"name":"ports","ranges":{"range":[{"begin":31000,"end":32000}]},"type":"RANGES"}]
I0427 22:51:05.362771  6092 slave.cpp:617] Agent attributes: [  ]
I0427 22:51:05.362788  6092 slave.cpp:626] Agent hostname: b9f15d5df5da
I0427 22:51:05.362933  6075 task_status_update_manager.cpp:181] Pausing sending task status
updates
I0427 22:51:05.364467  6096 state.cpp:66] Recovering state from '/tmp/Endpoint_SlaveEndpointTest_UnauthorizedRequest_1_atZmFp/meta'
I0427 22:51:05.365154  6083 task_status_update_manager.cpp:207] Recovering task status update
manager
I0427 22:51:05.365573  6085 containerizer.cpp:712] Recovering containerizer
I0427 22:51:05.367993  6082 provisioner.cpp:495] Provisioner recovery complete
I0427 22:51:05.368777  6095 slave.cpp:7262] Finished recovery
I0427 22:51:05.372368  6088 process.cpp:3580] Handling HTTP event for process 'slave(971)'
with path: '/slave(971)/monitor/statistics.json'
I0427 22:51:05.374441  6082 http.cpp:1099] HTTP GET for /slave(971)/monitor/statistics.json
from 172.17.0.2:35808
I0427 22:51:05.374586  6082 http.cpp:936] Authorizing principal 'test-principal' to GET the
'/monitor/statistics.json' endpoint
I0427 22:51:05.377627  6072 slave.cpp:919] Agent terminating
[       OK ] Endpoint/SlaveEndpointTest.UnauthorizedRequest/1 (46 ms)
[ RUN      ] Endpoint/SlaveEndpointTest.UnauthorizedRequest/2
I0427 22:51:05.395195  6072 containerizer.cpp:296] Using isolation { environment_secret, posix/cpu,
posix/mem, filesystem/posix, network/cni }
W0427 22:51:05.396344  6072 backend.cpp:76] Failed to create 'aufs' backend: AufsBackend requires
root privileges
W0427 22:51:05.396391  6072 backend.cpp:76] Failed to create 'bind' backend: BindBackend requires
root privileges
I0427 22:51:05.396459  6072 provisioner.cpp:299] Using default backend 'copy'
I0427 22:51:05.405620  6075 slave.cpp:261] Mesos agent started on (972)@172.17.0.2:37754
I0427 22:51:05.405669  6075 slave.cpp:262] Flags at startup: --acls="" --appc_simple_discovery_uri_prefix="http://"
--appc_store_dir="/tmp/Endpoint_SlaveEndpointTest_UnauthorizedRequest_2_yrzlhz/store/appc"
--authenticate_http_readonly="true" --authenticate_http_readwrite="false" --authenticatee="crammd5"
--authentication_backoff_factor="1secs" --authorizer="local" --cgroups_cpu_enable_pids_and_tids_count="false"
--cgroups_enable_cfs="false" --cgroups_hierarchy="/sys/fs/cgroup" --cgroups_limit_swap="false"
--cgroups_root="mesos" --container_disk_watch_interval="15secs" --containerizers="mesos" --credential="/tmp/Endpoint_SlaveEndpointTest_UnauthorizedRequest_2_yrzlhz/credential"
--default_role="*" --disallow_sharing_agent_pid_namespace="false" --disk_watch_interval="1mins"
--docker="docker" --docker_kill_orphans="true" --docker_registry="https://registry-1.docker.io"
--docker_remove_delay="6hrs" --docker_socket="/var/run/docker.sock" --docker_stop_timeout="0ns"
--docker_store_dir="/tmp/Endpoint_SlaveEndpointTest_UnauthorizedRequest_2_yrzlhz/store/docker"
--docker_volume_checkpoint_dir="/var/run/mesos/isolators/docker/volume" --enforce_container_disk_quota="false"
--executor_registration_timeout="1mins" --executor_reregistration_timeout="2secs" --executor_shutdown_grace_period="5secs"
--fetcher_cache_dir="/tmp/Endpoint_SlaveEndpointTest_UnauthorizedRequest_2_yrzlhz/fetch" --fetcher_cache_size="2GB"
--fetcher_stall_timeout="1mins" --frameworks_home="" --gc_delay="1weeks" --gc_disk_headroom="0.1"
--hadoop_home="" --help="false" --hostname_lookup="true" --http_command_executor="false" --http_credentials="/tmp/Endpoint_SlaveEndpointTest_UnauthorizedRequest_2_yrzlhz/http_credentials"
--http_heartbeat_interval="30secs" --initialize_driver_logging="true" --isolation="posix/cpu,posix/mem"
--launcher="posix" --launcher_dir="/tmp/SRC/build/mesos-1.6.0/_build/sub/src" --logbufsecs="0"
--logging_level="INFO" --max_completed_executors_per_framework="150" --memory_profiling="false"
--oversubscribed_resources_interval="15secs" --perf_duration="10secs" --perf_interval="1mins"
--port="5051" --qos_correction_interval_min="0ns" --quiet="false" --reconfiguration_policy="equal"
--recover="reconnect" --recovery_timeout="15mins" --registration_backoff_factor="10ms" --resources="cpus:2;gpus:0;mem:1024;disk:1024;ports:[31000-32000]"
--revocable_cpu_low_priority="true" --runtime_dir="/tmp/Endpoint_SlaveEndpointTest_UnauthorizedRequest_2_yrzlhz"
--sandbox_directory="/mnt/mesos/sandbox" --strict="true" --switch_user="true" --systemd_enable_support="true"
--systemd_runtime_directory="/run/systemd/system" --version="false" --work_dir="/tmp/Endpoint_SlaveEndpointTest_UnauthorizedRequest_2_81KF7V"
--zk_session_timeout="10secs"
I0427 22:51:05.406445  6075 credentials.hpp:86] Loading credential for authentication from
'/tmp/Endpoint_SlaveEndpointTest_UnauthorizedRequest_2_yrzlhz/credential'
I0427 22:51:05.406740  6075 slave.cpp:294] Agent using credential for: test-principal
I0427 22:51:05.406780  6075 credentials.hpp:37] Loading credentials for authentication from
'/tmp/Endpoint_SlaveEndpointTest_UnauthorizedRequest_2_yrzlhz/http_credentials'
I0427 22:51:05.407209  6075 http.cpp:959] Creating default 'basic' HTTP authenticator for
realm 'mesos-agent-readonly'
I0427 22:51:05.407768  6075 disk_profile_adaptor.cpp:80] Creating default disk profile adaptor
module
I0427 22:51:05.410044  6075 slave.cpp:609] Agent resources: [{"name":"cpus","scalar":{"value":2.0},"type":"SCALAR"},{"name":"mem","scalar":{"value":1024.0},"type":"SCALAR"},{"name":"disk","scalar":{"value":1024.0},"type":"SCALAR"},{"name":"ports","ranges":{"range":[{"begin":31000,"end":32000}]},"type":"RANGES"}]
I0427 22:51:05.410387  6075 slave.cpp:617] Agent attributes: [  ]
I0427 22:51:05.410411  6075 slave.cpp:626] Agent hostname: b9f15d5df5da
I0427 22:51:05.410600  6079 task_status_update_manager.cpp:181] Pausing sending task status
updates
I0427 22:51:05.413163  6094 state.cpp:66] Recovering state from '/tmp/Endpoint_SlaveEndpointTest_UnauthorizedRequest_2_81KF7V/meta'
I0427 22:51:05.413619  6085 task_status_update_manager.cpp:207] Recovering task status update
manager
I0427 22:51:05.413853  6090 containerizer.cpp:712] Recovering containerizer
I0427 22:51:05.415999  6089 provisioner.cpp:495] Provisioner recovery complete
I0427 22:51:05.416673  6079 slave.cpp:7262] Finished recovery
I0427 22:51:05.421119  6082 process.cpp:3580] Handling HTTP event for process 'slave(972)'
with path: '/slave(972)/containers'
I0427 22:51:05.422838  6078 http.cpp:1099] HTTP GET for /slave(972)/containers from 172.17.0.2:35810
I0427 22:51:05.422965  6078 http.cpp:936] Authorizing principal 'test-principal' to GET the
'/containers' endpoint
I0427 22:51:05.425642  6072 slave.cpp:919] Agent terminating
[       OK ] Endpoint/SlaveEndpointTest.UnauthorizedRequest/2 (46 ms)
[ RUN      ] Endpoint/SlaveEndpointTest.NoAuthorizer/0
I0427 22:51:05.446485  6072 containerizer.cpp:296] Using isolation { environment_secret, posix/cpu,
posix/mem, filesystem/posix, network/cni }
W0427 22:51:05.447413  6072 backend.cpp:76] Failed to create 'aufs' backend: AufsBackend requires
root privileges
W0427 22:51:05.447471  6072 backend.cpp:76] Failed to create 'bind' backend: BindBackend requires
root privileges
I0427 22:51:05.447518  6072 provisioner.cpp:299] Using default backend 'copy'
I0427 22:51:05.450757  6072 cluster.cpp:460] Creating default 'local' authorizer
I0427 22:51:05.455152  6084 slave.cpp:261] Mesos agent started on (973)@172.17.0.2:37754
I0427 22:51:05.455193  6084 slave.cpp:262] Flags at startup: --acls="" --appc_simple_discovery_uri_prefix="http://"
--appc_store_dir="/tmp/Endpoint_SlaveEndpointTest_NoAuthorizer_0_p5q1i6/store/appc" --authenticate_http_readonly="true"
--authenticate_http_readwrite="false" --authenticatee="crammd5" --authentication_backoff_factor="1secs"
--authorizer="local" --cgroups_cpu_enable_pids_and_tids_count="false" --cgroups_enable_cfs="false"
--cgroups_hierarchy="/sys/fs/cgroup" --cgroups_limit_swap="false" --cgroups_root="mesos" --container_disk_watch_interval="15secs"
--containerizers="mesos" --credential="/tmp/Endpoint_SlaveEndpointTest_NoAuthorizer_0_p5q1i6/credential"
--default_role="*" --disallow_sharing_agent_pid_namespace="false" --disk_watch_interval="1mins"
--docker="docker" --docker_kill_orphans="true" --docker_registry="https://registry-1.docker.io"
--docker_remove_delay="6hrs" --docker_socket="/var/run/docker.sock" --docker_stop_timeout="0ns"
--docker_store_dir="/tmp/Endpoint_SlaveEndpointTest_NoAuthorizer_0_p5q1i6/store/docker" --docker_volume_checkpoint_dir="/var/run/mesos/isolators/docker/volume"
--enforce_container_disk_quota="false" --executor_registration_timeout="1mins" --executor_reregistration_timeout="2secs"
--executor_shutdown_grace_period="5secs" --fetcher_cache_dir="/tmp/Endpoint_SlaveEndpointTest_NoAuthorizer_0_p5q1i6/fetch"
--fetcher_cache_size="2GB" --fetcher_stall_timeout="1mins" --frameworks_home="" --gc_delay="1weeks"
--gc_disk_headroom="0.1" --hadoop_home="" --help="false" --hostname_lookup="true" --http_command_executor="false"
--http_credentials="/tmp/Endpoint_SlaveEndpointTest_NoAuthorizer_0_p5q1i6/http_credentials"
--http_heartbeat_interval="30secs" --initialize_driver_logging="true" --isolation="posix/cpu,posix/mem"
--launcher="posix" --launcher_dir="/tmp/SRC/build/mesos-1.6.0/_build/sub/src" --logbufsecs="0"
--logging_level="INFO" --max_completed_executors_per_framework="150" --memory_profiling="false"
--oversubscribed_resources_interval="15secs" --perf_duration="10secs" --perf_interval="1mins"
--port="5051" --qos_correction_interval_min="0ns" --quiet="false" --reconfiguration_policy="equal"
--recover="reconnect" --recovery_timeout="15mins" --registration_backoff_factor="10ms" --resources="cpus:2;gpus:0;mem:1024;disk:1024;ports:[31000-32000]"
--revocable_cpu_low_priority="true" --runtime_dir="/tmp/Endpoint_SlaveEndpointTest_NoAuthorizer_0_p5q1i6"
--sandbox_directory="/mnt/mesos/sandbox" --strict="true" --switch_user="true" --systemd_enable_support="true"
--systemd_runtime_directory="/run/systemd/system" --version="false" --work_dir="/tmp/Endpoint_SlaveEndpointTest_NoAuthorizer_0_lhK51s"
--zk_session_timeout="10secs"
I0427 22:51:05.455821  6084 credentials.hpp:86] Loading credential for authentication from
'/tmp/Endpoint_SlaveEndpointTest_NoAuthorizer_0_p5q1i6/credential'
I0427 22:51:05.456044  6084 slave.cpp:294] Agent using credential for: test-principal
I0427 22:51:05.456082  6084 credentials.hpp:37] Loading credentials for authentication from
'/tmp/Endpoint_SlaveEndpointTest_NoAuthorizer_0_p5q1i6/http_credentials'
I0427 22:51:05.456403  6084 http.cpp:959] Creating default 'basic' HTTP authenticator for
realm 'mesos-agent-readonly'
I0427 22:51:05.456917  6084 disk_profile_adaptor.cpp:80] Creating default disk profile adaptor
module
I0427 22:51:05.458792  6084 slave.cpp:609] Agent resources: [{"name":"cpus","scalar":{"value":2.0},"type":"SCALAR"},{"name":"mem","scalar":{"value":1024.0},"type":"SCALAR"},{"name":"disk","scalar":{"value":1024.0},"type":"SCALAR"},{"name":"ports","ranges":{"range":[{"begin":31000,"end":32000}]},"type":"RANGES"}]
I0427 22:51:05.459103  6084 slave.cpp:617] Agent attributes: [  ]
I0427 22:51:05.459125  6084 slave.cpp:626] Agent hostname: b9f15d5df5da
I0427 22:51:05.459388  6074 task_status_update_manager.cpp:181] Pausing sending task status
updates
I0427 22:51:05.461475  6096 state.cpp:66] Recovering state from '/tmp/Endpoint_SlaveEndpointTest_NoAuthorizer_0_lhK51s/meta'
I0427 22:51:05.461949  6082 task_status_update_manager.cpp:207] Recovering task status update
manager
I0427 22:51:05.462216  6078 containerizer.cpp:712] Recovering containerizer
I0427 22:51:05.464540  6077 provisioner.cpp:495] Provisioner recovery complete
I0427 22:51:05.465143  6085 slave.cpp:7262] Finished recovery
I0427 22:51:05.469642  6091 process.cpp:3580] Handling HTTP event for process 'slave(973)'
with path: '/slave(973)/monitor/statistics'
I0427 22:51:05.471971  6079 http.cpp:1099] HTTP GET for /slave(973)/monitor/statistics from
172.17.0.2:35812
I0427 22:51:05.472116  6079 http.cpp:936] Authorizing principal 'test-principal' to GET the
'/monitor/statistics' endpoint
I0427 22:51:05.476518  6095 slave.cpp:919] Agent terminating
[       OK ] Endpoint/SlaveEndpointTest.NoAuthorizer/0 (51 ms)
[ RUN      ] Endpoint/SlaveEndpointTest.NoAuthorizer/1
I0427 22:51:05.494746  6072 containerizer.cpp:296] Using isolation { environment_secret, posix/cpu,
posix/mem, filesystem/posix, network/cni }
W0427 22:51:05.495379  6072 backend.cpp:76] Failed to create 'aufs' backend: AufsBackend requires
root privileges
W0427 22:51:05.495419  6072 backend.cpp:76] Failed to create 'bind' backend: BindBackend requires
root privileges
I0427 22:51:05.495447  6072 provisioner.cpp:299] Using default backend 'copy'
I0427 22:51:05.497558  6072 cluster.cpp:460] Creating default 'local' authorizer
I0427 22:51:05.500152  6096 slave.cpp:261] Mesos agent started on (974)@172.17.0.2:37754
I0427 22:51:05.500188  6096 slave.cpp:262] Flags at startup: --acls="" --appc_simple_discovery_uri_prefix="http://"
--appc_store_dir="/tmp/Endpoint_SlaveEndpointTest_NoAuthorizer_1_hAYAOD/store/appc" --authenticate_http_readonly="true"
--authenticate_http_readwrite="false" --authenticatee="crammd5" --authentication_backoff_factor="1secs"
--authorizer="local" --cgroups_cpu_enable_pids_and_tids_count="false" --cgroups_enable_cfs="false"
--cgroups_hierarchy="/sys/fs/cgroup" --cgroups_limit_swap="false" --cgroups_root="mesos" --container_disk_watch_interval="15secs"
--containerizers="mesos" --credential="/tmp/Endpoint_SlaveEndpointTest_NoAuthorizer_1_hAYAOD/credential"
--default_role="*" --disallow_sharing_agent_pid_namespace="false" --disk_watch_interval="1mins"
--docker="docker" --docker_kill_orphans="true" --docker_registry="https://registry-1.docker.io"
--docker_remove_delay="6hrs" --docker_socket="/var/run/docker.sock" --docker_stop_timeout="0ns"
--docker_store_dir="/tmp/Endpoint_SlaveEndpointTest_NoAuthorizer_1_hAYAOD/store/docker" --docker_volume_checkpoint_dir="/var/run/mesos/isolators/docker/volume"
--enforce_container_disk_quota="false" --executor_registration_timeout="1mins" --executor_reregistration_timeout="2secs"
--executor_shutdown_grace_period="5secs" --fetcher_cache_dir="/tmp/Endpoint_SlaveEndpointTest_NoAuthorizer_1_hAYAOD/fetch"
--fetcher_cache_size="2GB" --fetcher_stall_timeout="1mins" --frameworks_home="" --gc_delay="1weeks"
--gc_disk_headroom="0.1" --hadoop_home="" --help="false" --hostname_lookup="true" --http_command_executor="false"
--http_credentials="/tmp/Endpoint_SlaveEndpointTest_NoAuthorizer_1_hAYAOD/http_credentials"
--http_heartbeat_interval="30secs" --initialize_driver_logging="true" --isolation="posix/cpu,posix/mem"
--launcher="posix" --launcher_dir="/tmp/SRC/build/mesos-1.6.0/_build/sub/src" --logbufsecs="0"
--logging_level="INFO" --max_completed_executors_per_framework="150" --memory_profiling="false"
--oversubscribed_resources_interval="15secs" --perf_duration="10secs" --perf_interval="1mins"
--port="5051" --qos_correction_interval_min="0ns" --quiet="false" --reconfiguration_policy="equal"
--recover="reconnect" --recovery_timeout="15mins" --registration_backoff_factor="10ms" --resources="cpus:2;gpus:0;mem:1024;disk:1024;ports:[31000-32000]"
--revocable_cpu_low_priority="true" --runtime_dir="/tmp/Endpoint_SlaveEndpointTest_NoAuthorizer_1_hAYAOD"
--sandbox_directory="/mnt/mesos/sandbox" --strict="true" --switch_user="true" --systemd_enable_support="true"
--systemd_runtime_directory="/run/systemd/system" --version="false" --work_dir="/tmp/Endpoint_SlaveEndpointTest_NoAuthorizer_1_N2Maq0"
--zk_session_timeout="10secs"
I0427 22:51:05.500780  6096 credentials.hpp:86] Loading credential for authentication from
'/tmp/Endpoint_SlaveEndpointTest_NoAuthorizer_1_hAYAOD/credential'
I0427 22:51:05.500982  6096 slave.cpp:294] Agent using credential for: test-principal
I0427 22:51:05.501016  6096 credentials.hpp:37] Loading credentials for authentication from
'/tmp/Endpoint_SlaveEndpointTest_NoAuthorizer_1_hAYAOD/http_credentials'
I0427 22:51:05.501312  6096 http.cpp:959] Creating default 'basic' HTTP authenticator for
realm 'mesos-agent-readonly'
I0427 22:51:05.501744  6096 disk_profile_adaptor.cpp:80] Creating default disk profile adaptor
module
I0427 22:51:05.503453  6096 slave.cpp:609] Agent resources: [{"name":"cpus","scalar":{"value":2.0},"type":"SCALAR"},{"name":"mem","scalar":{"value":1024.0},"type":"SCALAR"},{"name":"disk","scalar":{"value":1024.0},"type":"SCALAR"},{"name":"ports","ranges":{"range":[{"begin":31000,"end":32000}]},"type":"RANGES"}]
I0427 22:51:05.503743  6096 slave.cpp:617] Agent attributes: [  ]
I0427 22:51:05.503764  6096 slave.cpp:626] Agent hostname: b9f15d5df5da
I0427 22:51:05.504040  6087 task_status_update_manager.cpp:181] Pausing sending task status
updates
I0427 22:51:05.505797  6073 state.cpp:66] Recovering state from '/tmp/Endpoint_SlaveEndpointTest_NoAuthorizer_1_N2Maq0/meta'
I0427 22:51:05.506274  6073 task_status_update_manager.cpp:207] Recovering task status update
manager
I0427 22:51:05.506613  6086 containerizer.cpp:712] Recovering containerizer
I0427 22:51:05.508919  6084 provisioner.cpp:495] Provisioner recovery complete
I0427 22:51:05.509471  6078 slave.cpp:7262] Finished recovery
I0427 22:51:05.513674  6075 process.cpp:3580] Handling HTTP event for process 'slave(974)'
with path: '/slave(974)/monitor/statistics.json'
I0427 22:51:05.516199  6084 http.cpp:1099] HTTP GET for /slave(974)/monitor/statistics.json
from 172.17.0.2:35814
I0427 22:51:05.516294  6084 http.cpp:936] Authorizing principal 'test-principal' to GET the
'/monitor/statistics.json' endpoint
I0427 22:51:05.520385  6074 slave.cpp:919] Agent terminating
[       OK ] Endpoint/SlaveEndpointTest.NoAuthorizer/1 (42 ms)
[ RUN      ] Endpoint/SlaveEndpointTest.NoAuthorizer/2
I0427 22:51:05.538141  6072 containerizer.cpp:296] Using isolation { environment_secret, posix/cpu,
posix/mem, filesystem/posix, network/cni }
W0427 22:51:05.538817  6072 backend.cpp:76] Failed to create 'aufs' backend: AufsBackend requires
root privileges
W0427 22:51:05.538851  6072 backend.cpp:76] Failed to create 'bind' backend: BindBackend requires
root privileges
I0427 22:51:05.538882  6072 provisioner.cpp:299] Using default backend 'copy'
I0427 22:51:05.541100  6072 cluster.cpp:460] Creating default 'local' authorizer
I0427 22:51:05.543885  6078 slave.cpp:261] Mesos agent started on (975)@172.17.0.2:37754
I0427 22:51:05.543915  6078 slave.cpp:262] Flags at startup: --acls="" --appc_simple_discovery_uri_prefix="http://"
--appc_store_dir="/tmp/Endpoint_SlaveEndpointTest_NoAuthorizer_2_FOW9Jb/store/appc" --authenticate_http_readonly="true"
--authenticate_http_readwrite="false" --authenticatee="crammd5" --authentication_backoff_factor="1secs"
--authorizer="local" --cgroups_cpu_enable_pids_and_tids_count="false" --cgroups_enable_cfs="false"
--cgroups_hierarchy="/sys/fs/cgroup" --cgroups_limit_swap="false" --cgroups_root="mesos" --container_disk_watch_interval="15secs"
--containerizers="mesos" --credential="/tmp/Endpoint_SlaveEndpointTest_NoAuthorizer_2_FOW9Jb/credential"
--default_role="*" --disallow_sharing_agent_pid_namespace="false" --disk_watch_interval="1mins"
--docker="docker" --docker_kill_orphans="true" --docker_registry="https://registry-1.docker.io"
--docker_remove_delay="6hrs" --docker_socket="/var/run/docker.sock" --docker_stop_timeout="0ns"
--docker_store_dir="/tmp/Endpoint_SlaveEndpointTest_NoAuthorizer_2_FOW9Jb/store/docker" --docker_volume_checkpoint_dir="/var/run/mesos/isolators/docker/volume"
--enforce_container_disk_quota="false" --executor_registration_timeout="1mins" --executor_reregistration_timeout="2secs"
--executor_shutdown_grace_period="5secs" --fetcher_cache_dir="/tmp/Endpoint_SlaveEndpointTest_NoAuthorizer_2_FOW9Jb/fetch"
--fetcher_cache_size="2GB" --fetcher_stall_timeout="1mins" --frameworks_home="" --gc_delay="1weeks"
--gc_disk_headroom="0.1" --hadoop_home="" --help="false" --hostname_lookup="true" --http_command_executor="false"
--http_credentials="/tmp/Endpoint_SlaveEndpointTest_NoAuthorizer_2_FOW9Jb/http_credentials"
--http_heartbeat_interval="30secs" --initialize_driver_logging="true" --isolation="posix/cpu,posix/mem"
--launcher="posix" --launcher_dir="/tmp/SRC/build/mesos-1.6.0/_build/sub/src" --logbufsecs="0"
--logging_level="INFO" --max_completed_executors_per_framework="150" --memory_profiling="false"
--oversubscribed_resources_interval="15secs" --perf_duration="10secs" --perf_interval="1mins"
--port="5051" --qos_correction_interval_min="0ns" --quiet="false" --reconfiguration_policy="equal"
--recover="reconnect" --recovery_timeout="15mins" --registration_backoff_factor="10ms" --resources="cpus:2;gpus:0;mem:1024;disk:1024;ports:[31000-32000]"
--revocable_cpu_low_priority="true" --runtime_dir="/tmp/Endpoint_SlaveEndpointTest_NoAuthorizer_2_FOW9Jb"
--sandbox_directory="/mnt/mesos/sandbox" --strict="true" --switch_user="true" --systemd_enable_support="true"
--systemd_runtime_directory="/run/systemd/system" --version="false" --work_dir="/tmp/Endpoint_SlaveEndpointTest_NoAuthorizer_2_NLugfy"
--zk_session_timeout="10secs"
I0427 22:51:05.544464  6078 credentials.hpp:86] Loading credential for authentication from
'/tmp/Endpoint_SlaveEndpointTest_NoAuthorizer_2_FOW9Jb/credential'
I0427 22:51:05.544670  6078 slave.cpp:294] Agent using credential for: test-principal
I0427 22:51:05.544701  6078 credentials.hpp:37] Loading credentials for authentication from
'/tmp/Endpoint_SlaveEndpointTest_NoAuthorizer_2_FOW9Jb/http_credentials'
I0427 22:51:05.544982  6078 http.cpp:959] Creating default 'basic' HTTP authenticator for
realm 'mesos-agent-readonly'
I0427 22:51:05.545379  6078 disk_profile_adaptor.cpp:80] Creating default disk profile adaptor
module
I0427 22:51:05.547010  6078 slave.cpp:609] Agent resources: [{"name":"cpus","scalar":{"value":2.0},"type":"SCALAR"},{"name":"mem","scalar":{"value":1024.0},"type":"SCALAR"},{"name":"disk","scalar":{"value":1024.0},"type":"SCALAR"},{"name":"ports","ranges":{"range":[{"begin":31000,"end":32000}]},"type":"RANGES"}]
I0427 22:51:05.547286  6078 slave.cpp:617] Agent attributes: [  ]
I0427 22:51:05.547304  6078 slave.cpp:626] Agent hostname: b9f15d5df5da
I0427 22:51:05.547463  6083 task_status_update_manager.cpp:181] Pausing sending task status
updates
I0427 22:51:05.549310  6090 state.cpp:66] Recovering state from '/tmp/Endpoint_SlaveEndpointTest_NoAuthorizer_2_NLugfy/meta'
I0427 22:51:05.549742  6094 task_status_update_manager.cpp:207] Recovering task status update
manager
I0427 22:51:05.550164  6096 containerizer.cpp:712] Recovering containerizer
I0427 22:51:05.552064  6091 provisioner.cpp:495] Provisioner recovery complete
I0427 22:51:05.552672  6073 slave.cpp:7262] Finished recovery
I0427 22:51:05.556249  6088 process.cpp:3580] Handling HTTP event for process 'slave(975)'
with path: '/slave(975)/containers'
I0427 22:51:05.558269  6080 http.cpp:1099] HTTP GET for /slave(975)/containers from 172.17.0.2:35816
I0427 22:51:05.558378  6080 http.cpp:936] Authorizing principal 'test-principal' to GET the
'/containers' endpoint
I0427 22:51:05.563786  6096 slave.cpp:919] Agent terminating
[       OK ] Endpoint/SlaveEndpointTest.NoAuthorizer/2 (44 ms)
[----------] 9 tests from Endpoint/SlaveEndpointTest (420 ms total)

[----------] 2 tests from ContainerizerType/DefaultContainerDNSFlagTest
[ RUN      ] ContainerizerType/DefaultContainerDNSFlagTest.ValidateFlag/0
[       OK ] ContainerizerType/DefaultContainerDNSFlagTest.ValidateFlag/0 (11 ms)
[ RUN      ] ContainerizerType/DefaultContainerDNSFlagTest.ValidateFlag/1
[       OK ] ContainerizerType/DefaultContainerDNSFlagTest.ValidateFlag/1 (12 ms)
[----------] 2 tests from ContainerizerType/DefaultContainerDNSFlagTest (23 ms total)

[----------] Global test environment tear-down
[==========] 1909 tests from 195 test cases ran. (787599 ms total)
[  PASSED  ] 1908 tests.
[  FAILED  ] 1 test, listed below:
[  FAILED  ] RegistrarTest.Recover

 1 FAILED TEST
  YOU HAVE 22 DISABLED TESTS

I0427 22:51:05.663583  6097 process.cpp:939] Stopped the socket accept loop
Makefile:14693: recipe for target 'check-local' failed
make[4]: *** [check-local] Error 1
make[4]: Leaving directory '/tmp/SRC/build/mesos-1.6.0/_build/sub/src'
Makefile:13809: recipe for target 'check-am' failed
make[3]: *** [check-am] Error 2
make[3]: Leaving directory '/tmp/SRC/build/mesos-1.6.0/_build/sub/src'
Makefile:13813: recipe for target 'check' failed
make[2]: *** [check] Error 2
make[2]: Leaving directory '/tmp/SRC/build/mesos-1.6.0/_build/sub/src'
Makefile:776: recipe for target 'check-recursive' failed
make[1]: *** [check-recursive] Error 1
make[1]: Leaving directory '/tmp/SRC/build/mesos-1.6.0/_build/sub'
Makefile:982: recipe for target 'distcheck' failed
make: *** [distcheck] Error 1
Untagged: mesos/mesos-build:ubuntu-16.04
Untagged: mesos/mesos-build@sha256:8685ea3c3e17663e4a1764d08df701102b4e9286c6c1a7116afccbe382777290
Deleted: sha256:4ecb5a128921ae9aad805a57a0e4d24dbcfbe84b09304997c7e2798819aa155a
Deleted: sha256:91a3c8a13a99414ff67baa2d1c6a6a82b43c237327a78d7f815414e155578ac1
Deleted: sha256:d05373b7ffe6961840e0962d4b16df22a14b1bbba3416f5aee58b579f08a2bcd
Deleted: sha256:db96690681268d3c4fdd48cd5edc2ca128c6b2493c67333983b63119622cc485
Deleted: sha256:70f40beaddd4e8dc15479d4f78d75b121fd4428c7bb29319a0fae0babd257e37
Deleted: sha256:77e6ddba346d8ad1e436256f6373dede5af4002006981b7d4116c561c759cefa
Deleted: sha256:8db758ab2fdb54da0aec53aeac876934337e6170f5a8c8872b3d4171e3d465b7
Deleted: sha256:a7fc6b405fe8ef71edfa6163d1dc9f1cb1df426049eefaa7d388e9df21a061ad
Deleted: sha256:5a3e35538f7f2e2727c8ac92f08c30002b9e8a77737de0dab91244344d59f69b
Deleted: sha256:ff986b10a018b48074e6d3a68b39aad8ccc002cdad912d4148c0f92b3729323e
Build step 'Execute shell' marked build as failure


Mime
View raw message