mesos-builds mailing list archives

Site index · List index
Message view « Date » · « Thread »
Top « Date » · « Thread »
From Apache Jenkins Server <jenk...@builds.apache.org>
Subject Build failed in Jenkins: Mesos-Reviewbot #22088
Date Tue, 03 Apr 2018 23:00:07 GMT
See <https://builds.apache.org/job/Mesos-Reviewbot/22088/display/redirect>

------------------------------------------
[...truncated 34.92 MB...]
I0403 22:59:55.712510   487 task_status_update_manager.cpp:207] Recovering task status update
manager
I0403 22:59:55.712733   487 containerizer.cpp:674] Recovering containerizer
I0403 22:59:55.714371   478 provisioner.cpp:495] Provisioner recovery complete
I0403 22:59:55.714753   486 slave.cpp:7220] Finished recovery
I0403 22:59:55.718360   478 process.cpp:3564] Handling HTTP event for process 'slave(948)'
with path: '/slave(948)/monitor/statistics'
I0403 22:59:55.720055   484 http.cpp:1099] HTTP GET for /slave(948)/monitor/statistics from
172.17.0.2:34820
I0403 22:59:55.720140   484 http.cpp:936] Authorizing principal 'test-principal' to GET the
'/monitor/statistics' endpoint
I0403 22:59:55.722818   474 slave.cpp:923] Agent terminating
[       OK ] Endpoint/SlaveEndpointTest.AuthorizedRequest/0 (34 ms)
[ RUN      ] Endpoint/SlaveEndpointTest.AuthorizedRequest/1
I0403 22:59:55.735563   474 containerizer.cpp:304] Using isolation { environment_secret, posix/cpu,
posix/mem, filesystem/posix, network/cni }
W0403 22:59:55.736073   474 backend.cpp:76] Failed to create 'aufs' backend: AufsBackend requires
root privileges
W0403 22:59:55.736096   474 backend.cpp:76] Failed to create 'bind' backend: BindBackend requires
root privileges
I0403 22:59:55.736122   474 provisioner.cpp:299] Using default backend 'copy'
I0403 22:59:55.740206   485 slave.cpp:263] Mesos agent started on (949)@172.17.0.2:49681
I0403 22:59:55.740232   485 slave.cpp:264] Flags at startup: --acls="" --appc_simple_discovery_uri_prefix="http://"
--appc_store_dir="/tmp/Endpoint_SlaveEndpointTest_AuthorizedRequest_1_qQQs4w/store/appc" --authenticate_http_readonly="true"
--authenticate_http_readwrite="false" --authenticatee="crammd5" --authentication_backoff_factor="1secs"
--authorizer="local" --cgroups_cpu_enable_pids_and_tids_count="false" --cgroups_enable_cfs="false"
--cgroups_hierarchy="/sys/fs/cgroup" --cgroups_limit_swap="false" --cgroups_root="mesos" --container_disk_watch_interval="15secs"
--containerizers="mesos" --credential="/tmp/Endpoint_SlaveEndpointTest_AuthorizedRequest_1_qQQs4w/credential"
--default_role="*" --disallow_sharing_agent_pid_namespace="false" --disk_watch_interval="1mins"
--docker="docker" --docker_kill_orphans="true" --docker_registry="https://registry-1.docker.io"
--docker_remove_delay="6hrs" --docker_socket="/var/run/docker.sock" --docker_stop_timeout="0ns"
--docker_store_dir="/tmp/Endpoint_SlaveEndpointTest_AuthorizedRequest_1_qQQs4w/store/docker"
--docker_volume_checkpoint_dir="/var/run/mesos/isolators/docker/volume" --enforce_container_disk_quota="false"
--executor_registration_timeout="1mins" --executor_reregistration_timeout="2secs" --executor_shutdown_grace_period="5secs"
--fetcher_cache_dir="/tmp/Endpoint_SlaveEndpointTest_AuthorizedRequest_1_qQQs4w/fetch" --fetcher_cache_size="2GB"
--fetcher_stall_timeout="1mins" --frameworks_home="" --gc_delay="1weeks" --gc_disk_headroom="0.1"
--hadoop_home="" --help="false" --hostname_lookup="true" --http_command_executor="false" --http_credentials="/tmp/Endpoint_SlaveEndpointTest_AuthorizedRequest_1_qQQs4w/http_credentials"
--http_heartbeat_interval="30secs" --initialize_driver_logging="true" --isolation="posix/cpu,posix/mem"
--launcher="posix" --launcher_dir="/tmp/SRC/build/mesos-1.6.0/_build/sub/src" --logbufsecs="0"
--logging_level="INFO" --max_completed_executors_per_framework="150" --oversubscribed_resources_interval="15secs"
--perf_duration="10secs" --perf_interval="1mins" --port="5051" --qos_correction_interval_min="0ns"
--quiet="false" --reconfiguration_policy="equal" --recover="reconnect" --recovery_timeout="15mins"
--registration_backoff_factor="10ms" --resources="cpus:2;gpus:0;mem:1024;disk:1024;ports:[31000-32000]"
--revocable_cpu_low_priority="true" --runtime_dir="/tmp/Endpoint_SlaveEndpointTest_AuthorizedRequest_1_qQQs4w"
--sandbox_directory="/mnt/mesos/sandbox" --strict="true" --switch_user="true" --systemd_enable_support="true"
--systemd_runtime_directory="/run/systemd/system" --version="false" --work_dir="/tmp/Endpoint_SlaveEndpointTest_AuthorizedRequest_1_CWfTEU"
--zk_session_timeout="10secs"
I0403 22:59:55.740830   485 credentials.hpp:86] Loading credential for authentication from
'/tmp/Endpoint_SlaveEndpointTest_AuthorizedRequest_1_qQQs4w/credential'
I0403 22:59:55.741019   485 slave.cpp:296] Agent using credential for: test-principal
I0403 22:59:55.741106   485 credentials.hpp:37] Loading credentials for authentication from
'/tmp/Endpoint_SlaveEndpointTest_AuthorizedRequest_1_qQQs4w/http_credentials'
I0403 22:59:55.741443   485 http.cpp:959] Creating default 'basic' HTTP authenticator for
realm 'mesos-agent-readonly'
I0403 22:59:55.743132   485 slave.cpp:613] Agent resources: [{"name":"cpus","scalar":{"value":2.0},"type":"SCALAR"},{"name":"mem","scalar":{"value":1024.0},"type":"SCALAR"},{"name":"disk","scalar":{"value":1024.0},"type":"SCALAR"},{"name":"ports","ranges":{"range":[{"begin":31000,"end":32000}]},"type":"RANGES"}]
I0403 22:59:55.743355   485 slave.cpp:621] Agent attributes: [  ]
I0403 22:59:55.743376   485 slave.cpp:630] Agent hostname: 0212907dc323
I0403 22:59:55.743542   482 task_status_update_manager.cpp:181] Pausing sending task status
updates
I0403 22:59:55.745179   488 state.cpp:66] Recovering state from '/tmp/Endpoint_SlaveEndpointTest_AuthorizedRequest_1_CWfTEU/meta'
I0403 22:59:55.745671   475 task_status_update_manager.cpp:207] Recovering task status update
manager
I0403 22:59:55.745895   481 containerizer.cpp:674] Recovering containerizer
I0403 22:59:55.747501   480 provisioner.cpp:495] Provisioner recovery complete
I0403 22:59:55.747902   478 slave.cpp:7220] Finished recovery
I0403 22:59:55.751415   485 process.cpp:3564] Handling HTTP event for process 'slave(949)'
with path: '/slave(949)/monitor/statistics.json'
I0403 22:59:55.753150   482 http.cpp:1099] HTTP GET for /slave(949)/monitor/statistics.json
from 172.17.0.2:34825
I0403 22:59:55.753229   482 http.cpp:936] Authorizing principal 'test-principal' to GET the
'/monitor/statistics.json' endpoint
I0403 22:59:55.756170   475 slave.cpp:923] Agent terminating
[       OK ] Endpoint/SlaveEndpointTest.AuthorizedRequest/1 (33 ms)
[ RUN      ] Endpoint/SlaveEndpointTest.AuthorizedRequest/2
I0403 22:59:55.769364   474 containerizer.cpp:304] Using isolation { environment_secret, posix/cpu,
posix/mem, filesystem/posix, network/cni }
W0403 22:59:55.769901   474 backend.cpp:76] Failed to create 'aufs' backend: AufsBackend requires
root privileges
W0403 22:59:55.769925   474 backend.cpp:76] Failed to create 'bind' backend: BindBackend requires
root privileges
I0403 22:59:55.769951   474 provisioner.cpp:299] Using default backend 'copy'
I0403 22:59:55.774917   485 slave.cpp:263] Mesos agent started on (950)@172.17.0.2:49681
I0403 22:59:55.774943   485 slave.cpp:264] Flags at startup: --acls="" --appc_simple_discovery_uri_prefix="http://"
--appc_store_dir="/tmp/Endpoint_SlaveEndpointTest_AuthorizedRequest_2_Slqo10/store/appc" --authenticate_http_readonly="true"
--authenticate_http_readwrite="false" --authenticatee="crammd5" --authentication_backoff_factor="1secs"
--authorizer="local" --cgroups_cpu_enable_pids_and_tids_count="false" --cgroups_enable_cfs="false"
--cgroups_hierarchy="/sys/fs/cgroup" --cgroups_limit_swap="false" --cgroups_root="mesos" --container_disk_watch_interval="15secs"
--containerizers="mesos" --credential="/tmp/Endpoint_SlaveEndpointTest_AuthorizedRequest_2_Slqo10/credential"
--default_role="*" --disallow_sharing_agent_pid_namespace="false" --disk_watch_interval="1mins"
--docker="docker" --docker_kill_orphans="true" --docker_registry="https://registry-1.docker.io"
--docker_remove_delay="6hrs" --docker_socket="/var/run/docker.sock" --docker_stop_timeout="0ns"
--docker_store_dir="/tmp/Endpoint_SlaveEndpointTest_AuthorizedRequest_2_Slqo10/store/docker"
--docker_volume_checkpoint_dir="/var/run/mesos/isolators/docker/volume" --enforce_container_disk_quota="false"
--executor_registration_timeout="1mins" --executor_reregistration_timeout="2secs" --executor_shutdown_grace_period="5secs"
--fetcher_cache_dir="/tmp/Endpoint_SlaveEndpointTest_AuthorizedRequest_2_Slqo10/fetch" --fetcher_cache_size="2GB"
--fetcher_stall_timeout="1mins" --frameworks_home="" --gc_delay="1weeks" --gc_disk_headroom="0.1"
--hadoop_home="" --help="false" --hostname_lookup="true" --http_command_executor="false" --http_credentials="/tmp/Endpoint_SlaveEndpointTest_AuthorizedRequest_2_Slqo10/http_credentials"
--http_heartbeat_interval="30secs" --initialize_driver_logging="true" --isolation="posix/cpu,posix/mem"
--launcher="posix" --launcher_dir="/tmp/SRC/build/mesos-1.6.0/_build/sub/src" --logbufsecs="0"
--logging_level="INFO" --max_completed_executors_per_framework="150" --oversubscribed_resources_interval="15secs"
--perf_duration="10secs" --perf_interval="1mins" --port="5051" --qos_correction_interval_min="0ns"
--quiet="false" --reconfiguration_policy="equal" --recover="reconnect" --recovery_timeout="15mins"
--registration_backoff_factor="10ms" --resources="cpus:2;gpus:0;mem:1024;disk:1024;ports:[31000-32000]"
--revocable_cpu_low_priority="true" --runtime_dir="/tmp/Endpoint_SlaveEndpointTest_AuthorizedRequest_2_Slqo10"
--sandbox_directory="/mnt/mesos/sandbox" --strict="true" --switch_user="true" --systemd_enable_support="true"
--systemd_runtime_directory="/run/systemd/system" --version="false" --work_dir="/tmp/Endpoint_SlaveEndpointTest_AuthorizedRequest_2_GxSjwo"
--zk_session_timeout="10secs"
I0403 22:59:55.775393   485 credentials.hpp:86] Loading credential for authentication from
'/tmp/Endpoint_SlaveEndpointTest_AuthorizedRequest_2_Slqo10/credential'
I0403 22:59:55.775583   485 slave.cpp:296] Agent using credential for: test-principal
I0403 22:59:55.775610   485 credentials.hpp:37] Loading credentials for authentication from
'/tmp/Endpoint_SlaveEndpointTest_AuthorizedRequest_2_Slqo10/http_credentials'
I0403 22:59:55.775907   485 http.cpp:959] Creating default 'basic' HTTP authenticator for
realm 'mesos-agent-readonly'
I0403 22:59:55.777565   485 slave.cpp:613] Agent resources: [{"name":"cpus","scalar":{"value":2.0},"type":"SCALAR"},{"name":"mem","scalar":{"value":1024.0},"type":"SCALAR"},{"name":"disk","scalar":{"value":1024.0},"type":"SCALAR"},{"name":"ports","ranges":{"range":[{"begin":31000,"end":32000}]},"type":"RANGES"}]
I0403 22:59:55.777775   485 slave.cpp:621] Agent attributes: [  ]
I0403 22:59:55.777788   485 slave.cpp:630] Agent hostname: 0212907dc323
I0403 22:59:55.778017   477 task_status_update_manager.cpp:181] Pausing sending task status
updates
I0403 22:59:55.779428   489 state.cpp:66] Recovering state from '/tmp/Endpoint_SlaveEndpointTest_AuthorizedRequest_2_GxSjwo/meta'
I0403 22:59:55.779772   489 task_status_update_manager.cpp:207] Recovering task status update
manager
I0403 22:59:55.779984   478 containerizer.cpp:674] Recovering containerizer
I0403 22:59:55.781561   490 provisioner.cpp:495] Provisioner recovery complete
I0403 22:59:55.781975   489 slave.cpp:7220] Finished recovery
I0403 22:59:55.785223   480 process.cpp:3564] Handling HTTP event for process 'slave(950)'
with path: '/slave(950)/containers'
I0403 22:59:55.786887   477 http.cpp:1099] HTTP GET for /slave(950)/containers from 172.17.0.2:34829
I0403 22:59:55.786970   477 http.cpp:936] Authorizing principal 'test-principal' to GET the
'/containers' endpoint
I0403 22:59:55.790611   474 slave.cpp:923] Agent terminating
[       OK ] Endpoint/SlaveEndpointTest.AuthorizedRequest/2 (34 ms)
[ RUN      ] Endpoint/SlaveEndpointTest.UnauthorizedRequest/0
I0403 22:59:55.806957   474 containerizer.cpp:304] Using isolation { environment_secret, posix/cpu,
posix/mem, filesystem/posix, network/cni }
W0403 22:59:55.807512   474 backend.cpp:76] Failed to create 'aufs' backend: AufsBackend requires
root privileges
W0403 22:59:55.807535   474 backend.cpp:76] Failed to create 'bind' backend: BindBackend requires
root privileges
I0403 22:59:55.807561   474 provisioner.cpp:299] Using default backend 'copy'
I0403 22:59:55.811764   481 slave.cpp:263] Mesos agent started on (951)@172.17.0.2:49681
I0403 22:59:55.811797   481 slave.cpp:264] Flags at startup: --acls="" --appc_simple_discovery_uri_prefix="http://"
--appc_store_dir="/tmp/Endpoint_SlaveEndpointTest_UnauthorizedRequest_0_Sjb7lv/store/appc"
--authenticate_http_readonly="true" --authenticate_http_readwrite="false" --authenticatee="crammd5"
--authentication_backoff_factor="1secs" --authorizer="local" --cgroups_cpu_enable_pids_and_tids_count="false"
--cgroups_enable_cfs="false" --cgroups_hierarchy="/sys/fs/cgroup" --cgroups_limit_swap="false"
--cgroups_root="mesos" --container_disk_watch_interval="15secs" --containerizers="mesos" --credential="/tmp/Endpoint_SlaveEndpointTest_UnauthorizedRequest_0_Sjb7lv/credential"
--default_role="*" --disallow_sharing_agent_pid_namespace="false" --disk_watch_interval="1mins"
--docker="docker" --docker_kill_orphans="true" --docker_registry="https://registry-1.docker.io"
--docker_remove_delay="6hrs" --docker_socket="/var/run/docker.sock" --docker_stop_timeout="0ns"
--docker_store_dir="/tmp/Endpoint_SlaveEndpointTest_UnauthorizedRequest_0_Sjb7lv/store/docker"
--docker_volume_checkpoint_dir="/var/run/mesos/isolators/docker/volume" --enforce_container_disk_quota="false"
--executor_registration_timeout="1mins" --executor_reregistration_timeout="2secs" --executor_shutdown_grace_period="5secs"
--fetcher_cache_dir="/tmp/Endpoint_SlaveEndpointTest_UnauthorizedRequest_0_Sjb7lv/fetch" --fetcher_cache_size="2GB"
--fetcher_stall_timeout="1mins" --frameworks_home="" --gc_delay="1weeks" --gc_disk_headroom="0.1"
--hadoop_home="" --help="false" --hostname_lookup="true" --http_command_executor="false" --http_credentials="/tmp/Endpoint_SlaveEndpointTest_UnauthorizedRequest_0_Sjb7lv/http_credentials"
--http_heartbeat_interval="30secs" --initialize_driver_logging="true" --isolation="posix/cpu,posix/mem"
--launcher="posix" --launcher_dir="/tmp/SRC/build/mesos-1.6.0/_build/sub/src" --logbufsecs="0"
--logging_level="INFO" --max_completed_executors_per_framework="150" --oversubscribed_resources_interval="15secs"
--perf_duration="10secs" --perf_interval="1mins" --port="5051" --qos_correction_interval_min="0ns"
--quiet="false" --reconfiguration_policy="equal" --recover="reconnect" --recovery_timeout="15mins"
--registration_backoff_factor="10ms" --resources="cpus:2;gpus:0;mem:1024;disk:1024;ports:[31000-32000]"
--revocable_cpu_low_priority="true" --runtime_dir="/tmp/Endpoint_SlaveEndpointTest_UnauthorizedRequest_0_Sjb7lv"
--sandbox_directory="/mnt/mesos/sandbox" --strict="true" --switch_user="true" --systemd_enable_support="true"
--systemd_runtime_directory="/run/systemd/system" --version="false" --work_dir="/tmp/Endpoint_SlaveEndpointTest_UnauthorizedRequest_0_qU7WKS"
--zk_session_timeout="10secs"
I0403 22:59:55.812306   481 credentials.hpp:86] Loading credential for authentication from
'/tmp/Endpoint_SlaveEndpointTest_UnauthorizedRequest_0_Sjb7lv/credential'
I0403 22:59:55.812484   481 slave.cpp:296] Agent using credential for: test-principal
I0403 22:59:55.812506   481 credentials.hpp:37] Loading credentials for authentication from
'/tmp/Endpoint_SlaveEndpointTest_UnauthorizedRequest_0_Sjb7lv/http_credentials'
I0403 22:59:55.812733   481 http.cpp:959] Creating default 'basic' HTTP authenticator for
realm 'mesos-agent-readonly'
I0403 22:59:55.814352   481 slave.cpp:613] Agent resources: [{"name":"cpus","scalar":{"value":2.0},"type":"SCALAR"},{"name":"mem","scalar":{"value":1024.0},"type":"SCALAR"},{"name":"disk","scalar":{"value":1024.0},"type":"SCALAR"},{"name":"ports","ranges":{"range":[{"begin":31000,"end":32000}]},"type":"RANGES"}]
I0403 22:59:55.814560   481 slave.cpp:621] Agent attributes: [  ]
I0403 22:59:55.814575   481 slave.cpp:630] Agent hostname: 0212907dc323
I0403 22:59:55.814755   479 task_status_update_manager.cpp:181] Pausing sending task status
updates
I0403 22:59:55.816205   488 state.cpp:66] Recovering state from '/tmp/Endpoint_SlaveEndpointTest_UnauthorizedRequest_0_qU7WKS/meta'
I0403 22:59:55.816586   484 task_status_update_manager.cpp:207] Recovering task status update
manager
I0403 22:59:55.816805   490 containerizer.cpp:674] Recovering containerizer
I0403 22:59:55.818473   488 provisioner.cpp:495] Provisioner recovery complete
I0403 22:59:55.818892   476 slave.cpp:7220] Finished recovery
I0403 22:59:55.822268   489 process.cpp:3564] Handling HTTP event for process 'slave(951)'
with path: '/slave(951)/monitor/statistics'
I0403 22:59:55.823956   482 http.cpp:1099] HTTP GET for /slave(951)/monitor/statistics from
172.17.0.2:34834
I0403 22:59:55.824039   482 http.cpp:936] Authorizing principal 'test-principal' to GET the
'/monitor/statistics' endpoint
I0403 22:59:55.825903   474 slave.cpp:923] Agent terminating
[       OK ] Endpoint/SlaveEndpointTest.UnauthorizedRequest/0 (32 ms)
[ RUN      ] Endpoint/SlaveEndpointTest.UnauthorizedRequest/1
I0403 22:59:55.839258   474 containerizer.cpp:304] Using isolation { environment_secret, posix/cpu,
posix/mem, filesystem/posix, network/cni }
W0403 22:59:55.839803   474 backend.cpp:76] Failed to create 'aufs' backend: AufsBackend requires
root privileges
W0403 22:59:55.839826   474 backend.cpp:76] Failed to create 'bind' backend: BindBackend requires
root privileges
I0403 22:59:55.839853   474 provisioner.cpp:299] Using default backend 'copy'
I0403 22:59:55.844259   481 slave.cpp:263] Mesos agent started on (952)@172.17.0.2:49681
I0403 22:59:55.844285   481 slave.cpp:264] Flags at startup: --acls="" --appc_simple_discovery_uri_prefix="http://"
--appc_store_dir="/tmp/Endpoint_SlaveEndpointTest_UnauthorizedRequest_1_IIfv2Z/store/appc"
--authenticate_http_readonly="true" --authenticate_http_readwrite="false" --authenticatee="crammd5"
--authentication_backoff_factor="1secs" --authorizer="local" --cgroups_cpu_enable_pids_and_tids_count="false"
--cgroups_enable_cfs="false" --cgroups_hierarchy="/sys/fs/cgroup" --cgroups_limit_swap="false"
--cgroups_root="mesos" --container_disk_watch_interval="15secs" --containerizers="mesos" --credential="/tmp/Endpoint_SlaveEndpointTest_UnauthorizedRequest_1_IIfv2Z/credential"
--default_role="*" --disallow_sharing_agent_pid_namespace="false" --disk_watch_interval="1mins"
--docker="docker" --docker_kill_orphans="true" --docker_registry="https://registry-1.docker.io"
--docker_remove_delay="6hrs" --docker_socket="/var/run/docker.sock" --docker_stop_timeout="0ns"
--docker_store_dir="/tmp/Endpoint_SlaveEndpointTest_UnauthorizedRequest_1_IIfv2Z/store/docker"
--docker_volume_checkpoint_dir="/var/run/mesos/isolators/docker/volume" --enforce_container_disk_quota="false"
--executor_registration_timeout="1mins" --executor_reregistration_timeout="2secs" --executor_shutdown_grace_period="5secs"
--fetcher_cache_dir="/tmp/Endpoint_SlaveEndpointTest_UnauthorizedRequest_1_IIfv2Z/fetch" --fetcher_cache_size="2GB"
--fetcher_stall_timeout="1mins" --frameworks_home="" --gc_delay="1weeks" --gc_disk_headroom="0.1"
--hadoop_home="" --help="false" --hostname_lookup="true" --http_command_executor="false" --http_credentials="/tmp/Endpoint_SlaveEndpointTest_UnauthorizedRequest_1_IIfv2Z/http_credentials"
--http_heartbeat_interval="30secs" --initialize_driver_logging="true" --isolation="posix/cpu,posix/mem"
--launcher="posix" --launcher_dir="/tmp/SRC/build/mesos-1.6.0/_build/sub/src" --logbufsecs="0"
--logging_level="INFO" --max_completed_executors_per_framework="150" --oversubscribed_resources_interval="15secs"
--perf_duration="10secs" --perf_interval="1mins" --port="5051" --qos_correction_interval_min="0ns"
--quiet="false" --reconfiguration_policy="equal" --recover="reconnect" --recovery_timeout="15mins"
--registration_backoff_factor="10ms" --resources="cpus:2;gpus:0;mem:1024;disk:1024;ports:[31000-32000]"
--revocable_cpu_low_priority="true" --runtime_dir="/tmp/Endpoint_SlaveEndpointTest_UnauthorizedRequest_1_IIfv2Z"
--sandbox_directory="/mnt/mesos/sandbox" --strict="true" --switch_user="true" --systemd_enable_support="true"
--systemd_runtime_directory="/run/systemd/system" --version="false" --work_dir="/tmp/Endpoint_SlaveEndpointTest_UnauthorizedRequest_1_Muv6ln"
--zk_session_timeout="10secs"
I0403 22:59:55.844676   481 credentials.hpp:86] Loading credential for authentication from
'/tmp/Endpoint_SlaveEndpointTest_UnauthorizedRequest_1_IIfv2Z/credential'
I0403 22:59:55.844856   481 slave.cpp:296] Agent using credential for: test-principal
I0403 22:59:55.844879   481 credentials.hpp:37] Loading credentials for authentication from
'/tmp/Endpoint_SlaveEndpointTest_UnauthorizedRequest_1_IIfv2Z/http_credentials'
I0403 22:59:55.845178   481 http.cpp:959] Creating default 'basic' HTTP authenticator for
realm 'mesos-agent-readonly'
I0403 22:59:55.846765   481 slave.cpp:613] Agent resources: [{"name":"cpus","scalar":{"value":2.0},"type":"SCALAR"},{"name":"mem","scalar":{"value":1024.0},"type":"SCALAR"},{"name":"disk","scalar":{"value":1024.0},"type":"SCALAR"},{"name":"ports","ranges":{"range":[{"begin":31000,"end":32000}]},"type":"RANGES"}]
I0403 22:59:55.846974   481 slave.cpp:621] Agent attributes: [  ]
I0403 22:59:55.846997   481 slave.cpp:630] Agent hostname: 0212907dc323
I0403 22:59:55.847182   485 task_status_update_manager.cpp:181] Pausing sending task status
updates
I0403 22:59:55.848668   483 state.cpp:66] Recovering state from '/tmp/Endpoint_SlaveEndpointTest_UnauthorizedRequest_1_Muv6ln/meta'
I0403 22:59:55.848969   482 task_status_update_manager.cpp:207] Recovering task status update
manager
I0403 22:59:55.849236   484 containerizer.cpp:674] Recovering containerizer
I0403 22:59:55.850986   487 provisioner.cpp:495] Provisioner recovery complete
I0403 22:59:55.851408   482 slave.cpp:7220] Finished recovery
I0403 22:59:55.854801   486 process.cpp:3564] Handling HTTP event for process 'slave(952)'
with path: '/slave(952)/monitor/statistics.json'
I0403 22:59:55.856413   490 http.cpp:1099] HTTP GET for /slave(952)/monitor/statistics.json
from 172.17.0.2:34836
I0403 22:59:55.856492   490 http.cpp:936] Authorizing principal 'test-principal' to GET the
'/monitor/statistics.json' endpoint
I0403 22:59:55.858297   485 slave.cpp:923] Agent terminating
[       OK ] Endpoint/SlaveEndpointTest.UnauthorizedRequest/1 (33 ms)
[ RUN      ] Endpoint/SlaveEndpointTest.UnauthorizedRequest/2
I0403 22:59:55.872112   474 containerizer.cpp:304] Using isolation { environment_secret, posix/cpu,
posix/mem, filesystem/posix, network/cni }
W0403 22:59:55.872689   474 backend.cpp:76] Failed to create 'aufs' backend: AufsBackend requires
root privileges
W0403 22:59:55.872714   474 backend.cpp:76] Failed to create 'bind' backend: BindBackend requires
root privileges
I0403 22:59:55.872741   474 provisioner.cpp:299] Using default backend 'copy'
I0403 22:59:55.877038   484 slave.cpp:263] Mesos agent started on (953)@172.17.0.2:49681
I0403 22:59:55.877069   484 slave.cpp:264] Flags at startup: --acls="" --appc_simple_discovery_uri_prefix="http://"
--appc_store_dir="/tmp/Endpoint_SlaveEndpointTest_UnauthorizedRequest_2_AJNc4u/store/appc"
--authenticate_http_readonly="true" --authenticate_http_readwrite="false" --authenticatee="crammd5"
--authentication_backoff_factor="1secs" --authorizer="local" --cgroups_cpu_enable_pids_and_tids_count="false"
--cgroups_enable_cfs="false" --cgroups_hierarchy="/sys/fs/cgroup" --cgroups_limit_swap="false"
--cgroups_root="mesos" --container_disk_watch_interval="15secs" --containerizers="mesos" --credential="/tmp/Endpoint_SlaveEndpointTest_UnauthorizedRequest_2_AJNc4u/credential"
--default_role="*" --disallow_sharing_agent_pid_namespace="false" --disk_watch_interval="1mins"
--docker="docker" --docker_kill_orphans="true" --docker_registry="https://registry-1.docker.io"
--docker_remove_delay="6hrs" --docker_socket="/var/run/docker.sock" --docker_stop_timeout="0ns"
--docker_store_dir="/tmp/Endpoint_SlaveEndpointTest_UnauthorizedRequest_2_AJNc4u/store/docker"
--docker_volume_checkpoint_dir="/var/run/mesos/isolators/docker/volume" --enforce_container_disk_quota="false"
--executor_registration_timeout="1mins" --executor_reregistration_timeout="2secs" --executor_shutdown_grace_period="5secs"
--fetcher_cache_dir="/tmp/Endpoint_SlaveEndpointTest_UnauthorizedRequest_2_AJNc4u/fetch" --fetcher_cache_size="2GB"
--fetcher_stall_timeout="1mins" --frameworks_home="" --gc_delay="1weeks" --gc_disk_headroom="0.1"
--hadoop_home="" --help="false" --hostname_lookup="true" --http_command_executor="false" --http_credentials="/tmp/Endpoint_SlaveEndpointTest_UnauthorizedRequest_2_AJNc4u/http_credentials"
--http_heartbeat_interval="30secs" --initialize_driver_logging="true" --isolation="posix/cpu,posix/mem"
--launcher="posix" --launcher_dir="/tmp/SRC/build/mesos-1.6.0/_build/sub/src" --logbufsecs="0"
--logging_level="INFO" --max_completed_executors_per_framework="150" --oversubscribed_resources_interval="15secs"
--perf_duration="10secs" --perf_interval="1mins" --port="5051" --qos_correction_interval_min="0ns"
--quiet="false" --reconfiguration_policy="equal" --recover="reconnect" --recovery_timeout="15mins"
--registration_backoff_factor="10ms" --resources="cpus:2;gpus:0;mem:1024;disk:1024;ports:[31000-32000]"
--revocable_cpu_low_priority="true" --runtime_dir="/tmp/Endpoint_SlaveEndpointTest_UnauthorizedRequest_2_AJNc4u"
--sandbox_directory="/mnt/mesos/sandbox" --strict="true" --switch_user="true" --systemd_enable_support="true"
--systemd_runtime_directory="/run/systemd/system" --version="false" --work_dir="/tmp/Endpoint_SlaveEndpointTest_UnauthorizedRequest_2_cLNsiS"
--zk_session_timeout="10secs"
I0403 22:59:55.877640   484 credentials.hpp:86] Loading credential for authentication from
'/tmp/Endpoint_SlaveEndpointTest_UnauthorizedRequest_2_AJNc4u/credential'
I0403 22:59:55.895104   484 slave.cpp:296] Agent using credential for: test-principal
I0403 22:59:55.895130   484 credentials.hpp:37] Loading credentials for authentication from
'/tmp/Endpoint_SlaveEndpointTest_UnauthorizedRequest_2_AJNc4u/http_credentials'
I0403 22:59:55.895434   484 http.cpp:959] Creating default 'basic' HTTP authenticator for
realm 'mesos-agent-readonly'
I0403 22:59:55.897042   484 slave.cpp:613] Agent resources: [{"name":"cpus","scalar":{"value":2.0},"type":"SCALAR"},{"name":"mem","scalar":{"value":1024.0},"type":"SCALAR"},{"name":"disk","scalar":{"value":1024.0},"type":"SCALAR"},{"name":"ports","ranges":{"range":[{"begin":31000,"end":32000}]},"type":"RANGES"}]
I0403 22:59:55.897336   484 slave.cpp:621] Agent attributes: [  ]
I0403 22:59:55.897357   484 slave.cpp:630] Agent hostname: 0212907dc323
I0403 22:59:55.897513   483 task_status_update_manager.cpp:181] Pausing sending task status
updates
I0403 22:59:55.899278   481 state.cpp:66] Recovering state from '/tmp/Endpoint_SlaveEndpointTest_UnauthorizedRequest_2_cLNsiS/meta'
I0403 22:59:55.899670   482 task_status_update_manager.cpp:207] Recovering task status update
manager
I0403 22:59:55.899902   477 containerizer.cpp:674] Recovering containerizer
I0403 22:59:55.901480   479 provisioner.cpp:495] Provisioner recovery complete
I0403 22:59:55.901921   481 slave.cpp:7220] Finished recovery
I0403 22:59:55.905520   485 process.cpp:3564] Handling HTTP event for process 'slave(953)'
with path: '/slave(953)/containers'
I0403 22:59:55.907238   481 http.cpp:1099] HTTP GET for /slave(953)/containers from 172.17.0.2:34841
I0403 22:59:55.907323   481 http.cpp:936] Authorizing principal 'test-principal' to GET the
'/containers' endpoint
I0403 22:59:55.909121   474 slave.cpp:923] Agent terminating
[       OK ] Endpoint/SlaveEndpointTest.UnauthorizedRequest/2 (51 ms)
[ RUN      ] Endpoint/SlaveEndpointTest.NoAuthorizer/0
I0403 22:59:55.923071   474 containerizer.cpp:304] Using isolation { environment_secret, posix/cpu,
posix/mem, filesystem/posix, network/cni }
W0403 22:59:55.923583   474 backend.cpp:76] Failed to create 'aufs' backend: AufsBackend requires
root privileges
W0403 22:59:55.923612   474 backend.cpp:76] Failed to create 'bind' backend: BindBackend requires
root privileges
I0403 22:59:55.923638   474 provisioner.cpp:299] Using default backend 'copy'
I0403 22:59:55.925609   474 cluster.cpp:460] Creating default 'local' authorizer
I0403 22:59:55.928124   485 slave.cpp:263] Mesos agent started on (954)@172.17.0.2:49681
I0403 22:59:55.928150   485 slave.cpp:264] Flags at startup: --acls="" --appc_simple_discovery_uri_prefix="http://"
--appc_store_dir="/tmp/Endpoint_SlaveEndpointTest_NoAuthorizer_0_ADsFwZ/store/appc" --authenticate_http_readonly="true"
--authenticate_http_readwrite="false" --authenticatee="crammd5" --authentication_backoff_factor="1secs"
--authorizer="local" --cgroups_cpu_enable_pids_and_tids_count="false" --cgroups_enable_cfs="false"
--cgroups_hierarchy="/sys/fs/cgroup" --cgroups_limit_swap="false" --cgroups_root="mesos" --container_disk_watch_interval="15secs"
--containerizers="mesos" --credential="/tmp/Endpoint_SlaveEndpointTest_NoAuthorizer_0_ADsFwZ/credential"
--default_role="*" --disallow_sharing_agent_pid_namespace="false" --disk_watch_interval="1mins"
--docker="docker" --docker_kill_orphans="true" --docker_registry="https://registry-1.docker.io"
--docker_remove_delay="6hrs" --docker_socket="/var/run/docker.sock" --docker_stop_timeout="0ns"
--docker_store_dir="/tmp/Endpoint_SlaveEndpointTest_NoAuthorizer_0_ADsFwZ/store/docker" --docker_volume_checkpoint_dir="/var/run/mesos/isolators/docker/volume"
--enforce_container_disk_quota="false" --executor_registration_timeout="1mins" --executor_reregistration_timeout="2secs"
--executor_shutdown_grace_period="5secs" --fetcher_cache_dir="/tmp/Endpoint_SlaveEndpointTest_NoAuthorizer_0_ADsFwZ/fetch"
--fetcher_cache_size="2GB" --fetcher_stall_timeout="1mins" --frameworks_home="" --gc_delay="1weeks"
--gc_disk_headroom="0.1" --hadoop_home="" --help="false" --hostname_lookup="true" --http_command_executor="false"
--http_credentials="/tmp/Endpoint_SlaveEndpointTest_NoAuthorizer_0_ADsFwZ/http_credentials"
--http_heartbeat_interval="30secs" --initialize_driver_logging="true" --isolation="posix/cpu,posix/mem"
--launcher="posix" --launcher_dir="/tmp/SRC/build/mesos-1.6.0/_build/sub/src" --logbufsecs="0"
--logging_level="INFO" --max_completed_executors_per_framework="150" --oversubscribed_resources_interval="15secs"
--perf_duration="10secs" --perf_interval="1mins" --port="5051" --qos_correction_interval_min="0ns"
--quiet="false" --reconfiguration_policy="equal" --recover="reconnect" --recovery_timeout="15mins"
--registration_backoff_factor="10ms" --resources="cpus:2;gpus:0;mem:1024;disk:1024;ports:[31000-32000]"
--revocable_cpu_low_priority="true" --runtime_dir="/tmp/Endpoint_SlaveEndpointTest_NoAuthorizer_0_ADsFwZ"
--sandbox_directory="/mnt/mesos/sandbox" --strict="true" --switch_user="true" --systemd_enable_support="true"
--systemd_runtime_directory="/run/systemd/system" --version="false" --work_dir="/tmp/Endpoint_SlaveEndpointTest_NoAuthorizer_0_sfwHCm"
--zk_session_timeout="10secs"
I0403 22:59:55.928526   485 credentials.hpp:86] Loading credential for authentication from
'/tmp/Endpoint_SlaveEndpointTest_NoAuthorizer_0_ADsFwZ/credential'
I0403 22:59:55.945371   485 slave.cpp:296] Agent using credential for: test-principal
I0403 22:59:55.945399   485 credentials.hpp:37] Loading credentials for authentication from
'/tmp/Endpoint_SlaveEndpointTest_NoAuthorizer_0_ADsFwZ/http_credentials'
I0403 22:59:55.945622   485 http.cpp:959] Creating default 'basic' HTTP authenticator for
realm 'mesos-agent-readonly'
I0403 22:59:55.947181   485 slave.cpp:613] Agent resources: [{"name":"cpus","scalar":{"value":2.0},"type":"SCALAR"},{"name":"mem","scalar":{"value":1024.0},"type":"SCALAR"},{"name":"disk","scalar":{"value":1024.0},"type":"SCALAR"},{"name":"ports","ranges":{"range":[{"begin":31000,"end":32000}]},"type":"RANGES"}]
I0403 22:59:55.947393   485 slave.cpp:621] Agent attributes: [  ]
I0403 22:59:55.947417   485 slave.cpp:630] Agent hostname: 0212907dc323
I0403 22:59:55.947573   478 task_status_update_manager.cpp:181] Pausing sending task status
updates
I0403 22:59:55.949018   488 state.cpp:66] Recovering state from '/tmp/Endpoint_SlaveEndpointTest_NoAuthorizer_0_sfwHCm/meta'
I0403 22:59:55.949407   476 task_status_update_manager.cpp:207] Recovering task status update
manager
I0403 22:59:55.949704   484 containerizer.cpp:674] Recovering containerizer
I0403 22:59:55.951230   488 provisioner.cpp:495] Provisioner recovery complete
I0403 22:59:55.951624   480 slave.cpp:7220] Finished recovery
I0403 22:59:55.955338   488 process.cpp:3564] Handling HTTP event for process 'slave(954)'
with path: '/slave(954)/monitor/statistics'
I0403 22:59:55.959352   490 http.cpp:1099] HTTP GET for /slave(954)/monitor/statistics from
172.17.0.2:34846
I0403 22:59:55.959452   490 http.cpp:936] Authorizing principal 'test-principal' to GET the
'/monitor/statistics' endpoint
I0403 22:59:55.962859   474 slave.cpp:923] Agent terminating
[       OK ] Endpoint/SlaveEndpointTest.NoAuthorizer/0 (70 ms)
[ RUN      ] Endpoint/SlaveEndpointTest.NoAuthorizer/1
I0403 22:59:55.993970   474 containerizer.cpp:304] Using isolation { environment_secret, posix/cpu,
posix/mem, filesystem/posix, network/cni }
W0403 22:59:55.994518   474 backend.cpp:76] Failed to create 'aufs' backend: AufsBackend requires
root privileges
W0403 22:59:55.994544   474 backend.cpp:76] Failed to create 'bind' backend: BindBackend requires
root privileges
I0403 22:59:55.994571   474 provisioner.cpp:299] Using default backend 'copy'
I0403 22:59:55.996803   474 cluster.cpp:460] Creating default 'local' authorizer
I0403 22:59:55.999289   489 slave.cpp:263] Mesos agent started on (955)@172.17.0.2:49681
I0403 22:59:55.999331   489 slave.cpp:264] Flags at startup: --acls="" --appc_simple_discovery_uri_prefix="http://"
--appc_store_dir="/tmp/Endpoint_SlaveEndpointTest_NoAuthorizer_1_qLFLLv/store/appc" --authenticate_http_readonly="true"
--authenticate_http_readwrite="false" --authenticatee="crammd5" --authentication_backoff_factor="1secs"
--authorizer="local" --cgroups_cpu_enable_pids_and_tids_count="false" --cgroups_enable_cfs="false"
--cgroups_hierarchy="/sys/fs/cgroup" --cgroups_limit_swap="false" --cgroups_root="mesos" --container_disk_watch_interval="15secs"
--containerizers="mesos" --credential="/tmp/Endpoint_SlaveEndpointTest_NoAuthorizer_1_qLFLLv/credential"
--default_role="*" --disallow_sharing_agent_pid_namespace="false" --disk_watch_interval="1mins"
--docker="docker" --docker_kill_orphans="true" --docker_registry="https://registry-1.docker.io"
--docker_remove_delay="6hrs" --docker_socket="/var/run/docker.sock" --docker_stop_timeout="0ns"
--docker_store_dir="/tmp/Endpoint_SlaveEndpointTest_NoAuthorizer_1_qLFLLv/store/docker" --docker_volume_checkpoint_dir="/var/run/mesos/isolators/docker/volume"
--enforce_container_disk_quota="false" --executor_registration_timeout="1mins" --executor_reregistration_timeout="2secs"
--executor_shutdown_grace_period="5secs" --fetcher_cache_dir="/tmp/Endpoint_SlaveEndpointTest_NoAuthorizer_1_qLFLLv/fetch"
--fetcher_cache_size="2GB" --fetcher_stall_timeout="1mins" --frameworks_home="" --gc_delay="1weeks"
--gc_disk_headroom="0.1" --hadoop_home="" --help="false" --hostname_lookup="true" --http_command_executor="false"
--http_credentials="/tmp/Endpoint_SlaveEndpointTest_NoAuthorizer_1_qLFLLv/http_credentials"
--http_heartbeat_interval="30secs" --initialize_driver_logging="true" --isolation="posix/cpu,posix/mem"
--launcher="posix" --launcher_dir="/tmp/SRC/build/mesos-1.6.0/_build/sub/src" --logbufsecs="0"
--logging_level="INFO" --max_completed_executors_per_framework="150" --oversubscribed_resources_interval="15secs"
--perf_duration="10secs" --perf_interval="1mins" --port="5051" --qos_correction_interval_min="0ns"
--quiet="false" --reconfiguration_policy="equal" --recover="reconnect" --recovery_timeout="15mins"
--registration_backoff_factor="10ms" --resources="cpus:2;gpus:0;mem:1024;disk:1024;ports:[31000-32000]"
--revocable_cpu_low_priority="true" --runtime_dir="/tmp/Endpoint_SlaveEndpointTest_NoAuthorizer_1_qLFLLv"
--sandbox_directory="/mnt/mesos/sandbox" --strict="true" --switch_user="true" --systemd_enable_support="true"
--systemd_runtime_directory="/run/systemd/system" --version="false" --work_dir="/tmp/Endpoint_SlaveEndpointTest_NoAuthorizer_1_uY5jGS"
--zk_session_timeout="10secs"
I0403 22:59:55.999799   489 credentials.hpp:86] Loading credential for authentication from
'/tmp/Endpoint_SlaveEndpointTest_NoAuthorizer_1_qLFLLv/credential'
I0403 22:59:55.999989   489 slave.cpp:296] Agent using credential for: test-principal
I0403 22:59:56.000010   489 credentials.hpp:37] Loading credentials for authentication from
'/tmp/Endpoint_SlaveEndpointTest_NoAuthorizer_1_qLFLLv/http_credentials'
I0403 22:59:56.000267   489 http.cpp:959] Creating default 'basic' HTTP authenticator for
realm 'mesos-agent-readonly'
I0403 22:59:56.002001   489 slave.cpp:613] Agent resources: [{"name":"cpus","scalar":{"value":2.0},"type":"SCALAR"},{"name":"mem","scalar":{"value":1024.0},"type":"SCALAR"},{"name":"disk","scalar":{"value":1024.0},"type":"SCALAR"},{"name":"ports","ranges":{"range":[{"begin":31000,"end":32000}]},"type":"RANGES"}]
I0403 22:59:56.002215   489 slave.cpp:621] Agent attributes: [  ]
I0403 22:59:56.002228   489 slave.cpp:630] Agent hostname: 0212907dc323
I0403 22:59:56.002368   478 task_status_update_manager.cpp:181] Pausing sending task status
updates
I0403 22:59:56.003988   488 state.cpp:66] Recovering state from '/tmp/Endpoint_SlaveEndpointTest_NoAuthorizer_1_uY5jGS/meta'
I0403 22:59:56.004442   482 task_status_update_manager.cpp:207] Recovering task status update
manager
I0403 22:59:56.004689   490 containerizer.cpp:674] Recovering containerizer
I0403 22:59:56.006412   485 provisioner.cpp:495] Provisioner recovery complete
I0403 22:59:56.006805   486 slave.cpp:7220] Finished recovery
I0403 22:59:56.010450   483 process.cpp:3564] Handling HTTP event for process 'slave(955)'
with path: '/slave(955)/monitor/statistics.json'
I0403 22:59:56.012245   475 http.cpp:1099] HTTP GET for /slave(955)/monitor/statistics.json
from 172.17.0.2:34851
I0403 22:59:56.012328   475 http.cpp:936] Authorizing principal 'test-principal' to GET the
'/monitor/statistics.json' endpoint
I0403 22:59:56.015496   474 slave.cpp:923] Agent terminating
[       OK ] Endpoint/SlaveEndpointTest.NoAuthorizer/1 (35 ms)
[ RUN      ] Endpoint/SlaveEndpointTest.NoAuthorizer/2
I0403 22:59:56.031060   474 containerizer.cpp:304] Using isolation { environment_secret, posix/cpu,
posix/mem, filesystem/posix, network/cni }
W0403 22:59:56.031644   474 backend.cpp:76] Failed to create 'aufs' backend: AufsBackend requires
root privileges
W0403 22:59:56.031669   474 backend.cpp:76] Failed to create 'bind' backend: BindBackend requires
root privileges
I0403 22:59:56.031707   474 provisioner.cpp:299] Using default backend 'copy'
I0403 22:59:56.033900   474 cluster.cpp:460] Creating default 'local' authorizer
I0403 22:59:56.036383   484 slave.cpp:263] Mesos agent started on (956)@172.17.0.2:49681
I0403 22:59:56.036409   484 slave.cpp:264] Flags at startup: --acls="" --appc_simple_discovery_uri_prefix="http://"
--appc_store_dir="/tmp/Endpoint_SlaveEndpointTest_NoAuthorizer_2_A9kSr2/store/appc" --authenticate_http_readonly="true"
--authenticate_http_readwrite="false" --authenticatee="crammd5" --authentication_backoff_factor="1secs"
--authorizer="local" --cgroups_cpu_enable_pids_and_tids_count="false" --cgroups_enable_cfs="false"
--cgroups_hierarchy="/sys/fs/cgroup" --cgroups_limit_swap="false" --cgroups_root="mesos" --container_disk_watch_interval="15secs"
--containerizers="mesos" --credential="/tmp/Endpoint_SlaveEndpointTest_NoAuthorizer_2_A9kSr2/credential"
--default_role="*" --disallow_sharing_agent_pid_namespace="false" --disk_watch_interval="1mins"
--docker="docker" --docker_kill_orphans="true" --docker_registry="https://registry-1.docker.io"
--docker_remove_delay="6hrs" --docker_socket="/var/run/docker.sock" --docker_stop_timeout="0ns"
--docker_store_dir="/tmp/Endpoint_SlaveEndpointTest_NoAuthorizer_2_A9kSr2/store/docker" --docker_volume_checkpoint_dir="/var/run/mesos/isolators/docker/volume"
--enforce_container_disk_quota="false" --executor_registration_timeout="1mins" --executor_reregistration_timeout="2secs"
--executor_shutdown_grace_period="5secs" --fetcher_cache_dir="/tmp/Endpoint_SlaveEndpointTest_NoAuthorizer_2_A9kSr2/fetch"
--fetcher_cache_size="2GB" --fetcher_stall_timeout="1mins" --frameworks_home="" --gc_delay="1weeks"
--gc_disk_headroom="0.1" --hadoop_home="" --help="false" --hostname_lookup="true" --http_command_executor="false"
--http_credentials="/tmp/Endpoint_SlaveEndpointTest_NoAuthorizer_2_A9kSr2/http_credentials"
--http_heartbeat_interval="30secs" --initialize_driver_logging="true" --isolation="posix/cpu,posix/mem"
--launcher="posix" --launcher_dir="/tmp/SRC/build/mesos-1.6.0/_build/sub/src" --logbufsecs="0"
--logging_level="INFO" --max_completed_executors_per_framework="150" --oversubscribed_resources_interval="15secs"
--perf_duration="10secs" --perf_interval="1mins" --port="5051" --qos_correction_interval_min="0ns"
--quiet="false" --reconfiguration_policy="equal" --recover="reconnect" --recovery_timeout="15mins"
--registration_backoff_factor="10ms" --resources="cpus:2;gpus:0;mem:1024;disk:1024;ports:[31000-32000]"
--revocable_cpu_low_priority="true" --runtime_dir="/tmp/Endpoint_SlaveEndpointTest_NoAuthorizer_2_A9kSr2"
--sandbox_directory="/mnt/mesos/sandbox" --strict="true" --switch_user="true" --systemd_enable_support="true"
--systemd_runtime_directory="/run/systemd/system" --version="false" --work_dir="/tmp/Endpoint_SlaveEndpointTest_NoAuthorizer_2_yoSpgp"
--zk_session_timeout="10secs"
I0403 22:59:56.036871   484 credentials.hpp:86] Loading credential for authentication from
'/tmp/Endpoint_SlaveEndpointTest_NoAuthorizer_2_A9kSr2/credential'
I0403 22:59:56.037045   484 slave.cpp:296] Agent using credential for: test-principal
I0403 22:59:56.037070   484 credentials.hpp:37] Loading credentials for authentication from
'/tmp/Endpoint_SlaveEndpointTest_NoAuthorizer_2_A9kSr2/http_credentials'
I0403 22:59:56.037441   484 http.cpp:959] Creating default 'basic' HTTP authenticator for
realm 'mesos-agent-readonly'
I0403 22:59:56.038981   484 slave.cpp:613] Agent resources: [{"name":"cpus","scalar":{"value":2.0},"type":"SCALAR"},{"name":"mem","scalar":{"value":1024.0},"type":"SCALAR"},{"name":"disk","scalar":{"value":1024.0},"type":"SCALAR"},{"name":"ports","ranges":{"range":[{"begin":31000,"end":32000}]},"type":"RANGES"}]
I0403 22:59:56.039189   484 slave.cpp:621] Agent attributes: [  ]
I0403 22:59:56.039213   484 slave.cpp:630] Agent hostname: 0212907dc323
I0403 22:59:56.039407   485 task_status_update_manager.cpp:181] Pausing sending task status
updates
I0403 22:59:56.040796   489 state.cpp:66] Recovering state from '/tmp/Endpoint_SlaveEndpointTest_NoAuthorizer_2_yoSpgp/meta'
I0403 22:59:56.041136   490 task_status_update_manager.cpp:207] Recovering task status update
manager
I0403 22:59:56.041353   490 containerizer.cpp:674] Recovering containerizer
I0403 22:59:56.043102   489 provisioner.cpp:495] Provisioner recovery complete
I0403 22:59:56.043507   482 slave.cpp:7220] Finished recovery
I0403 22:59:56.047052   476 process.cpp:3564] Handling HTTP event for process 'slave(956)'
with path: '/slave(956)/containers'
I0403 22:59:56.048981   487 http.cpp:1099] HTTP GET for /slave(956)/containers from 172.17.0.2:34856
I0403 22:59:56.049065   487 http.cpp:936] Authorizing principal 'test-principal' to GET the
'/containers' endpoint
I0403 22:59:56.053198   479 slave.cpp:923] Agent terminating
[       OK ] Endpoint/SlaveEndpointTest.NoAuthorizer/2 (35 ms)
[----------] 9 tests from Endpoint/SlaveEndpointTest (365 ms total)

[----------] 2 tests from ContainerizerType/DefaultContainerDNSFlagTest
[ RUN      ] ContainerizerType/DefaultContainerDNSFlagTest.ValidateFlag/0
[       OK ] ContainerizerType/DefaultContainerDNSFlagTest.ValidateFlag/0 (9 ms)
[ RUN      ] ContainerizerType/DefaultContainerDNSFlagTest.ValidateFlag/1
[       OK ] ContainerizerType/DefaultContainerDNSFlagTest.ValidateFlag/1 (10 ms)
[----------] 2 tests from ContainerizerType/DefaultContainerDNSFlagTest (19 ms total)

[----------] Global test environment tear-down
[==========] 1886 tests from 193 test cases ran. (768148 ms total)
[  PASSED  ] 1885 tests.
[  FAILED  ] 1 test, listed below:
[  FAILED  ] MasterTest.LaunchCombinedOfferTest

 1 FAILED TEST
  YOU HAVE 21 DISABLED TESTS

I0403 22:59:56.137948   491 process.cpp:929] Stopped the socket accept loop
Makefile:14651: recipe for target 'check-local' failed
make[4]: *** [check-local] Error 1
make[4]: Leaving directory '/tmp/SRC/build/mesos-1.6.0/_build/sub/src'
Makefile:13784: recipe for target 'check-am' failed
make[3]: *** [check-am] Error 2
make[3]: Leaving directory '/tmp/SRC/build/mesos-1.6.0/_build/sub/src'
Makefile:13788: recipe for target 'check' failed
make[2]: *** [check] Error 2
make[2]: Leaving directory '/tmp/SRC/build/mesos-1.6.0/_build/sub/src'
Makefile:774: recipe for target 'check-recursive' failed
make[1]: *** [check-recursive] Error 1
make[1]: Leaving directory '/tmp/SRC/build/mesos-1.6.0/_build/sub'
Makefile:980: recipe for target 'distcheck' failed
make: *** [distcheck] Error 1
Untagged: mesos/mesos-build:ubuntu-16.04
Untagged: mesos/mesos-build@sha256:3643a2cc107ff04ee2d7628a48cff8bee6186b98bcaa5ce36f685d28d8b04dae
Deleted: sha256:df13eb8a4c4b15c8e09329265603b7fcacc7753bc731057e91c06554acab5a10
Build step 'Execute shell' marked build as failure


Mime
View raw message