mesos-builds mailing list archives

Site index · List index
Message view « Date » · « Thread »
Top « Date » · « Thread »
From Apache Jenkins Server <jenk...@builds.apache.org>
Subject Build failed in Jenkins: Mesos-Reviewbot #21845
Date Wed, 07 Mar 2018 00:35:30 GMT
See <https://builds.apache.org/job/Mesos-Reviewbot/21845/display/redirect?page=changes>

Changes:

[andrew] Windows: Removed `WTERMSIG` etc. signal macros from `windows.hpp`.

[andrew] Windows: Removed `AwaitAssertSignaled` etc. from `gtest.hpp`.

[andrew] Windows: Removed signal macros in `checks/checker_process.cpp`.

[andrew] Windows: Fixed `WIFEXITED` and `WIFSIGNALED` stubs.

[andrew] Changed `os::system()` to return `Option<int>` instead of `int`.

[andrew] Fixed Mesos since `os::system()` now returns an `Option<int>`.

[andrew] Changed `os::spawn()` to return `Option<int>` instead of `int`.

[andrew] Fixed Mesos since `os::spawn()` now returns an `Option<int>`.

------------------------------------------
[...truncated 36.87 MB...]
[ RUN      ] Endpoint/SlaveEndpointTest.AuthorizedRequest/1
I0307 00:35:21.302101   492 containerizer.cpp:304] Using isolation { environment_secret, posix/cpu,
posix/mem, filesystem/posix, network/cni }
W0307 00:35:21.302767   492 backend.cpp:76] Failed to create 'aufs' backend: AufsBackend requires
root privileges
W0307 00:35:21.302798   492 backend.cpp:76] Failed to create 'bind' backend: BindBackend requires
root privileges
I0307 00:35:21.302832   492 provisioner.cpp:299] Using default backend 'copy'
I0307 00:35:21.307705   494 slave.cpp:264] Mesos agent started on (1002)@172.17.0.2:37614
I0307 00:35:21.307730   494 slave.cpp:265] Flags at startup: --acls="" --appc_simple_discovery_uri_prefix="http://"
--appc_store_dir="/tmp/Endpoint_SlaveEndpointTest_AuthorizedRequest_1_780COK/store/appc" --authenticate_http_readonly="true"
--authenticate_http_readwrite="false" --authenticatee="crammd5" --authentication_backoff_factor="1secs"
--authorizer="local" --cgroups_cpu_enable_pids_and_tids_count="false" --cgroups_enable_cfs="false"
--cgroups_hierarchy="/sys/fs/cgroup" --cgroups_limit_swap="false" --cgroups_root="mesos" --container_disk_watch_interval="15secs"
--containerizers="mesos" --credential="/tmp/Endpoint_SlaveEndpointTest_AuthorizedRequest_1_780COK/credential"
--default_role="*" --disallow_sharing_agent_pid_namespace="false" --disk_watch_interval="1mins"
--docker="docker" --docker_kill_orphans="true" --docker_registry="https://registry-1.docker.io"
--docker_remove_delay="6hrs" --docker_socket="/var/run/docker.sock" --docker_stop_timeout="0ns"
--docker_store_dir="/tmp/Endpoint_SlaveEndpointTest_AuthorizedRequest_1_780COK/store/docker"
--docker_volume_checkpoint_dir="/var/run/mesos/isolators/docker/volume" --enforce_container_disk_quota="false"
--executor_registration_timeout="1mins" --executor_reregistration_timeout="2secs" --executor_shutdown_grace_period="5secs"
--fetcher_cache_dir="/tmp/Endpoint_SlaveEndpointTest_AuthorizedRequest_1_780COK/fetch" --fetcher_cache_size="2GB"
--frameworks_home="" --gc_delay="1weeks" --gc_disk_headroom="0.1" --hadoop_home="" --help="false"
--hostname_lookup="true" --http_command_executor="false" --http_credentials="/tmp/Endpoint_SlaveEndpointTest_AuthorizedRequest_1_780COK/http_credentials"
--http_heartbeat_interval="30secs" --initialize_driver_logging="true" --isolation="posix/cpu,posix/mem"
--launcher="posix" --launcher_dir="/tmp/SRC/build/mesos-1.6.0/_build/sub/src" --logbufsecs="0"
--logging_level="INFO" --max_completed_executors_per_framework="150" --oversubscribed_resources_interval="15secs"
--perf_duration="10secs" --perf_interval="1mins" --port="5051" --qos_correction_interval_min="0ns"
--quiet="false" --reconfiguration_policy="equal" --recover="reconnect" --recovery_timeout="15mins"
--registration_backoff_factor="10ms" --resources="cpus:2;gpus:0;mem:1024;disk:1024;ports:[31000-32000]"
--revocable_cpu_low_priority="true" --runtime_dir="/tmp/Endpoint_SlaveEndpointTest_AuthorizedRequest_1_780COK"
--sandbox_directory="/mnt/mesos/sandbox" --strict="true" --switch_user="true" --systemd_enable_support="true"
--systemd_runtime_directory="/run/systemd/system" --version="false" --work_dir="/tmp/Endpoint_SlaveEndpointTest_AuthorizedRequest_1_X6SHeI"
--zk_session_timeout="10secs"
I0307 00:35:21.308135   494 credentials.hpp:86] Loading credential for authentication from
'/tmp/Endpoint_SlaveEndpointTest_AuthorizedRequest_1_780COK/credential'
I0307 00:35:21.308313   494 slave.cpp:297] Agent using credential for: test-principal
I0307 00:35:21.308341   494 credentials.hpp:37] Loading credentials for authentication from
'/tmp/Endpoint_SlaveEndpointTest_AuthorizedRequest_1_780COK/http_credentials'
I0307 00:35:21.308625   494 http.cpp:1045] Creating default 'basic' HTTP authenticator for
realm 'mesos-agent-readonly'
I0307 00:35:21.310693   494 slave.cpp:614] Agent resources: [{"name":"cpus","scalar":{"value":2.0},"type":"SCALAR"},{"name":"mem","scalar":{"value":1024.0},"type":"SCALAR"},{"name":"disk","scalar":{"value":1024.0},"type":"SCALAR"},{"name":"ports","ranges":{"range":[{"begin":31000,"end":32000}]},"type":"RANGES"}]
I0307 00:35:21.310969   494 slave.cpp:622] Agent attributes: [  ]
I0307 00:35:21.310986   494 slave.cpp:631] Agent hostname: 6b9e519cc2ad
I0307 00:35:21.311205   505 task_status_update_manager.cpp:181] Pausing sending task status
updates
I0307 00:35:21.313004   503 state.cpp:66] Recovering state from '/tmp/Endpoint_SlaveEndpointTest_AuthorizedRequest_1_X6SHeI/meta'
I0307 00:35:21.313421   503 task_status_update_manager.cpp:207] Recovering task status update
manager
I0307 00:35:21.313776   508 containerizer.cpp:674] Recovering containerizer
I0307 00:35:21.315843   496 provisioner.cpp:495] Provisioner recovery complete
I0307 00:35:21.316431   498 slave.cpp:7217] Finished recovery
I0307 00:35:21.320207   493 process.cpp:3564] Handling HTTP event for process 'slave(1002)'
with path: '/slave(1002)/monitor/statistics.json'
I0307 00:35:21.322239   506 http.cpp:1185] HTTP GET for /slave(1002)/monitor/statistics.json
from 172.17.0.2:50138
I0307 00:35:21.322336   506 http.cpp:976] Authorizing principal 'test-principal' to GET the
'/monitor/statistics.json' endpoint
I0307 00:35:21.325676   492 slave.cpp:924] Agent terminating
[       OK ] Endpoint/SlaveEndpointTest.AuthorizedRequest/1 (41 ms)
[ RUN      ] Endpoint/SlaveEndpointTest.AuthorizedRequest/2
I0307 00:35:21.343022   492 containerizer.cpp:304] Using isolation { environment_secret, posix/cpu,
posix/mem, filesystem/posix, network/cni }
W0307 00:35:21.343554   492 backend.cpp:76] Failed to create 'aufs' backend: AufsBackend requires
root privileges
W0307 00:35:21.343580   492 backend.cpp:76] Failed to create 'bind' backend: BindBackend requires
root privileges
I0307 00:35:21.343608   492 provisioner.cpp:299] Using default backend 'copy'
I0307 00:35:21.347822   506 slave.cpp:264] Mesos agent started on (1003)@172.17.0.2:37614
I0307 00:35:21.347847   506 slave.cpp:265] Flags at startup: --acls="" --appc_simple_discovery_uri_prefix="http://"
--appc_store_dir="/tmp/Endpoint_SlaveEndpointTest_AuthorizedRequest_2_LPt8uV/store/appc" --authenticate_http_readonly="true"
--authenticate_http_readwrite="false" --authenticatee="crammd5" --authentication_backoff_factor="1secs"
--authorizer="local" --cgroups_cpu_enable_pids_and_tids_count="false" --cgroups_enable_cfs="false"
--cgroups_hierarchy="/sys/fs/cgroup" --cgroups_limit_swap="false" --cgroups_root="mesos" --container_disk_watch_interval="15secs"
--containerizers="mesos" --credential="/tmp/Endpoint_SlaveEndpointTest_AuthorizedRequest_2_LPt8uV/credential"
--default_role="*" --disallow_sharing_agent_pid_namespace="false" --disk_watch_interval="1mins"
--docker="docker" --docker_kill_orphans="true" --docker_registry="https://registry-1.docker.io"
--docker_remove_delay="6hrs" --docker_socket="/var/run/docker.sock" --docker_stop_timeout="0ns"
--docker_store_dir="/tmp/Endpoint_SlaveEndpointTest_AuthorizedRequest_2_LPt8uV/store/docker"
--docker_volume_checkpoint_dir="/var/run/mesos/isolators/docker/volume" --enforce_container_disk_quota="false"
--executor_registration_timeout="1mins" --executor_reregistration_timeout="2secs" --executor_shutdown_grace_period="5secs"
--fetcher_cache_dir="/tmp/Endpoint_SlaveEndpointTest_AuthorizedRequest_2_LPt8uV/fetch" --fetcher_cache_size="2GB"
--frameworks_home="" --gc_delay="1weeks" --gc_disk_headroom="0.1" --hadoop_home="" --help="false"
--hostname_lookup="true" --http_command_executor="false" --http_credentials="/tmp/Endpoint_SlaveEndpointTest_AuthorizedRequest_2_LPt8uV/http_credentials"
--http_heartbeat_interval="30secs" --initialize_driver_logging="true" --isolation="posix/cpu,posix/mem"
--launcher="posix" --launcher_dir="/tmp/SRC/build/mesos-1.6.0/_build/sub/src" --logbufsecs="0"
--logging_level="INFO" --max_completed_executors_per_framework="150" --oversubscribed_resources_interval="15secs"
--perf_duration="10secs" --perf_interval="1mins" --port="5051" --qos_correction_interval_min="0ns"
--quiet="false" --reconfiguration_policy="equal" --recover="reconnect" --recovery_timeout="15mins"
--registration_backoff_factor="10ms" --resources="cpus:2;gpus:0;mem:1024;disk:1024;ports:[31000-32000]"
--revocable_cpu_low_priority="true" --runtime_dir="/tmp/Endpoint_SlaveEndpointTest_AuthorizedRequest_2_LPt8uV"
--sandbox_directory="/mnt/mesos/sandbox" --strict="true" --switch_user="true" --systemd_enable_support="true"
--systemd_runtime_directory="/run/systemd/system" --version="false" --work_dir="/tmp/Endpoint_SlaveEndpointTest_AuthorizedRequest_2_pN9qOS"
--zk_session_timeout="10secs"
I0307 00:35:21.348302   506 credentials.hpp:86] Loading credential for authentication from
'/tmp/Endpoint_SlaveEndpointTest_AuthorizedRequest_2_LPt8uV/credential'
I0307 00:35:21.348500   506 slave.cpp:297] Agent using credential for: test-principal
I0307 00:35:21.348546   506 credentials.hpp:37] Loading credentials for authentication from
'/tmp/Endpoint_SlaveEndpointTest_AuthorizedRequest_2_LPt8uV/http_credentials'
I0307 00:35:21.348891   506 http.cpp:1045] Creating default 'basic' HTTP authenticator for
realm 'mesos-agent-readonly'
I0307 00:35:21.351027   506 slave.cpp:614] Agent resources: [{"name":"cpus","scalar":{"value":2.0},"type":"SCALAR"},{"name":"mem","scalar":{"value":1024.0},"type":"SCALAR"},{"name":"disk","scalar":{"value":1024.0},"type":"SCALAR"},{"name":"ports","ranges":{"range":[{"begin":31000,"end":32000}]},"type":"RANGES"}]
I0307 00:35:21.351312   506 slave.cpp:622] Agent attributes: [  ]
I0307 00:35:21.351342   506 slave.cpp:631] Agent hostname: 6b9e519cc2ad
I0307 00:35:21.351620   495 task_status_update_manager.cpp:181] Pausing sending task status
updates
I0307 00:35:21.353482   496 state.cpp:66] Recovering state from '/tmp/Endpoint_SlaveEndpointTest_AuthorizedRequest_2_pN9qOS/meta'
I0307 00:35:21.353891   496 task_status_update_manager.cpp:207] Recovering task status update
manager
I0307 00:35:21.354174   501 containerizer.cpp:674] Recovering containerizer
I0307 00:35:21.356412   494 provisioner.cpp:495] Provisioner recovery complete
I0307 00:35:21.356902   503 slave.cpp:7217] Finished recovery
I0307 00:35:21.360329   495 process.cpp:3564] Handling HTTP event for process 'slave(1003)'
with path: '/slave(1003)/containers'
I0307 00:35:21.362393   499 http.cpp:1185] HTTP GET for /slave(1003)/containers from 172.17.0.2:50139
I0307 00:35:21.362481   499 http.cpp:976] Authorizing principal 'test-principal' to GET the
'/containers' endpoint
I0307 00:35:21.367326   492 slave.cpp:924] Agent terminating
[       OK ] Endpoint/SlaveEndpointTest.AuthorizedRequest/2 (40 ms)
[ RUN      ] Endpoint/SlaveEndpointTest.UnauthorizedRequest/0
I0307 00:35:21.385179   492 containerizer.cpp:304] Using isolation { environment_secret, posix/cpu,
posix/mem, filesystem/posix, network/cni }
W0307 00:35:21.385833   492 backend.cpp:76] Failed to create 'aufs' backend: AufsBackend requires
root privileges
W0307 00:35:21.385864   492 backend.cpp:76] Failed to create 'bind' backend: BindBackend requires
root privileges
I0307 00:35:21.385897   492 provisioner.cpp:299] Using default backend 'copy'
I0307 00:35:21.390329   505 slave.cpp:264] Mesos agent started on (1004)@172.17.0.2:37614
I0307 00:35:21.390357   505 slave.cpp:265] Flags at startup: --acls="" --appc_simple_discovery_uri_prefix="http://"
--appc_store_dir="/tmp/Endpoint_SlaveEndpointTest_UnauthorizedRequest_0_vjioC6/store/appc"
--authenticate_http_readonly="true" --authenticate_http_readwrite="false" --authenticatee="crammd5"
--authentication_backoff_factor="1secs" --authorizer="local" --cgroups_cpu_enable_pids_and_tids_count="false"
--cgroups_enable_cfs="false" --cgroups_hierarchy="/sys/fs/cgroup" --cgroups_limit_swap="false"
--cgroups_root="mesos" --container_disk_watch_interval="15secs" --containerizers="mesos" --credential="/tmp/Endpoint_SlaveEndpointTest_UnauthorizedRequest_0_vjioC6/credential"
--default_role="*" --disallow_sharing_agent_pid_namespace="false" --disk_watch_interval="1mins"
--docker="docker" --docker_kill_orphans="true" --docker_registry="https://registry-1.docker.io"
--docker_remove_delay="6hrs" --docker_socket="/var/run/docker.sock" --docker_stop_timeout="0ns"
--docker_store_dir="/tmp/Endpoint_SlaveEndpointTest_UnauthorizedRequest_0_vjioC6/store/docker"
--docker_volume_checkpoint_dir="/var/run/mesos/isolators/docker/volume" --enforce_container_disk_quota="false"
--executor_registration_timeout="1mins" --executor_reregistration_timeout="2secs" --executor_shutdown_grace_period="5secs"
--fetcher_cache_dir="/tmp/Endpoint_SlaveEndpointTest_UnauthorizedRequest_0_vjioC6/fetch" --fetcher_cache_size="2GB"
--frameworks_home="" --gc_delay="1weeks" --gc_disk_headroom="0.1" --hadoop_home="" --help="false"
--hostname_lookup="true" --http_command_executor="false" --http_credentials="/tmp/Endpoint_SlaveEndpointTest_UnauthorizedRequest_0_vjioC6/http_credentials"
--http_heartbeat_interval="30secs" --initialize_driver_logging="true" --isolation="posix/cpu,posix/mem"
--launcher="posix" --launcher_dir="/tmp/SRC/build/mesos-1.6.0/_build/sub/src" --logbufsecs="0"
--logging_level="INFO" --max_completed_executors_per_framework="150" --oversubscribed_resources_interval="15secs"
--perf_duration="10secs" --perf_interval="1mins" --port="5051" --qos_correction_interval_min="0ns"
--quiet="false" --reconfiguration_policy="equal" --recover="reconnect" --recovery_timeout="15mins"
--registration_backoff_factor="10ms" --resources="cpus:2;gpus:0;mem:1024;disk:1024;ports:[31000-32000]"
--revocable_cpu_low_priority="true" --runtime_dir="/tmp/Endpoint_SlaveEndpointTest_UnauthorizedRequest_0_vjioC6"
--sandbox_directory="/mnt/mesos/sandbox" --strict="true" --switch_user="true" --systemd_enable_support="true"
--systemd_runtime_directory="/run/systemd/system" --version="false" --work_dir="/tmp/Endpoint_SlaveEndpointTest_UnauthorizedRequest_0_38rYO3"
--zk_session_timeout="10secs"
I0307 00:35:21.390910   505 credentials.hpp:86] Loading credential for authentication from
'/tmp/Endpoint_SlaveEndpointTest_UnauthorizedRequest_0_vjioC6/credential'
I0307 00:35:21.391115   505 slave.cpp:297] Agent using credential for: test-principal
I0307 00:35:21.391142   505 credentials.hpp:37] Loading credentials for authentication from
'/tmp/Endpoint_SlaveEndpointTest_UnauthorizedRequest_0_vjioC6/http_credentials'
I0307 00:35:21.391448   505 http.cpp:1045] Creating default 'basic' HTTP authenticator for
realm 'mesos-agent-readonly'
I0307 00:35:21.393579   505 slave.cpp:614] Agent resources: [{"name":"cpus","scalar":{"value":2.0},"type":"SCALAR"},{"name":"mem","scalar":{"value":1024.0},"type":"SCALAR"},{"name":"disk","scalar":{"value":1024.0},"type":"SCALAR"},{"name":"ports","ranges":{"range":[{"begin":31000,"end":32000}]},"type":"RANGES"}]
I0307 00:35:21.393862   505 slave.cpp:622] Agent attributes: [  ]
I0307 00:35:21.393878   505 slave.cpp:631] Agent hostname: 6b9e519cc2ad
I0307 00:35:21.394125   493 task_status_update_manager.cpp:181] Pausing sending task status
updates
I0307 00:35:21.395923   508 state.cpp:66] Recovering state from '/tmp/Endpoint_SlaveEndpointTest_UnauthorizedRequest_0_38rYO3/meta'
I0307 00:35:21.396234   500 task_status_update_manager.cpp:207] Recovering task status update
manager
I0307 00:35:21.396508   506 containerizer.cpp:674] Recovering containerizer
I0307 00:35:21.398464   508 provisioner.cpp:495] Provisioner recovery complete
I0307 00:35:21.399029   499 slave.cpp:7217] Finished recovery
I0307 00:35:21.402930   508 process.cpp:3564] Handling HTTP event for process 'slave(1004)'
with path: '/slave(1004)/monitor/statistics'
I0307 00:35:21.404917   499 http.cpp:1185] HTTP GET for /slave(1004)/monitor/statistics from
172.17.0.2:50140
I0307 00:35:21.405015   499 http.cpp:976] Authorizing principal 'test-principal' to GET the
'/monitor/statistics' endpoint
I0307 00:35:21.407232   508 slave.cpp:924] Agent terminating
[       OK ] Endpoint/SlaveEndpointTest.UnauthorizedRequest/0 (39 ms)
[ RUN      ] Endpoint/SlaveEndpointTest.UnauthorizedRequest/1
I0307 00:35:21.424681   492 containerizer.cpp:304] Using isolation { environment_secret, posix/cpu,
posix/mem, filesystem/posix, network/cni }
W0307 00:35:21.425132   492 backend.cpp:76] Failed to create 'aufs' backend: AufsBackend requires
root privileges
W0307 00:35:21.425156   492 backend.cpp:76] Failed to create 'bind' backend: BindBackend requires
root privileges
I0307 00:35:21.425179   492 provisioner.cpp:299] Using default backend 'copy'
I0307 00:35:21.429000   500 slave.cpp:264] Mesos agent started on (1005)@172.17.0.2:37614
I0307 00:35:21.429033   500 slave.cpp:265] Flags at startup: --acls="" --appc_simple_discovery_uri_prefix="http://"
--appc_store_dir="/tmp/Endpoint_SlaveEndpointTest_UnauthorizedRequest_1_tXzV9h/store/appc"
--authenticate_http_readonly="true" --authenticate_http_readwrite="false" --authenticatee="crammd5"
--authentication_backoff_factor="1secs" --authorizer="local" --cgroups_cpu_enable_pids_and_tids_count="false"
--cgroups_enable_cfs="false" --cgroups_hierarchy="/sys/fs/cgroup" --cgroups_limit_swap="false"
--cgroups_root="mesos" --container_disk_watch_interval="15secs" --containerizers="mesos" --credential="/tmp/Endpoint_SlaveEndpointTest_UnauthorizedRequest_1_tXzV9h/credential"
--default_role="*" --disallow_sharing_agent_pid_namespace="false" --disk_watch_interval="1mins"
--docker="docker" --docker_kill_orphans="true" --docker_registry="https://registry-1.docker.io"
--docker_remove_delay="6hrs" --docker_socket="/var/run/docker.sock" --docker_stop_timeout="0ns"
--docker_store_dir="/tmp/Endpoint_SlaveEndpointTest_UnauthorizedRequest_1_tXzV9h/store/docker"
--docker_volume_checkpoint_dir="/var/run/mesos/isolators/docker/volume" --enforce_container_disk_quota="false"
--executor_registration_timeout="1mins" --executor_reregistration_timeout="2secs" --executor_shutdown_grace_period="5secs"
--fetcher_cache_dir="/tmp/Endpoint_SlaveEndpointTest_UnauthorizedRequest_1_tXzV9h/fetch" --fetcher_cache_size="2GB"
--frameworks_home="" --gc_delay="1weeks" --gc_disk_headroom="0.1" --hadoop_home="" --help="false"
--hostname_lookup="true" --http_command_executor="false" --http_credentials="/tmp/Endpoint_SlaveEndpointTest_UnauthorizedRequest_1_tXzV9h/http_credentials"
--http_heartbeat_interval="30secs" --initialize_driver_logging="true" --isolation="posix/cpu,posix/mem"
--launcher="posix" --launcher_dir="/tmp/SRC/build/mesos-1.6.0/_build/sub/src" --logbufsecs="0"
--logging_level="INFO" --max_completed_executors_per_framework="150" --oversubscribed_resources_interval="15secs"
--perf_duration="10secs" --perf_interval="1mins" --port="5051" --qos_correction_interval_min="0ns"
--quiet="false" --reconfiguration_policy="equal" --recover="reconnect" --recovery_timeout="15mins"
--registration_backoff_factor="10ms" --resources="cpus:2;gpus:0;mem:1024;disk:1024;ports:[31000-32000]"
--revocable_cpu_low_priority="true" --runtime_dir="/tmp/Endpoint_SlaveEndpointTest_UnauthorizedRequest_1_tXzV9h"
--sandbox_directory="/mnt/mesos/sandbox" --strict="true" --switch_user="true" --systemd_enable_support="true"
--systemd_runtime_directory="/run/systemd/system" --version="false" --work_dir="/tmp/Endpoint_SlaveEndpointTest_UnauthorizedRequest_1_bWt2ff"
--zk_session_timeout="10secs"
I0307 00:35:21.429543   500 credentials.hpp:86] Loading credential for authentication from
'/tmp/Endpoint_SlaveEndpointTest_UnauthorizedRequest_1_tXzV9h/credential'
I0307 00:35:21.429726   500 slave.cpp:297] Agent using credential for: test-principal
I0307 00:35:21.429760   500 credentials.hpp:37] Loading credentials for authentication from
'/tmp/Endpoint_SlaveEndpointTest_UnauthorizedRequest_1_tXzV9h/http_credentials'
I0307 00:35:21.430083   500 http.cpp:1045] Creating default 'basic' HTTP authenticator for
realm 'mesos-agent-readonly'
I0307 00:35:21.432183   500 slave.cpp:614] Agent resources: [{"name":"cpus","scalar":{"value":2.0},"type":"SCALAR"},{"name":"mem","scalar":{"value":1024.0},"type":"SCALAR"},{"name":"disk","scalar":{"value":1024.0},"type":"SCALAR"},{"name":"ports","ranges":{"range":[{"begin":31000,"end":32000}]},"type":"RANGES"}]
I0307 00:35:21.432462   500 slave.cpp:622] Agent attributes: [  ]
I0307 00:35:21.432493   500 slave.cpp:631] Agent hostname: 6b9e519cc2ad
I0307 00:35:21.432670   506 task_status_update_manager.cpp:181] Pausing sending task status
updates
I0307 00:35:21.434381   505 state.cpp:66] Recovering state from '/tmp/Endpoint_SlaveEndpointTest_UnauthorizedRequest_1_bWt2ff/meta'
I0307 00:35:21.434834   497 task_status_update_manager.cpp:207] Recovering task status update
manager
I0307 00:35:21.435106   508 containerizer.cpp:674] Recovering containerizer
I0307 00:35:21.436945   505 provisioner.cpp:495] Provisioner recovery complete
I0307 00:35:21.437438   503 slave.cpp:7217] Finished recovery
I0307 00:35:21.441030   504 process.cpp:3564] Handling HTTP event for process 'slave(1005)'
with path: '/slave(1005)/monitor/statistics.json'
I0307 00:35:21.442610   496 http.cpp:1185] HTTP GET for /slave(1005)/monitor/statistics.json
from 172.17.0.2:50141
I0307 00:35:21.442708   496 http.cpp:976] Authorizing principal 'test-principal' to GET the
'/monitor/statistics.json' endpoint
I0307 00:35:21.444869   492 slave.cpp:924] Agent terminating
[       OK ] Endpoint/SlaveEndpointTest.UnauthorizedRequest/1 (36 ms)
[ RUN      ] Endpoint/SlaveEndpointTest.UnauthorizedRequest/2
I0307 00:35:21.461684   492 containerizer.cpp:304] Using isolation { environment_secret, posix/cpu,
posix/mem, filesystem/posix, network/cni }
W0307 00:35:21.462247   492 backend.cpp:76] Failed to create 'aufs' backend: AufsBackend requires
root privileges
W0307 00:35:21.462275   492 backend.cpp:76] Failed to create 'bind' backend: BindBackend requires
root privileges
I0307 00:35:21.462311   492 provisioner.cpp:299] Using default backend 'copy'
I0307 00:35:21.466699   494 slave.cpp:264] Mesos agent started on (1006)@172.17.0.2:37614
I0307 00:35:21.466728   494 slave.cpp:265] Flags at startup: --acls="" --appc_simple_discovery_uri_prefix="http://"
--appc_store_dir="/tmp/Endpoint_SlaveEndpointTest_UnauthorizedRequest_2_fmrI5t/store/appc"
--authenticate_http_readonly="true" --authenticate_http_readwrite="false" --authenticatee="crammd5"
--authentication_backoff_factor="1secs" --authorizer="local" --cgroups_cpu_enable_pids_and_tids_count="false"
--cgroups_enable_cfs="false" --cgroups_hierarchy="/sys/fs/cgroup" --cgroups_limit_swap="false"
--cgroups_root="mesos" --container_disk_watch_interval="15secs" --containerizers="mesos" --credential="/tmp/Endpoint_SlaveEndpointTest_UnauthorizedRequest_2_fmrI5t/credential"
--default_role="*" --disallow_sharing_agent_pid_namespace="false" --disk_watch_interval="1mins"
--docker="docker" --docker_kill_orphans="true" --docker_registry="https://registry-1.docker.io"
--docker_remove_delay="6hrs" --docker_socket="/var/run/docker.sock" --docker_stop_timeout="0ns"
--docker_store_dir="/tmp/Endpoint_SlaveEndpointTest_UnauthorizedRequest_2_fmrI5t/store/docker"
--docker_volume_checkpoint_dir="/var/run/mesos/isolators/docker/volume" --enforce_container_disk_quota="false"
--executor_registration_timeout="1mins" --executor_reregistration_timeout="2secs" --executor_shutdown_grace_period="5secs"
--fetcher_cache_dir="/tmp/Endpoint_SlaveEndpointTest_UnauthorizedRequest_2_fmrI5t/fetch" --fetcher_cache_size="2GB"
--frameworks_home="" --gc_delay="1weeks" --gc_disk_headroom="0.1" --hadoop_home="" --help="false"
--hostname_lookup="true" --http_command_executor="false" --http_credentials="/tmp/Endpoint_SlaveEndpointTest_UnauthorizedRequest_2_fmrI5t/http_credentials"
--http_heartbeat_interval="30secs" --initialize_driver_logging="true" --isolation="posix/cpu,posix/mem"
--launcher="posix" --launcher_dir="/tmp/SRC/build/mesos-1.6.0/_build/sub/src" --logbufsecs="0"
--logging_level="INFO" --max_completed_executors_per_framework="150" --oversubscribed_resources_interval="15secs"
--perf_duration="10secs" --perf_interval="1mins" --port="5051" --qos_correction_interval_min="0ns"
--quiet="false" --reconfiguration_policy="equal" --recover="reconnect" --recovery_timeout="15mins"
--registration_backoff_factor="10ms" --resources="cpus:2;gpus:0;mem:1024;disk:1024;ports:[31000-32000]"
--revocable_cpu_low_priority="true" --runtime_dir="/tmp/Endpoint_SlaveEndpointTest_UnauthorizedRequest_2_fmrI5t"
--sandbox_directory="/mnt/mesos/sandbox" --strict="true" --switch_user="true" --systemd_enable_support="true"
--systemd_runtime_directory="/run/systemd/system" --version="false" --work_dir="/tmp/Endpoint_SlaveEndpointTest_UnauthorizedRequest_2_ZtCO5q"
--zk_session_timeout="10secs"
I0307 00:35:21.467262   494 credentials.hpp:86] Loading credential for authentication from
'/tmp/Endpoint_SlaveEndpointTest_UnauthorizedRequest_2_fmrI5t/credential'
I0307 00:35:21.467463   494 slave.cpp:297] Agent using credential for: test-principal
I0307 00:35:21.467491   494 credentials.hpp:37] Loading credentials for authentication from
'/tmp/Endpoint_SlaveEndpointTest_UnauthorizedRequest_2_fmrI5t/http_credentials'
I0307 00:35:21.467828   494 http.cpp:1045] Creating default 'basic' HTTP authenticator for
realm 'mesos-agent-readonly'
I0307 00:35:21.469985   494 slave.cpp:614] Agent resources: [{"name":"cpus","scalar":{"value":2.0},"type":"SCALAR"},{"name":"mem","scalar":{"value":1024.0},"type":"SCALAR"},{"name":"disk","scalar":{"value":1024.0},"type":"SCALAR"},{"name":"ports","ranges":{"range":[{"begin":31000,"end":32000}]},"type":"RANGES"}]
I0307 00:35:21.470268   494 slave.cpp:622] Agent attributes: [  ]
I0307 00:35:21.470296   494 slave.cpp:631] Agent hostname: 6b9e519cc2ad
I0307 00:35:21.470513   495 task_status_update_manager.cpp:181] Pausing sending task status
updates
I0307 00:35:21.472321   508 state.cpp:66] Recovering state from '/tmp/Endpoint_SlaveEndpointTest_UnauthorizedRequest_2_ZtCO5q/meta'
I0307 00:35:21.472708   499 task_status_update_manager.cpp:207] Recovering task status update
manager
I0307 00:35:21.472996   501 containerizer.cpp:674] Recovering containerizer
I0307 00:35:21.474987   508 provisioner.cpp:495] Provisioner recovery complete
I0307 00:35:21.475530   493 slave.cpp:7217] Finished recovery
I0307 00:35:21.479588   502 process.cpp:3564] Handling HTTP event for process 'slave(1006)'
with path: '/slave(1006)/containers'
I0307 00:35:21.481633   493 http.cpp:1185] HTTP GET for /slave(1006)/containers from 172.17.0.2:50142
I0307 00:35:21.481734   493 http.cpp:976] Authorizing principal 'test-principal' to GET the
'/containers' endpoint
I0307 00:35:21.483814   502 slave.cpp:924] Agent terminating
[       OK ] Endpoint/SlaveEndpointTest.UnauthorizedRequest/2 (38 ms)
[ RUN      ] Endpoint/SlaveEndpointTest.NoAuthorizer/0
I0307 00:35:21.501332   492 containerizer.cpp:304] Using isolation { environment_secret, posix/cpu,
posix/mem, filesystem/posix, network/cni }
W0307 00:35:21.501994   492 backend.cpp:76] Failed to create 'aufs' backend: AufsBackend requires
root privileges
W0307 00:35:21.502027   492 backend.cpp:76] Failed to create 'bind' backend: BindBackend requires
root privileges
I0307 00:35:21.502060   492 provisioner.cpp:299] Using default backend 'copy'
I0307 00:35:21.504472   492 cluster.cpp:460] Creating default 'local' authorizer
I0307 00:35:21.507613   493 slave.cpp:264] Mesos agent started on (1007)@172.17.0.2:37614
I0307 00:35:21.507643   493 slave.cpp:265] Flags at startup: --acls="" --appc_simple_discovery_uri_prefix="http://"
--appc_store_dir="/tmp/Endpoint_SlaveEndpointTest_NoAuthorizer_0_rTvDqG/store/appc" --authenticate_http_readonly="true"
--authenticate_http_readwrite="false" --authenticatee="crammd5" --authentication_backoff_factor="1secs"
--authorizer="local" --cgroups_cpu_enable_pids_and_tids_count="false" --cgroups_enable_cfs="false"
--cgroups_hierarchy="/sys/fs/cgroup" --cgroups_limit_swap="false" --cgroups_root="mesos" --container_disk_watch_interval="15secs"
--containerizers="mesos" --credential="/tmp/Endpoint_SlaveEndpointTest_NoAuthorizer_0_rTvDqG/credential"
--default_role="*" --disallow_sharing_agent_pid_namespace="false" --disk_watch_interval="1mins"
--docker="docker" --docker_kill_orphans="true" --docker_registry="https://registry-1.docker.io"
--docker_remove_delay="6hrs" --docker_socket="/var/run/docker.sock" --docker_stop_timeout="0ns"
--docker_store_dir="/tmp/Endpoint_SlaveEndpointTest_NoAuthorizer_0_rTvDqG/store/docker" --docker_volume_checkpoint_dir="/var/run/mesos/isolators/docker/volume"
--enforce_container_disk_quota="false" --executor_registration_timeout="1mins" --executor_reregistration_timeout="2secs"
--executor_shutdown_grace_period="5secs" --fetcher_cache_dir="/tmp/Endpoint_SlaveEndpointTest_NoAuthorizer_0_rTvDqG/fetch"
--fetcher_cache_size="2GB" --frameworks_home="" --gc_delay="1weeks" --gc_disk_headroom="0.1"
--hadoop_home="" --help="false" --hostname_lookup="true" --http_command_executor="false" --http_credentials="/tmp/Endpoint_SlaveEndpointTest_NoAuthorizer_0_rTvDqG/http_credentials"
--http_heartbeat_interval="30secs" --initialize_driver_logging="true" --isolation="posix/cpu,posix/mem"
--launcher="posix" --launcher_dir="/tmp/SRC/build/mesos-1.6.0/_build/sub/src" --logbufsecs="0"
--logging_level="INFO" --max_completed_executors_per_framework="150" --oversubscribed_resources_interval="15secs"
--perf_duration="10secs" --perf_interval="1mins" --port="5051" --qos_correction_interval_min="0ns"
--quiet="false" --reconfiguration_policy="equal" --recover="reconnect" --recovery_timeout="15mins"
--registration_backoff_factor="10ms" --resources="cpus:2;gpus:0;mem:1024;disk:1024;ports:[31000-32000]"
--revocable_cpu_low_priority="true" --runtime_dir="/tmp/Endpoint_SlaveEndpointTest_NoAuthorizer_0_rTvDqG"
--sandbox_directory="/mnt/mesos/sandbox" --strict="true" --switch_user="true" --systemd_enable_support="true"
--systemd_runtime_directory="/run/systemd/system" --version="false" --work_dir="/tmp/Endpoint_SlaveEndpointTest_NoAuthorizer_0_VesqkD"
--zk_session_timeout="10secs"
I0307 00:35:21.508180   493 credentials.hpp:86] Loading credential for authentication from
'/tmp/Endpoint_SlaveEndpointTest_NoAuthorizer_0_rTvDqG/credential'
I0307 00:35:21.508395   493 slave.cpp:297] Agent using credential for: test-principal
I0307 00:35:21.508430   493 credentials.hpp:37] Loading credentials for authentication from
'/tmp/Endpoint_SlaveEndpointTest_NoAuthorizer_0_rTvDqG/http_credentials'
I0307 00:35:21.508815   493 http.cpp:1045] Creating default 'basic' HTTP authenticator for
realm 'mesos-agent-readonly'
I0307 00:35:21.510965   493 slave.cpp:614] Agent resources: [{"name":"cpus","scalar":{"value":2.0},"type":"SCALAR"},{"name":"mem","scalar":{"value":1024.0},"type":"SCALAR"},{"name":"disk","scalar":{"value":1024.0},"type":"SCALAR"},{"name":"ports","ranges":{"range":[{"begin":31000,"end":32000}]},"type":"RANGES"}]
I0307 00:35:21.511250   493 slave.cpp:622] Agent attributes: [  ]
I0307 00:35:21.511267   493 slave.cpp:631] Agent hostname: 6b9e519cc2ad
I0307 00:35:21.511504   505 task_status_update_manager.cpp:181] Pausing sending task status
updates
I0307 00:35:21.513314   494 state.cpp:66] Recovering state from '/tmp/Endpoint_SlaveEndpointTest_NoAuthorizer_0_VesqkD/meta'
I0307 00:35:21.513689   499 task_status_update_manager.cpp:207] Recovering task status update
manager
I0307 00:35:21.514012   498 containerizer.cpp:674] Recovering containerizer
I0307 00:35:21.516086   500 provisioner.cpp:495] Provisioner recovery complete
I0307 00:35:21.516608   506 slave.cpp:7217] Finished recovery
I0307 00:35:21.520114   500 process.cpp:3564] Handling HTTP event for process 'slave(1007)'
with path: '/slave(1007)/monitor/statistics'
I0307 00:35:21.522117   506 http.cpp:1185] HTTP GET for /slave(1007)/monitor/statistics from
172.17.0.2:50143
I0307 00:35:21.522212   506 http.cpp:976] Authorizing principal 'test-principal' to GET the
'/monitor/statistics' endpoint
I0307 00:35:21.525652   492 slave.cpp:924] Agent terminating
[       OK ] Endpoint/SlaveEndpointTest.NoAuthorizer/0 (40 ms)
[ RUN      ] Endpoint/SlaveEndpointTest.NoAuthorizer/1
I0307 00:35:21.542321   492 containerizer.cpp:304] Using isolation { environment_secret, posix/cpu,
posix/mem, filesystem/posix, network/cni }
W0307 00:35:21.542991   492 backend.cpp:76] Failed to create 'aufs' backend: AufsBackend requires
root privileges
W0307 00:35:21.543025   492 backend.cpp:76] Failed to create 'bind' backend: BindBackend requires
root privileges
I0307 00:35:21.543061   492 provisioner.cpp:299] Using default backend 'copy'
I0307 00:35:21.545194   492 cluster.cpp:460] Creating default 'local' authorizer
I0307 00:35:21.547508   500 slave.cpp:264] Mesos agent started on (1008)@172.17.0.2:37614
I0307 00:35:21.547535   500 slave.cpp:265] Flags at startup: --acls="" --appc_simple_discovery_uri_prefix="http://"
--appc_store_dir="/tmp/Endpoint_SlaveEndpointTest_NoAuthorizer_1_nR34bT/store/appc" --authenticate_http_readonly="true"
--authenticate_http_readwrite="false" --authenticatee="crammd5" --authentication_backoff_factor="1secs"
--authorizer="local" --cgroups_cpu_enable_pids_and_tids_count="false" --cgroups_enable_cfs="false"
--cgroups_hierarchy="/sys/fs/cgroup" --cgroups_limit_swap="false" --cgroups_root="mesos" --container_disk_watch_interval="15secs"
--containerizers="mesos" --credential="/tmp/Endpoint_SlaveEndpointTest_NoAuthorizer_1_nR34bT/credential"
--default_role="*" --disallow_sharing_agent_pid_namespace="false" --disk_watch_interval="1mins"
--docker="docker" --docker_kill_orphans="true" --docker_registry="https://registry-1.docker.io"
--docker_remove_delay="6hrs" --docker_socket="/var/run/docker.sock" --docker_stop_timeout="0ns"
--docker_store_dir="/tmp/Endpoint_SlaveEndpointTest_NoAuthorizer_1_nR34bT/store/docker" --docker_volume_checkpoint_dir="/var/run/mesos/isolators/docker/volume"
--enforce_container_disk_quota="false" --executor_registration_timeout="1mins" --executor_reregistration_timeout="2secs"
--executor_shutdown_grace_period="5secs" --fetcher_cache_dir="/tmp/Endpoint_SlaveEndpointTest_NoAuthorizer_1_nR34bT/fetch"
--fetcher_cache_size="2GB" --frameworks_home="" --gc_delay="1weeks" --gc_disk_headroom="0.1"
--hadoop_home="" --help="false" --hostname_lookup="true" --http_command_executor="false" --http_credentials="/tmp/Endpoint_SlaveEndpointTest_NoAuthorizer_1_nR34bT/http_credentials"
--http_heartbeat_interval="30secs" --initialize_driver_logging="true" --isolation="posix/cpu,posix/mem"
--launcher="posix" --launcher_dir="/tmp/SRC/build/mesos-1.6.0/_build/sub/src" --logbufsecs="0"
--logging_level="INFO" --max_completed_executors_per_framework="150" --oversubscribed_resources_interval="15secs"
--perf_duration="10secs" --perf_interval="1mins" --port="5051" --qos_correction_interval_min="0ns"
--quiet="false" --reconfiguration_policy="equal" --recover="reconnect" --recovery_timeout="15mins"
--registration_backoff_factor="10ms" --resources="cpus:2;gpus:0;mem:1024;disk:1024;ports:[31000-32000]"
--revocable_cpu_low_priority="true" --runtime_dir="/tmp/Endpoint_SlaveEndpointTest_NoAuthorizer_1_nR34bT"
--sandbox_directory="/mnt/mesos/sandbox" --strict="true" --switch_user="true" --systemd_enable_support="true"
--systemd_runtime_directory="/run/systemd/system" --version="false" --work_dir="/tmp/Endpoint_SlaveEndpointTest_NoAuthorizer_1_RiAfZP"
--zk_session_timeout="10secs"
I0307 00:35:21.548154   500 credentials.hpp:86] Loading credential for authentication from
'/tmp/Endpoint_SlaveEndpointTest_NoAuthorizer_1_nR34bT/credential'
I0307 00:35:21.548339   500 slave.cpp:297] Agent using credential for: test-principal
I0307 00:35:21.548373   500 credentials.hpp:37] Loading credentials for authentication from
'/tmp/Endpoint_SlaveEndpointTest_NoAuthorizer_1_nR34bT/http_credentials'
I0307 00:35:21.548713   500 http.cpp:1045] Creating default 'basic' HTTP authenticator for
realm 'mesos-agent-readonly'
I0307 00:35:21.550810   500 slave.cpp:614] Agent resources: [{"name":"cpus","scalar":{"value":2.0},"type":"SCALAR"},{"name":"mem","scalar":{"value":1024.0},"type":"SCALAR"},{"name":"disk","scalar":{"value":1024.0},"type":"SCALAR"},{"name":"ports","ranges":{"range":[{"begin":31000,"end":32000}]},"type":"RANGES"}]
I0307 00:35:21.551090   500 slave.cpp:622] Agent attributes: [  ]
I0307 00:35:21.551107   500 slave.cpp:631] Agent hostname: 6b9e519cc2ad
I0307 00:35:21.551321   506 task_status_update_manager.cpp:181] Pausing sending task status
updates
I0307 00:35:21.553063   494 state.cpp:66] Recovering state from '/tmp/Endpoint_SlaveEndpointTest_NoAuthorizer_1_RiAfZP/meta'
I0307 00:35:21.553514   501 task_status_update_manager.cpp:207] Recovering task status update
manager
I0307 00:35:21.553805   496 containerizer.cpp:674] Recovering containerizer
I0307 00:35:21.555711   494 provisioner.cpp:495] Provisioner recovery complete
I0307 00:35:21.556222   505 slave.cpp:7217] Finished recovery
I0307 00:35:21.559800   500 process.cpp:3564] Handling HTTP event for process 'slave(1008)'
with path: '/slave(1008)/monitor/statistics.json'
I0307 00:35:21.561460   505 http.cpp:1185] HTTP GET for /slave(1008)/monitor/statistics.json
from 172.17.0.2:50144
I0307 00:35:21.561552   505 http.cpp:976] Authorizing principal 'test-principal' to GET the
'/monitor/statistics.json' endpoint
I0307 00:35:21.565039   501 slave.cpp:924] Agent terminating
[       OK ] Endpoint/SlaveEndpointTest.NoAuthorizer/1 (39 ms)
[ RUN      ] Endpoint/SlaveEndpointTest.NoAuthorizer/2
I0307 00:35:21.582068   492 containerizer.cpp:304] Using isolation { environment_secret, posix/cpu,
posix/mem, filesystem/posix, network/cni }
W0307 00:35:21.582676   492 backend.cpp:76] Failed to create 'aufs' backend: AufsBackend requires
root privileges
W0307 00:35:21.582710   492 backend.cpp:76] Failed to create 'bind' backend: BindBackend requires
root privileges
I0307 00:35:21.582759   492 provisioner.cpp:299] Using default backend 'copy'
I0307 00:35:21.584848   492 cluster.cpp:460] Creating default 'local' authorizer
I0307 00:35:21.587326   503 slave.cpp:264] Mesos agent started on (1009)@172.17.0.2:37614
I0307 00:35:21.587354   503 slave.cpp:265] Flags at startup: --acls="" --appc_simple_discovery_uri_prefix="http://"
--appc_store_dir="/tmp/Endpoint_SlaveEndpointTest_NoAuthorizer_2_Rtith5/store/appc" --authenticate_http_readonly="true"
--authenticate_http_readwrite="false" --authenticatee="crammd5" --authentication_backoff_factor="1secs"
--authorizer="local" --cgroups_cpu_enable_pids_and_tids_count="false" --cgroups_enable_cfs="false"
--cgroups_hierarchy="/sys/fs/cgroup" --cgroups_limit_swap="false" --cgroups_root="mesos" --container_disk_watch_interval="15secs"
--containerizers="mesos" --credential="/tmp/Endpoint_SlaveEndpointTest_NoAuthorizer_2_Rtith5/credential"
--default_role="*" --disallow_sharing_agent_pid_namespace="false" --disk_watch_interval="1mins"
--docker="docker" --docker_kill_orphans="true" --docker_registry="https://registry-1.docker.io"
--docker_remove_delay="6hrs" --docker_socket="/var/run/docker.sock" --docker_stop_timeout="0ns"
--docker_store_dir="/tmp/Endpoint_SlaveEndpointTest_NoAuthorizer_2_Rtith5/store/docker" --docker_volume_checkpoint_dir="/var/run/mesos/isolators/docker/volume"
--enforce_container_disk_quota="false" --executor_registration_timeout="1mins" --executor_reregistration_timeout="2secs"
--executor_shutdown_grace_period="5secs" --fetcher_cache_dir="/tmp/Endpoint_SlaveEndpointTest_NoAuthorizer_2_Rtith5/fetch"
--fetcher_cache_size="2GB" --frameworks_home="" --gc_delay="1weeks" --gc_disk_headroom="0.1"
--hadoop_home="" --help="false" --hostname_lookup="true" --http_command_executor="false" --http_credentials="/tmp/Endpoint_SlaveEndpointTest_NoAuthorizer_2_Rtith5/http_credentials"
--http_heartbeat_interval="30secs" --initialize_driver_logging="true" --isolation="posix/cpu,posix/mem"
--launcher="posix" --launcher_dir="/tmp/SRC/build/mesos-1.6.0/_build/sub/src" --logbufsecs="0"
--logging_level="INFO" --max_completed_executors_per_framework="150" --oversubscribed_resources_interval="15secs"
--perf_duration="10secs" --perf_interval="1mins" --port="5051" --qos_correction_interval_min="0ns"
--quiet="false" --reconfiguration_policy="equal" --recover="reconnect" --recovery_timeout="15mins"
--registration_backoff_factor="10ms" --resources="cpus:2;gpus:0;mem:1024;disk:1024;ports:[31000-32000]"
--revocable_cpu_low_priority="true" --runtime_dir="/tmp/Endpoint_SlaveEndpointTest_NoAuthorizer_2_Rtith5"
--sandbox_directory="/mnt/mesos/sandbox" --strict="true" --switch_user="true" --systemd_enable_support="true"
--systemd_runtime_directory="/run/systemd/system" --version="false" --work_dir="/tmp/Endpoint_SlaveEndpointTest_NoAuthorizer_2_Ftg5X1"
--zk_session_timeout="10secs"
I0307 00:35:21.588027   503 credentials.hpp:86] Loading credential for authentication from
'/tmp/Endpoint_SlaveEndpointTest_NoAuthorizer_2_Rtith5/credential'
I0307 00:35:21.588168   503 slave.cpp:297] Agent using credential for: test-principal
I0307 00:35:21.588188   503 credentials.hpp:37] Loading credentials for authentication from
'/tmp/Endpoint_SlaveEndpointTest_NoAuthorizer_2_Rtith5/http_credentials'
I0307 00:35:21.588482   503 http.cpp:1045] Creating default 'basic' HTTP authenticator for
realm 'mesos-agent-readonly'
I0307 00:35:21.590579   503 slave.cpp:614] Agent resources: [{"name":"cpus","scalar":{"value":2.0},"type":"SCALAR"},{"name":"mem","scalar":{"value":1024.0},"type":"SCALAR"},{"name":"disk","scalar":{"value":1024.0},"type":"SCALAR"},{"name":"ports","ranges":{"range":[{"begin":31000,"end":32000}]},"type":"RANGES"}]
I0307 00:35:21.590865   503 slave.cpp:622] Agent attributes: [  ]
I0307 00:35:21.590894   503 slave.cpp:631] Agent hostname: 6b9e519cc2ad
I0307 00:35:21.591109   497 task_status_update_manager.cpp:181] Pausing sending task status
updates
I0307 00:35:21.592905   494 state.cpp:66] Recovering state from '/tmp/Endpoint_SlaveEndpointTest_NoAuthorizer_2_Ftg5X1/meta'
I0307 00:35:21.593303   494 task_status_update_manager.cpp:207] Recovering task status update
manager
I0307 00:35:21.593592   501 containerizer.cpp:674] Recovering containerizer
I0307 00:35:21.595567   500 provisioner.cpp:495] Provisioner recovery complete
I0307 00:35:21.596073   499 slave.cpp:7217] Finished recovery
I0307 00:35:21.599678   503 process.cpp:3564] Handling HTTP event for process 'slave(1009)'
with path: '/slave(1009)/containers'
I0307 00:35:21.601693   502 http.cpp:1185] HTTP GET for /slave(1009)/containers from 172.17.0.2:50145
I0307 00:35:21.601789   502 http.cpp:976] Authorizing principal 'test-principal' to GET the
'/containers' endpoint
I0307 00:35:21.606536   492 slave.cpp:924] Agent terminating
[       OK ] Endpoint/SlaveEndpointTest.NoAuthorizer/2 (42 ms)
[----------] 9 tests from Endpoint/SlaveEndpointTest (362 ms total)

[----------] 2 tests from ContainerizerType/DefaultContainerDNSFlagTest
[ RUN      ] ContainerizerType/DefaultContainerDNSFlagTest.ValidateFlag/0
[       OK ] ContainerizerType/DefaultContainerDNSFlagTest.ValidateFlag/0 (10 ms)
[ RUN      ] ContainerizerType/DefaultContainerDNSFlagTest.ValidateFlag/1
[       OK ] ContainerizerType/DefaultContainerDNSFlagTest.ValidateFlag/1 (10 ms)
[----------] 2 tests from ContainerizerType/DefaultContainerDNSFlagTest (20 ms total)

[----------] Global test environment tear-down
[==========] 1928 tests from 193 test cases ran. (572426 ms total)
[  PASSED  ] 1927 tests.
[  FAILED  ] 1 test, listed below:
[  FAILED  ] ExamplesTest.TestHTTPFramework

 1 FAILED TEST
  YOU HAVE 22 DISABLED TESTS

I0307 00:35:21.695781   509 process.cpp:929] Stopped the socket accept loop
Makefile:14667: recipe for target 'check-local' failed
make[4]: *** [check-local] Error 1
make[4]: Leaving directory '/tmp/SRC/build/mesos-1.6.0/_build/sub/src'
Makefile:13800: recipe for target 'check-am' failed
make[3]: *** [check-am] Error 2
make[3]: Leaving directory '/tmp/SRC/build/mesos-1.6.0/_build/sub/src'
Makefile:13804: recipe for target 'check' failed
make[2]: *** [check] Error 2
make[2]: Leaving directory '/tmp/SRC/build/mesos-1.6.0/_build/sub/src'
Makefile:774: recipe for target 'check-recursive' failed
make[1]: *** [check-recursive] Error 1
make[1]: Leaving directory '/tmp/SRC/build/mesos-1.6.0/_build/sub'
Makefile:980: recipe for target 'distcheck' failed
make: *** [distcheck] Error 1
Untagged: mesos/mesos-build:ubuntu-16.04
Untagged: mesos/mesos-build@sha256:3643a2cc107ff04ee2d7628a48cff8bee6186b98bcaa5ce36f685d28d8b04dae
Deleted: sha256:df13eb8a4c4b15c8e09329265603b7fcacc7753bc731057e91c06554acab5a10
Deleted: sha256:f50f81f71ec4d5b88ef535ef34e07a1abfe00cec71bd4518a0bee2348c0c6229
Deleted: sha256:334c2f430d63071d6f077369f301016b59d5421b28a6df435c63aa2209f480e7
Deleted: sha256:7a41f53b59bb61bde6d3dc9a41c4dd87e6ff5141b36da06529c2cb32e6733d63
Deleted: sha256:4b569c802f795bb918a504e6ce315cddecfb633aee338ee535e7cfbe5c2801a3
Deleted: sha256:77e6ddba346d8ad1e436256f6373dede5af4002006981b7d4116c561c759cefa
Deleted: sha256:8db758ab2fdb54da0aec53aeac876934337e6170f5a8c8872b3d4171e3d465b7
Deleted: sha256:a7fc6b405fe8ef71edfa6163d1dc9f1cb1df426049eefaa7d388e9df21a061ad
Deleted: sha256:5a3e35538f7f2e2727c8ac92f08c30002b9e8a77737de0dab91244344d59f69b
Deleted: sha256:ff986b10a018b48074e6d3a68b39aad8ccc002cdad912d4148c0f92b3729323e
Build step 'Execute shell' marked build as failure


Mime
View raw message