mesos-builds mailing list archives

Site index · List index
Message view « Date » · « Thread »
Top « Date » · « Thread »
From Apache Jenkins Server <jenk...@builds.apache.org>
Subject Build failed in Jenkins: Mesos-Reviewbot #21992
Date Fri, 23 Mar 2018 23:57:32 GMT
See <https://builds.apache.org/job/Mesos-Reviewbot/21992/display/redirect?page=changes>

Changes:

[chhsiao] Added OS_LINUX guard for 'test_csi_plugin'.

------------------------------------------
[...truncated 37.38 MB...]
I0323 23:57:25.412935  5621 slave.cpp:294] Agent using credential for: test-principal
I0323 23:57:25.412997  5621 credentials.hpp:37] Loading credentials for authentication from
'/tmp/Endpoint_SlaveEndpointTest_AuthorizedRequest_1_JsVpUe/http_credentials'
I0323 23:57:25.413621  5621 http.cpp:959] Creating default 'basic' HTTP authenticator for
realm 'mesos-agent-readonly'
I0323 23:57:25.414372  5621 disk_profile_adaptor.cpp:80] Creating default disk profile adaptor
module
I0323 23:57:25.417371  5621 slave.cpp:609] Agent resources: [{"name":"cpus","scalar":{"value":2.0},"type":"SCALAR"},{"name":"mem","scalar":{"value":1024.0},"type":"SCALAR"},{"name":"disk","scalar":{"value":1024.0},"type":"SCALAR"},{"name":"ports","ranges":{"range":[{"begin":31000,"end":32000}]},"type":"RANGES"}]
I0323 23:57:25.417762  5621 slave.cpp:617] Agent attributes: [  ]
I0323 23:57:25.417786  5621 slave.cpp:626] Agent hostname: 9de87f4fc233
I0323 23:57:25.418071  5605 task_status_update_manager.cpp:181] Pausing sending task status
updates
I0323 23:57:25.421123  5602 state.cpp:66] Recovering state from '/tmp/Endpoint_SlaveEndpointTest_AuthorizedRequest_1_gfVu62/meta'
I0323 23:57:25.421639  5602 task_status_update_manager.cpp:207] Recovering task status update
manager
I0323 23:57:25.422004  5620 containerizer.cpp:674] Recovering containerizer
I0323 23:57:25.424626  5609 provisioner.cpp:495] Provisioner recovery complete
I0323 23:57:25.425202  5605 slave.cpp:7212] Finished recovery
I0323 23:57:25.430254  5622 process.cpp:3564] Handling HTTP event for process 'slave(1010)'
with path: '/slave(1010)/monitor/statistics.json'
I0323 23:57:25.432956  5616 http.cpp:1099] HTTP GET for /slave(1010)/monitor/statistics.json
from 172.17.0.2:53220
I0323 23:57:25.433086  5616 http.cpp:936] Authorizing principal 'test-principal' to GET the
'/monitor/statistics.json' endpoint
I0323 23:57:25.437690  5622 slave.cpp:919] Agent terminating
[       OK ] Endpoint/SlaveEndpointTest.AuthorizedRequest/1 (49 ms)
[ RUN      ] Endpoint/SlaveEndpointTest.AuthorizedRequest/2
I0323 23:57:25.458077  5599 containerizer.cpp:304] Using isolation { environment_secret, posix/cpu,
posix/mem, filesystem/posix, network/cni }
W0323 23:57:25.458919  5599 backend.cpp:76] Failed to create 'aufs' backend: AufsBackend requires
root privileges
W0323 23:57:25.458961  5599 backend.cpp:76] Failed to create 'bind' backend: BindBackend requires
root privileges
I0323 23:57:25.459003  5599 provisioner.cpp:299] Using default backend 'copy'
I0323 23:57:25.465432  5620 slave.cpp:261] Mesos agent started on (1011)@172.17.0.2:46434
I0323 23:57:25.465471  5620 slave.cpp:262] Flags at startup: --acls="" --appc_simple_discovery_uri_prefix="http://"
--appc_store_dir="/tmp/Endpoint_SlaveEndpointTest_AuthorizedRequest_2_eYxrw0/store/appc" --authenticate_http_readonly="true"
--authenticate_http_readwrite="false" --authenticatee="crammd5" --authentication_backoff_factor="1secs"
--authorizer="local" --cgroups_cpu_enable_pids_and_tids_count="false" --cgroups_enable_cfs="false"
--cgroups_hierarchy="/sys/fs/cgroup" --cgroups_limit_swap="false" --cgroups_root="mesos" --container_disk_watch_interval="15secs"
--containerizers="mesos" --credential="/tmp/Endpoint_SlaveEndpointTest_AuthorizedRequest_2_eYxrw0/credential"
--default_role="*" --disallow_sharing_agent_pid_namespace="false" --disk_watch_interval="1mins"
--docker="docker" --docker_kill_orphans="true" --docker_registry="https://registry-1.docker.io"
--docker_remove_delay="6hrs" --docker_socket="/var/run/docker.sock" --docker_stop_timeout="0ns"
--docker_store_dir="/tmp/Endpoint_SlaveEndpointTest_AuthorizedRequest_2_eYxrw0/store/docker"
--docker_volume_checkpoint_dir="/var/run/mesos/isolators/docker/volume" --enforce_container_disk_quota="false"
--executor_registration_timeout="1mins" --executor_reregistration_timeout="2secs" --executor_shutdown_grace_period="5secs"
--fetcher_cache_dir="/tmp/Endpoint_SlaveEndpointTest_AuthorizedRequest_2_eYxrw0/fetch" --fetcher_cache_size="2GB"
--frameworks_home="" --gc_delay="1weeks" --gc_disk_headroom="0.1" --hadoop_home="" --help="false"
--hostname_lookup="true" --http_command_executor="false" --http_credentials="/tmp/Endpoint_SlaveEndpointTest_AuthorizedRequest_2_eYxrw0/http_credentials"
--http_heartbeat_interval="30secs" --initialize_driver_logging="true" --isolation="posix/cpu,posix/mem"
--launcher="posix" --launcher_dir="/tmp/SRC/build/mesos-1.6.0/_build/sub/src" --logbufsecs="0"
--logging_level="INFO" --max_completed_executors_per_framework="150" --oversubscribed_resources_interval="15secs"
--perf_duration="10secs" --perf_interval="1mins" --port="5051" --qos_correction_interval_min="0ns"
--quiet="false" --reconfiguration_policy="equal" --recover="reconnect" --recovery_timeout="15mins"
--registration_backoff_factor="10ms" --resources="cpus:2;gpus:0;mem:1024;disk:1024;ports:[31000-32000]"
--revocable_cpu_low_priority="true" --runtime_dir="/tmp/Endpoint_SlaveEndpointTest_AuthorizedRequest_2_eYxrw0"
--sandbox_directory="/mnt/mesos/sandbox" --strict="true" --switch_user="true" --systemd_enable_support="true"
--systemd_runtime_directory="/run/systemd/system" --version="false" --work_dir="/tmp/Endpoint_SlaveEndpointTest_AuthorizedRequest_2_ZZ9iBO"
--zk_session_timeout="10secs"
I0323 23:57:25.466032  5620 credentials.hpp:86] Loading credential for authentication from
'/tmp/Endpoint_SlaveEndpointTest_AuthorizedRequest_2_eYxrw0/credential'
I0323 23:57:25.466264  5620 slave.cpp:294] Agent using credential for: test-principal
I0323 23:57:25.466310  5620 credentials.hpp:37] Loading credentials for authentication from
'/tmp/Endpoint_SlaveEndpointTest_AuthorizedRequest_2_eYxrw0/http_credentials'
I0323 23:57:25.466675  5620 http.cpp:959] Creating default 'basic' HTTP authenticator for
realm 'mesos-agent-readonly'
I0323 23:57:25.467187  5620 disk_profile_adaptor.cpp:80] Creating default disk profile adaptor
module
I0323 23:57:25.469166  5620 slave.cpp:609] Agent resources: [{"name":"cpus","scalar":{"value":2.0},"type":"SCALAR"},{"name":"mem","scalar":{"value":1024.0},"type":"SCALAR"},{"name":"disk","scalar":{"value":1024.0},"type":"SCALAR"},{"name":"ports","ranges":{"range":[{"begin":31000,"end":32000}]},"type":"RANGES"}]
I0323 23:57:25.469467  5620 slave.cpp:617] Agent attributes: [  ]
I0323 23:57:25.469497  5620 slave.cpp:626] Agent hostname: 9de87f4fc233
I0323 23:57:25.469688  5611 task_status_update_manager.cpp:181] Pausing sending task status
updates
I0323 23:57:25.471765  5617 state.cpp:66] Recovering state from '/tmp/Endpoint_SlaveEndpointTest_AuthorizedRequest_2_ZZ9iBO/meta'
I0323 23:57:25.472229  5607 task_status_update_manager.cpp:207] Recovering task status update
manager
I0323 23:57:25.472532  5616 containerizer.cpp:674] Recovering containerizer
I0323 23:57:25.474741  5606 provisioner.cpp:495] Provisioner recovery complete
I0323 23:57:25.475299  5608 slave.cpp:7212] Finished recovery
I0323 23:57:25.480553  5615 process.cpp:3564] Handling HTTP event for process 'slave(1011)'
with path: '/slave(1011)/containers'
I0323 23:57:25.482657  5611 http.cpp:1099] HTTP GET for /slave(1011)/containers from 172.17.0.2:53222
I0323 23:57:25.482766  5611 http.cpp:936] Authorizing principal 'test-principal' to GET the
'/containers' endpoint
I0323 23:57:25.487336  5620 slave.cpp:919] Agent terminating
[       OK ] Endpoint/SlaveEndpointTest.AuthorizedRequest/2 (47 ms)
[ RUN      ] Endpoint/SlaveEndpointTest.UnauthorizedRequest/0
I0323 23:57:25.504072  5599 containerizer.cpp:304] Using isolation { environment_secret, posix/cpu,
posix/mem, filesystem/posix, network/cni }
W0323 23:57:25.504746  5599 backend.cpp:76] Failed to create 'aufs' backend: AufsBackend requires
root privileges
W0323 23:57:25.504777  5599 backend.cpp:76] Failed to create 'bind' backend: BindBackend requires
root privileges
I0323 23:57:25.504812  5599 provisioner.cpp:299] Using default backend 'copy'
I0323 23:57:25.509546  5618 slave.cpp:261] Mesos agent started on (1012)@172.17.0.2:46434
I0323 23:57:25.509585  5618 slave.cpp:262] Flags at startup: --acls="" --appc_simple_discovery_uri_prefix="http://"
--appc_store_dir="/tmp/Endpoint_SlaveEndpointTest_UnauthorizedRequest_0_UFFEzM/store/appc"
--authenticate_http_readonly="true" --authenticate_http_readwrite="false" --authenticatee="crammd5"
--authentication_backoff_factor="1secs" --authorizer="local" --cgroups_cpu_enable_pids_and_tids_count="false"
--cgroups_enable_cfs="false" --cgroups_hierarchy="/sys/fs/cgroup" --cgroups_limit_swap="false"
--cgroups_root="mesos" --container_disk_watch_interval="15secs" --containerizers="mesos" --credential="/tmp/Endpoint_SlaveEndpointTest_UnauthorizedRequest_0_UFFEzM/credential"
--default_role="*" --disallow_sharing_agent_pid_namespace="false" --disk_watch_interval="1mins"
--docker="docker" --docker_kill_orphans="true" --docker_registry="https://registry-1.docker.io"
--docker_remove_delay="6hrs" --docker_socket="/var/run/docker.sock" --docker_stop_timeout="0ns"
--docker_store_dir="/tmp/Endpoint_SlaveEndpointTest_UnauthorizedRequest_0_UFFEzM/store/docker"
--docker_volume_checkpoint_dir="/var/run/mesos/isolators/docker/volume" --enforce_container_disk_quota="false"
--executor_registration_timeout="1mins" --executor_reregistration_timeout="2secs" --executor_shutdown_grace_period="5secs"
--fetcher_cache_dir="/tmp/Endpoint_SlaveEndpointTest_UnauthorizedRequest_0_UFFEzM/fetch" --fetcher_cache_size="2GB"
--frameworks_home="" --gc_delay="1weeks" --gc_disk_headroom="0.1" --hadoop_home="" --help="false"
--hostname_lookup="true" --http_command_executor="false" --http_credentials="/tmp/Endpoint_SlaveEndpointTest_UnauthorizedRequest_0_UFFEzM/http_credentials"
--http_heartbeat_interval="30secs" --initialize_driver_logging="true" --isolation="posix/cpu,posix/mem"
--launcher="posix" --launcher_dir="/tmp/SRC/build/mesos-1.6.0/_build/sub/src" --logbufsecs="0"
--logging_level="INFO" --max_completed_executors_per_framework="150" --oversubscribed_resources_interval="15secs"
--perf_duration="10secs" --perf_interval="1mins" --port="5051" --qos_correction_interval_min="0ns"
--quiet="false" --reconfiguration_policy="equal" --recover="reconnect" --recovery_timeout="15mins"
--registration_backoff_factor="10ms" --resources="cpus:2;gpus:0;mem:1024;disk:1024;ports:[31000-32000]"
--revocable_cpu_low_priority="true" --runtime_dir="/tmp/Endpoint_SlaveEndpointTest_UnauthorizedRequest_0_UFFEzM"
--sandbox_directory="/mnt/mesos/sandbox" --strict="true" --switch_user="true" --systemd_enable_support="true"
--systemd_runtime_directory="/run/systemd/system" --version="false" --work_dir="/tmp/Endpoint_SlaveEndpointTest_UnauthorizedRequest_0_NVZRxA"
--zk_session_timeout="10secs"
I0323 23:57:25.510316  5618 credentials.hpp:86] Loading credential for authentication from
'/tmp/Endpoint_SlaveEndpointTest_UnauthorizedRequest_0_UFFEzM/credential'
I0323 23:57:25.510555  5618 slave.cpp:294] Agent using credential for: test-principal
I0323 23:57:25.510592  5618 credentials.hpp:37] Loading credentials for authentication from
'/tmp/Endpoint_SlaveEndpointTest_UnauthorizedRequest_0_UFFEzM/http_credentials'
I0323 23:57:25.510992  5618 http.cpp:959] Creating default 'basic' HTTP authenticator for
realm 'mesos-agent-readonly'
I0323 23:57:25.511476  5618 disk_profile_adaptor.cpp:80] Creating default disk profile adaptor
module
I0323 23:57:25.513200  5618 slave.cpp:609] Agent resources: [{"name":"cpus","scalar":{"value":2.0},"type":"SCALAR"},{"name":"mem","scalar":{"value":1024.0},"type":"SCALAR"},{"name":"disk","scalar":{"value":1024.0},"type":"SCALAR"},{"name":"ports","ranges":{"range":[{"begin":31000,"end":32000}]},"type":"RANGES"}]
I0323 23:57:25.513453  5618 slave.cpp:617] Agent attributes: [  ]
I0323 23:57:25.513469  5618 slave.cpp:626] Agent hostname: 9de87f4fc233
I0323 23:57:25.513639  5603 task_status_update_manager.cpp:181] Pausing sending task status
updates
I0323 23:57:25.515496  5608 state.cpp:66] Recovering state from '/tmp/Endpoint_SlaveEndpointTest_UnauthorizedRequest_0_NVZRxA/meta'
I0323 23:57:25.515848  5621 task_status_update_manager.cpp:207] Recovering task status update
manager
I0323 23:57:25.516095  5617 containerizer.cpp:674] Recovering containerizer
I0323 23:57:25.517738  5609 provisioner.cpp:495] Provisioner recovery complete
I0323 23:57:25.518162  5603 slave.cpp:7212] Finished recovery
I0323 23:57:25.521471  5612 process.cpp:3564] Handling HTTP event for process 'slave(1012)'
with path: '/slave(1012)/monitor/statistics'
I0323 23:57:25.523161  5616 http.cpp:1099] HTTP GET for /slave(1012)/monitor/statistics from
172.17.0.2:53224
I0323 23:57:25.523249  5616 http.cpp:936] Authorizing principal 'test-principal' to GET the
'/monitor/statistics' endpoint
I0323 23:57:25.524967  5615 slave.cpp:919] Agent terminating
[       OK ] Endpoint/SlaveEndpointTest.UnauthorizedRequest/0 (34 ms)
[ RUN      ] Endpoint/SlaveEndpointTest.UnauthorizedRequest/1
I0323 23:57:25.537883  5599 containerizer.cpp:304] Using isolation { environment_secret, posix/cpu,
posix/mem, filesystem/posix, network/cni }
W0323 23:57:25.538429  5599 backend.cpp:76] Failed to create 'aufs' backend: AufsBackend requires
root privileges
W0323 23:57:25.538457  5599 backend.cpp:76] Failed to create 'bind' backend: BindBackend requires
root privileges
I0323 23:57:25.538486  5599 provisioner.cpp:299] Using default backend 'copy'
I0323 23:57:25.542731  5608 slave.cpp:261] Mesos agent started on (1013)@172.17.0.2:46434
I0323 23:57:25.542757  5608 slave.cpp:262] Flags at startup: --acls="" --appc_simple_discovery_uri_prefix="http://"
--appc_store_dir="/tmp/Endpoint_SlaveEndpointTest_UnauthorizedRequest_1_XJ7JXy/store/appc"
--authenticate_http_readonly="true" --authenticate_http_readwrite="false" --authenticatee="crammd5"
--authentication_backoff_factor="1secs" --authorizer="local" --cgroups_cpu_enable_pids_and_tids_count="false"
--cgroups_enable_cfs="false" --cgroups_hierarchy="/sys/fs/cgroup" --cgroups_limit_swap="false"
--cgroups_root="mesos" --container_disk_watch_interval="15secs" --containerizers="mesos" --credential="/tmp/Endpoint_SlaveEndpointTest_UnauthorizedRequest_1_XJ7JXy/credential"
--default_role="*" --disallow_sharing_agent_pid_namespace="false" --disk_watch_interval="1mins"
--docker="docker" --docker_kill_orphans="true" --docker_registry="https://registry-1.docker.io"
--docker_remove_delay="6hrs" --docker_socket="/var/run/docker.sock" --docker_stop_timeout="0ns"
--docker_store_dir="/tmp/Endpoint_SlaveEndpointTest_UnauthorizedRequest_1_XJ7JXy/store/docker"
--docker_volume_checkpoint_dir="/var/run/mesos/isolators/docker/volume" --enforce_container_disk_quota="false"
--executor_registration_timeout="1mins" --executor_reregistration_timeout="2secs" --executor_shutdown_grace_period="5secs"
--fetcher_cache_dir="/tmp/Endpoint_SlaveEndpointTest_UnauthorizedRequest_1_XJ7JXy/fetch" --fetcher_cache_size="2GB"
--frameworks_home="" --gc_delay="1weeks" --gc_disk_headroom="0.1" --hadoop_home="" --help="false"
--hostname_lookup="true" --http_command_executor="false" --http_credentials="/tmp/Endpoint_SlaveEndpointTest_UnauthorizedRequest_1_XJ7JXy/http_credentials"
--http_heartbeat_interval="30secs" --initialize_driver_logging="true" --isolation="posix/cpu,posix/mem"
--launcher="posix" --launcher_dir="/tmp/SRC/build/mesos-1.6.0/_build/sub/src" --logbufsecs="0"
--logging_level="INFO" --max_completed_executors_per_framework="150" --oversubscribed_resources_interval="15secs"
--perf_duration="10secs" --perf_interval="1mins" --port="5051" --qos_correction_interval_min="0ns"
--quiet="false" --reconfiguration_policy="equal" --recover="reconnect" --recovery_timeout="15mins"
--registration_backoff_factor="10ms" --resources="cpus:2;gpus:0;mem:1024;disk:1024;ports:[31000-32000]"
--revocable_cpu_low_priority="true" --runtime_dir="/tmp/Endpoint_SlaveEndpointTest_UnauthorizedRequest_1_XJ7JXy"
--sandbox_directory="/mnt/mesos/sandbox" --strict="true" --switch_user="true" --systemd_enable_support="true"
--systemd_runtime_directory="/run/systemd/system" --version="false" --work_dir="/tmp/Endpoint_SlaveEndpointTest_UnauthorizedRequest_1_dCg3Qm"
--zk_session_timeout="10secs"
I0323 23:57:25.543182  5608 credentials.hpp:86] Loading credential for authentication from
'/tmp/Endpoint_SlaveEndpointTest_UnauthorizedRequest_1_XJ7JXy/credential'
I0323 23:57:25.543351  5608 slave.cpp:294] Agent using credential for: test-principal
I0323 23:57:25.543386  5608 credentials.hpp:37] Loading credentials for authentication from
'/tmp/Endpoint_SlaveEndpointTest_UnauthorizedRequest_1_XJ7JXy/http_credentials'
I0323 23:57:25.543653  5608 http.cpp:959] Creating default 'basic' HTTP authenticator for
realm 'mesos-agent-readonly'
I0323 23:57:25.544034  5608 disk_profile_adaptor.cpp:80] Creating default disk profile adaptor
module
I0323 23:57:25.545445  5608 slave.cpp:609] Agent resources: [{"name":"cpus","scalar":{"value":2.0},"type":"SCALAR"},{"name":"mem","scalar":{"value":1024.0},"type":"SCALAR"},{"name":"disk","scalar":{"value":1024.0},"type":"SCALAR"},{"name":"ports","ranges":{"range":[{"begin":31000,"end":32000}]},"type":"RANGES"}]
I0323 23:57:25.545675  5608 slave.cpp:617] Agent attributes: [  ]
I0323 23:57:25.545689  5608 slave.cpp:626] Agent hostname: 9de87f4fc233
I0323 23:57:25.545830  5622 task_status_update_manager.cpp:181] Pausing sending task status
updates
I0323 23:57:25.547447  5623 state.cpp:66] Recovering state from '/tmp/Endpoint_SlaveEndpointTest_UnauthorizedRequest_1_dCg3Qm/meta'
I0323 23:57:25.547806  5620 task_status_update_manager.cpp:207] Recovering task status update
manager
I0323 23:57:25.548030  5607 containerizer.cpp:674] Recovering containerizer
I0323 23:57:25.549607  5603 provisioner.cpp:495] Provisioner recovery complete
I0323 23:57:25.550038  5622 slave.cpp:7212] Finished recovery
I0323 23:57:25.553719  5604 process.cpp:3564] Handling HTTP event for process 'slave(1013)'
with path: '/slave(1013)/monitor/statistics.json'
I0323 23:57:25.556421  5615 http.cpp:1099] HTTP GET for /slave(1013)/monitor/statistics.json
from 172.17.0.2:53226
I0323 23:57:25.556514  5615 http.cpp:936] Authorizing principal 'test-principal' to GET the
'/monitor/statistics.json' endpoint
I0323 23:57:25.558393  5605 slave.cpp:919] Agent terminating
[       OK ] Endpoint/SlaveEndpointTest.UnauthorizedRequest/1 (34 ms)
[ RUN      ] Endpoint/SlaveEndpointTest.UnauthorizedRequest/2
I0323 23:57:25.573496  5599 containerizer.cpp:304] Using isolation { environment_secret, posix/cpu,
posix/mem, filesystem/posix, network/cni }
W0323 23:57:25.574160  5599 backend.cpp:76] Failed to create 'aufs' backend: AufsBackend requires
root privileges
W0323 23:57:25.574195  5599 backend.cpp:76] Failed to create 'bind' backend: BindBackend requires
root privileges
I0323 23:57:25.574230  5599 provisioner.cpp:299] Using default backend 'copy'
I0323 23:57:25.579392  5600 slave.cpp:261] Mesos agent started on (1014)@172.17.0.2:46434
I0323 23:57:25.579430  5600 slave.cpp:262] Flags at startup: --acls="" --appc_simple_discovery_uri_prefix="http://"
--appc_store_dir="/tmp/Endpoint_SlaveEndpointTest_UnauthorizedRequest_2_tTx9El/store/appc"
--authenticate_http_readonly="true" --authenticate_http_readwrite="false" --authenticatee="crammd5"
--authentication_backoff_factor="1secs" --authorizer="local" --cgroups_cpu_enable_pids_and_tids_count="false"
--cgroups_enable_cfs="false" --cgroups_hierarchy="/sys/fs/cgroup" --cgroups_limit_swap="false"
--cgroups_root="mesos" --container_disk_watch_interval="15secs" --containerizers="mesos" --credential="/tmp/Endpoint_SlaveEndpointTest_UnauthorizedRequest_2_tTx9El/credential"
--default_role="*" --disallow_sharing_agent_pid_namespace="false" --disk_watch_interval="1mins"
--docker="docker" --docker_kill_orphans="true" --docker_registry="https://registry-1.docker.io"
--docker_remove_delay="6hrs" --docker_socket="/var/run/docker.sock" --docker_stop_timeout="0ns"
--docker_store_dir="/tmp/Endpoint_SlaveEndpointTest_UnauthorizedRequest_2_tTx9El/store/docker"
--docker_volume_checkpoint_dir="/var/run/mesos/isolators/docker/volume" --enforce_container_disk_quota="false"
--executor_registration_timeout="1mins" --executor_reregistration_timeout="2secs" --executor_shutdown_grace_period="5secs"
--fetcher_cache_dir="/tmp/Endpoint_SlaveEndpointTest_UnauthorizedRequest_2_tTx9El/fetch" --fetcher_cache_size="2GB"
--frameworks_home="" --gc_delay="1weeks" --gc_disk_headroom="0.1" --hadoop_home="" --help="false"
--hostname_lookup="true" --http_command_executor="false" --http_credentials="/tmp/Endpoint_SlaveEndpointTest_UnauthorizedRequest_2_tTx9El/http_credentials"
--http_heartbeat_interval="30secs" --initialize_driver_logging="true" --isolation="posix/cpu,posix/mem"
--launcher="posix" --launcher_dir="/tmp/SRC/build/mesos-1.6.0/_build/sub/src" --logbufsecs="0"
--logging_level="INFO" --max_completed_executors_per_framework="150" --oversubscribed_resources_interval="15secs"
--perf_duration="10secs" --perf_interval="1mins" --port="5051" --qos_correction_interval_min="0ns"
--quiet="false" --reconfiguration_policy="equal" --recover="reconnect" --recovery_timeout="15mins"
--registration_backoff_factor="10ms" --resources="cpus:2;gpus:0;mem:1024;disk:1024;ports:[31000-32000]"
--revocable_cpu_low_priority="true" --runtime_dir="/tmp/Endpoint_SlaveEndpointTest_UnauthorizedRequest_2_tTx9El"
--sandbox_directory="/mnt/mesos/sandbox" --strict="true" --switch_user="true" --systemd_enable_support="true"
--systemd_runtime_directory="/run/systemd/system" --version="false" --work_dir="/tmp/Endpoint_SlaveEndpointTest_UnauthorizedRequest_2_lWpvt9"
--zk_session_timeout="10secs"
I0323 23:57:25.579960  5600 credentials.hpp:86] Loading credential for authentication from
'/tmp/Endpoint_SlaveEndpointTest_UnauthorizedRequest_2_tTx9El/credential'
I0323 23:57:25.580149  5600 slave.cpp:294] Agent using credential for: test-principal
I0323 23:57:25.580196  5600 credentials.hpp:37] Loading credentials for authentication from
'/tmp/Endpoint_SlaveEndpointTest_UnauthorizedRequest_2_tTx9El/http_credentials'
I0323 23:57:25.580616  5600 http.cpp:959] Creating default 'basic' HTTP authenticator for
realm 'mesos-agent-readonly'
I0323 23:57:25.581177  5600 disk_profile_adaptor.cpp:80] Creating default disk profile adaptor
module
I0323 23:57:25.583513  5600 slave.cpp:609] Agent resources: [{"name":"cpus","scalar":{"value":2.0},"type":"SCALAR"},{"name":"mem","scalar":{"value":1024.0},"type":"SCALAR"},{"name":"disk","scalar":{"value":1024.0},"type":"SCALAR"},{"name":"ports","ranges":{"range":[{"begin":31000,"end":32000}]},"type":"RANGES"}]
I0323 23:57:25.583899  5600 slave.cpp:617] Agent attributes: [  ]
I0323 23:57:25.583922  5600 slave.cpp:626] Agent hostname: 9de87f4fc233
I0323 23:57:25.584203  5620 task_status_update_manager.cpp:181] Pausing sending task status
updates
I0323 23:57:25.586446  5607 state.cpp:66] Recovering state from '/tmp/Endpoint_SlaveEndpointTest_UnauthorizedRequest_2_lWpvt9/meta'
I0323 23:57:25.586915  5615 task_status_update_manager.cpp:207] Recovering task status update
manager
I0323 23:57:25.587232  5611 containerizer.cpp:674] Recovering containerizer
I0323 23:57:25.589602  5614 provisioner.cpp:495] Provisioner recovery complete
I0323 23:57:25.590176  5622 slave.cpp:7212] Finished recovery
I0323 23:57:25.594507  5623 process.cpp:3564] Handling HTTP event for process 'slave(1014)'
with path: '/slave(1014)/containers'
I0323 23:57:25.596850  5612 http.cpp:1099] HTTP GET for /slave(1014)/containers from 172.17.0.2:53228
I0323 23:57:25.596968  5612 http.cpp:936] Authorizing principal 'test-principal' to GET the
'/containers' endpoint
I0323 23:57:25.599359  5599 slave.cpp:919] Agent terminating
[       OK ] Endpoint/SlaveEndpointTest.UnauthorizedRequest/2 (43 ms)
[ RUN      ] Endpoint/SlaveEndpointTest.NoAuthorizer/0
I0323 23:57:25.617976  5599 containerizer.cpp:304] Using isolation { environment_secret, posix/cpu,
posix/mem, filesystem/posix, network/cni }
W0323 23:57:25.618682  5599 backend.cpp:76] Failed to create 'aufs' backend: AufsBackend requires
root privileges
W0323 23:57:25.618717  5599 backend.cpp:76] Failed to create 'bind' backend: BindBackend requires
root privileges
I0323 23:57:25.618753  5599 provisioner.cpp:299] Using default backend 'copy'
I0323 23:57:25.621276  5599 cluster.cpp:460] Creating default 'local' authorizer
I0323 23:57:25.624526  5606 slave.cpp:261] Mesos agent started on (1015)@172.17.0.2:46434
I0323 23:57:25.624562  5606 slave.cpp:262] Flags at startup: --acls="" --appc_simple_discovery_uri_prefix="http://"
--appc_store_dir="/tmp/Endpoint_SlaveEndpointTest_NoAuthorizer_0_vwZUK8/store/appc" --authenticate_http_readonly="true"
--authenticate_http_readwrite="false" --authenticatee="crammd5" --authentication_backoff_factor="1secs"
--authorizer="local" --cgroups_cpu_enable_pids_and_tids_count="false" --cgroups_enable_cfs="false"
--cgroups_hierarchy="/sys/fs/cgroup" --cgroups_limit_swap="false" --cgroups_root="mesos" --container_disk_watch_interval="15secs"
--containerizers="mesos" --credential="/tmp/Endpoint_SlaveEndpointTest_NoAuthorizer_0_vwZUK8/credential"
--default_role="*" --disallow_sharing_agent_pid_namespace="false" --disk_watch_interval="1mins"
--docker="docker" --docker_kill_orphans="true" --docker_registry="https://registry-1.docker.io"
--docker_remove_delay="6hrs" --docker_socket="/var/run/docker.sock" --docker_stop_timeout="0ns"
--docker_store_dir="/tmp/Endpoint_SlaveEndpointTest_NoAuthorizer_0_vwZUK8/store/docker" --docker_volume_checkpoint_dir="/var/run/mesos/isolators/docker/volume"
--enforce_container_disk_quota="false" --executor_registration_timeout="1mins" --executor_reregistration_timeout="2secs"
--executor_shutdown_grace_period="5secs" --fetcher_cache_dir="/tmp/Endpoint_SlaveEndpointTest_NoAuthorizer_0_vwZUK8/fetch"
--fetcher_cache_size="2GB" --frameworks_home="" --gc_delay="1weeks" --gc_disk_headroom="0.1"
--hadoop_home="" --help="false" --hostname_lookup="true" --http_command_executor="false" --http_credentials="/tmp/Endpoint_SlaveEndpointTest_NoAuthorizer_0_vwZUK8/http_credentials"
--http_heartbeat_interval="30secs" --initialize_driver_logging="true" --isolation="posix/cpu,posix/mem"
--launcher="posix" --launcher_dir="/tmp/SRC/build/mesos-1.6.0/_build/sub/src" --logbufsecs="0"
--logging_level="INFO" --max_completed_executors_per_framework="150" --oversubscribed_resources_interval="15secs"
--perf_duration="10secs" --perf_interval="1mins" --port="5051" --qos_correction_interval_min="0ns"
--quiet="false" --reconfiguration_policy="equal" --recover="reconnect" --recovery_timeout="15mins"
--registration_backoff_factor="10ms" --resources="cpus:2;gpus:0;mem:1024;disk:1024;ports:[31000-32000]"
--revocable_cpu_low_priority="true" --runtime_dir="/tmp/Endpoint_SlaveEndpointTest_NoAuthorizer_0_vwZUK8"
--sandbox_directory="/mnt/mesos/sandbox" --strict="true" --switch_user="true" --systemd_enable_support="true"
--systemd_runtime_directory="/run/systemd/system" --version="false" --work_dir="/tmp/Endpoint_SlaveEndpointTest_NoAuthorizer_0_i702sW"
--zk_session_timeout="10secs"
I0323 23:57:25.625102  5606 credentials.hpp:86] Loading credential for authentication from
'/tmp/Endpoint_SlaveEndpointTest_NoAuthorizer_0_vwZUK8/credential'
I0323 23:57:25.625344  5606 slave.cpp:294] Agent using credential for: test-principal
I0323 23:57:25.625375  5606 credentials.hpp:37] Loading credentials for authentication from
'/tmp/Endpoint_SlaveEndpointTest_NoAuthorizer_0_vwZUK8/http_credentials'
I0323 23:57:25.625733  5606 http.cpp:959] Creating default 'basic' HTTP authenticator for
realm 'mesos-agent-readonly'
I0323 23:57:25.626185  5606 disk_profile_adaptor.cpp:80] Creating default disk profile adaptor
module
I0323 23:57:25.627907  5606 slave.cpp:609] Agent resources: [{"name":"cpus","scalar":{"value":2.0},"type":"SCALAR"},{"name":"mem","scalar":{"value":1024.0},"type":"SCALAR"},{"name":"disk","scalar":{"value":1024.0},"type":"SCALAR"},{"name":"ports","ranges":{"range":[{"begin":31000,"end":32000}]},"type":"RANGES"}]
I0323 23:57:25.628199  5606 slave.cpp:617] Agent attributes: [  ]
I0323 23:57:25.628219  5606 slave.cpp:626] Agent hostname: 9de87f4fc233
I0323 23:57:25.628388  5609 task_status_update_manager.cpp:181] Pausing sending task status
updates
I0323 23:57:25.630499  5618 state.cpp:66] Recovering state from '/tmp/Endpoint_SlaveEndpointTest_NoAuthorizer_0_i702sW/meta'
I0323 23:57:25.630859  5618 task_status_update_manager.cpp:207] Recovering task status update
manager
I0323 23:57:25.631140  5622 containerizer.cpp:674] Recovering containerizer
I0323 23:57:25.632933  5623 provisioner.cpp:495] Provisioner recovery complete
I0323 23:57:25.633417  5609 slave.cpp:7212] Finished recovery
I0323 23:57:25.637085  5608 process.cpp:3564] Handling HTTP event for process 'slave(1015)'
with path: '/slave(1015)/monitor/statistics'
I0323 23:57:25.638929  5613 http.cpp:1099] HTTP GET for /slave(1015)/monitor/statistics from
172.17.0.2:53230
I0323 23:57:25.639039  5613 http.cpp:936] Authorizing principal 'test-principal' to GET the
'/monitor/statistics' endpoint
I0323 23:57:25.642407  5621 slave.cpp:919] Agent terminating
[       OK ] Endpoint/SlaveEndpointTest.NoAuthorizer/0 (40 ms)
[ RUN      ] Endpoint/SlaveEndpointTest.NoAuthorizer/1
I0323 23:57:25.657768  5599 containerizer.cpp:304] Using isolation { environment_secret, posix/cpu,
posix/mem, filesystem/posix, network/cni }
W0323 23:57:25.658368  5599 backend.cpp:76] Failed to create 'aufs' backend: AufsBackend requires
root privileges
W0323 23:57:25.658398  5599 backend.cpp:76] Failed to create 'bind' backend: BindBackend requires
root privileges
I0323 23:57:25.658429  5599 provisioner.cpp:299] Using default backend 'copy'
I0323 23:57:25.660583  5599 cluster.cpp:460] Creating default 'local' authorizer
I0323 23:57:25.663882  5604 slave.cpp:261] Mesos agent started on (1016)@172.17.0.2:46434
I0323 23:57:25.663911  5604 slave.cpp:262] Flags at startup: --acls="" --appc_simple_discovery_uri_prefix="http://"
--appc_store_dir="/tmp/Endpoint_SlaveEndpointTest_NoAuthorizer_1_2gv9dW/store/appc" --authenticate_http_readonly="true"
--authenticate_http_readwrite="false" --authenticatee="crammd5" --authentication_backoff_factor="1secs"
--authorizer="local" --cgroups_cpu_enable_pids_and_tids_count="false" --cgroups_enable_cfs="false"
--cgroups_hierarchy="/sys/fs/cgroup" --cgroups_limit_swap="false" --cgroups_root="mesos" --container_disk_watch_interval="15secs"
--containerizers="mesos" --credential="/tmp/Endpoint_SlaveEndpointTest_NoAuthorizer_1_2gv9dW/credential"
--default_role="*" --disallow_sharing_agent_pid_namespace="false" --disk_watch_interval="1mins"
--docker="docker" --docker_kill_orphans="true" --docker_registry="https://registry-1.docker.io"
--docker_remove_delay="6hrs" --docker_socket="/var/run/docker.sock" --docker_stop_timeout="0ns"
--docker_store_dir="/tmp/Endpoint_SlaveEndpointTest_NoAuthorizer_1_2gv9dW/store/docker" --docker_volume_checkpoint_dir="/var/run/mesos/isolators/docker/volume"
--enforce_container_disk_quota="false" --executor_registration_timeout="1mins" --executor_reregistration_timeout="2secs"
--executor_shutdown_grace_period="5secs" --fetcher_cache_dir="/tmp/Endpoint_SlaveEndpointTest_NoAuthorizer_1_2gv9dW/fetch"
--fetcher_cache_size="2GB" --frameworks_home="" --gc_delay="1weeks" --gc_disk_headroom="0.1"
--hadoop_home="" --help="false" --hostname_lookup="true" --http_command_executor="false" --http_credentials="/tmp/Endpoint_SlaveEndpointTest_NoAuthorizer_1_2gv9dW/http_credentials"
--http_heartbeat_interval="30secs" --initialize_driver_logging="true" --isolation="posix/cpu,posix/mem"
--launcher="posix" --launcher_dir="/tmp/SRC/build/mesos-1.6.0/_build/sub/src" --logbufsecs="0"
--logging_level="INFO" --max_completed_executors_per_framework="150" --oversubscribed_resources_interval="15secs"
--perf_duration="10secs" --perf_interval="1mins" --port="5051" --qos_correction_interval_min="0ns"
--quiet="false" --reconfiguration_policy="equal" --recover="reconnect" --recovery_timeout="15mins"
--registration_backoff_factor="10ms" --resources="cpus:2;gpus:0;mem:1024;disk:1024;ports:[31000-32000]"
--revocable_cpu_low_priority="true" --runtime_dir="/tmp/Endpoint_SlaveEndpointTest_NoAuthorizer_1_2gv9dW"
--sandbox_directory="/mnt/mesos/sandbox" --strict="true" --switch_user="true" --systemd_enable_support="true"
--systemd_runtime_directory="/run/systemd/system" --version="false" --work_dir="/tmp/Endpoint_SlaveEndpointTest_NoAuthorizer_1_WLYwQJ"
--zk_session_timeout="10secs"
I0323 23:57:25.664448  5604 credentials.hpp:86] Loading credential for authentication from
'/tmp/Endpoint_SlaveEndpointTest_NoAuthorizer_1_2gv9dW/credential'
I0323 23:57:25.664746  5604 slave.cpp:294] Agent using credential for: test-principal
I0323 23:57:25.664798  5604 credentials.hpp:37] Loading credentials for authentication from
'/tmp/Endpoint_SlaveEndpointTest_NoAuthorizer_1_2gv9dW/http_credentials'
I0323 23:57:25.665212  5604 http.cpp:959] Creating default 'basic' HTTP authenticator for
realm 'mesos-agent-readonly'
I0323 23:57:25.665791  5604 disk_profile_adaptor.cpp:80] Creating default disk profile adaptor
module
I0323 23:57:25.668154  5604 slave.cpp:609] Agent resources: [{"name":"cpus","scalar":{"value":2.0},"type":"SCALAR"},{"name":"mem","scalar":{"value":1024.0},"type":"SCALAR"},{"name":"disk","scalar":{"value":1024.0},"type":"SCALAR"},{"name":"ports","ranges":{"range":[{"begin":31000,"end":32000}]},"type":"RANGES"}]
I0323 23:57:25.668457  5604 slave.cpp:617] Agent attributes: [  ]
I0323 23:57:25.668476  5604 slave.cpp:626] Agent hostname: 9de87f4fc233
I0323 23:57:25.668628  5617 task_status_update_manager.cpp:181] Pausing sending task status
updates
I0323 23:57:25.670449  5619 state.cpp:66] Recovering state from '/tmp/Endpoint_SlaveEndpointTest_NoAuthorizer_1_WLYwQJ/meta'
I0323 23:57:25.670816  5614 task_status_update_manager.cpp:207] Recovering task status update
manager
I0323 23:57:25.671079  5609 containerizer.cpp:674] Recovering containerizer
I0323 23:57:25.672794  5605 provisioner.cpp:495] Provisioner recovery complete
I0323 23:57:25.673238  5623 slave.cpp:7212] Finished recovery
I0323 23:57:25.676822  5611 process.cpp:3564] Handling HTTP event for process 'slave(1016)'
with path: '/slave(1016)/monitor/statistics.json'
I0323 23:57:25.678987  5600 http.cpp:1099] HTTP GET for /slave(1016)/monitor/statistics.json
from 172.17.0.2:53232
I0323 23:57:25.679097  5600 http.cpp:936] Authorizing principal 'test-principal' to GET the
'/monitor/statistics.json' endpoint
I0323 23:57:25.682212  5621 slave.cpp:919] Agent terminating
[       OK ] Endpoint/SlaveEndpointTest.NoAuthorizer/1 (39 ms)
[ RUN      ] Endpoint/SlaveEndpointTest.NoAuthorizer/2
I0323 23:57:25.696516  5599 containerizer.cpp:304] Using isolation { environment_secret, posix/cpu,
posix/mem, filesystem/posix, network/cni }
W0323 23:57:25.697520  5599 backend.cpp:76] Failed to create 'aufs' backend: AufsBackend requires
root privileges
W0323 23:57:25.697569  5599 backend.cpp:76] Failed to create 'bind' backend: BindBackend requires
root privileges
I0323 23:57:25.697616  5599 provisioner.cpp:299] Using default backend 'copy'
I0323 23:57:25.700814  5599 cluster.cpp:460] Creating default 'local' authorizer
I0323 23:57:25.703796  5608 slave.cpp:261] Mesos agent started on (1017)@172.17.0.2:46434
I0323 23:57:25.703830  5608 slave.cpp:262] Flags at startup: --acls="" --appc_simple_discovery_uri_prefix="http://"
--appc_store_dir="/tmp/Endpoint_SlaveEndpointTest_NoAuthorizer_2_GpAG3J/store/appc" --authenticate_http_readonly="true"
--authenticate_http_readwrite="false" --authenticatee="crammd5" --authentication_backoff_factor="1secs"
--authorizer="local" --cgroups_cpu_enable_pids_and_tids_count="false" --cgroups_enable_cfs="false"
--cgroups_hierarchy="/sys/fs/cgroup" --cgroups_limit_swap="false" --cgroups_root="mesos" --container_disk_watch_interval="15secs"
--containerizers="mesos" --credential="/tmp/Endpoint_SlaveEndpointTest_NoAuthorizer_2_GpAG3J/credential"
--default_role="*" --disallow_sharing_agent_pid_namespace="false" --disk_watch_interval="1mins"
--docker="docker" --docker_kill_orphans="true" --docker_registry="https://registry-1.docker.io"
--docker_remove_delay="6hrs" --docker_socket="/var/run/docker.sock" --docker_stop_timeout="0ns"
--docker_store_dir="/tmp/Endpoint_SlaveEndpointTest_NoAuthorizer_2_GpAG3J/store/docker" --docker_volume_checkpoint_dir="/var/run/mesos/isolators/docker/volume"
--enforce_container_disk_quota="false" --executor_registration_timeout="1mins" --executor_reregistration_timeout="2secs"
--executor_shutdown_grace_period="5secs" --fetcher_cache_dir="/tmp/Endpoint_SlaveEndpointTest_NoAuthorizer_2_GpAG3J/fetch"
--fetcher_cache_size="2GB" --frameworks_home="" --gc_delay="1weeks" --gc_disk_headroom="0.1"
--hadoop_home="" --help="false" --hostname_lookup="true" --http_command_executor="false" --http_credentials="/tmp/Endpoint_SlaveEndpointTest_NoAuthorizer_2_GpAG3J/http_credentials"
--http_heartbeat_interval="30secs" --initialize_driver_logging="true" --isolation="posix/cpu,posix/mem"
--launcher="posix" --launcher_dir="/tmp/SRC/build/mesos-1.6.0/_build/sub/src" --logbufsecs="0"
--logging_level="INFO" --max_completed_executors_per_framework="150" --oversubscribed_resources_interval="15secs"
--perf_duration="10secs" --perf_interval="1mins" --port="5051" --qos_correction_interval_min="0ns"
--quiet="false" --reconfiguration_policy="equal" --recover="reconnect" --recovery_timeout="15mins"
--registration_backoff_factor="10ms" --resources="cpus:2;gpus:0;mem:1024;disk:1024;ports:[31000-32000]"
--revocable_cpu_low_priority="true" --runtime_dir="/tmp/Endpoint_SlaveEndpointTest_NoAuthorizer_2_GpAG3J"
--sandbox_directory="/mnt/mesos/sandbox" --strict="true" --switch_user="true" --systemd_enable_support="true"
--systemd_runtime_directory="/run/systemd/system" --version="false" --work_dir="/tmp/Endpoint_SlaveEndpointTest_NoAuthorizer_2_6RvwAx"
--zk_session_timeout="10secs"
I0323 23:57:25.704313  5608 credentials.hpp:86] Loading credential for authentication from
'/tmp/Endpoint_SlaveEndpointTest_NoAuthorizer_2_GpAG3J/credential'
I0323 23:57:25.704490  5608 slave.cpp:294] Agent using credential for: test-principal
I0323 23:57:25.704517  5608 credentials.hpp:37] Loading credentials for authentication from
'/tmp/Endpoint_SlaveEndpointTest_NoAuthorizer_2_GpAG3J/http_credentials'
I0323 23:57:25.704773  5608 http.cpp:959] Creating default 'basic' HTTP authenticator for
realm 'mesos-agent-readonly'
I0323 23:57:25.705138  5608 disk_profile_adaptor.cpp:80] Creating default disk profile adaptor
module
I0323 23:57:25.706640  5608 slave.cpp:609] Agent resources: [{"name":"cpus","scalar":{"value":2.0},"type":"SCALAR"},{"name":"mem","scalar":{"value":1024.0},"type":"SCALAR"},{"name":"disk","scalar":{"value":1024.0},"type":"SCALAR"},{"name":"ports","ranges":{"range":[{"begin":31000,"end":32000}]},"type":"RANGES"}]
I0323 23:57:25.706888  5608 slave.cpp:617] Agent attributes: [  ]
I0323 23:57:25.706905  5608 slave.cpp:626] Agent hostname: 9de87f4fc233
I0323 23:57:25.707074  5620 task_status_update_manager.cpp:181] Pausing sending task status
updates
I0323 23:57:25.708780  5617 state.cpp:66] Recovering state from '/tmp/Endpoint_SlaveEndpointTest_NoAuthorizer_2_6RvwAx/meta'
I0323 23:57:25.709116  5605 task_status_update_manager.cpp:207] Recovering task status update
manager
I0323 23:57:25.709357  5603 containerizer.cpp:674] Recovering containerizer
I0323 23:57:25.711004  5609 provisioner.cpp:495] Provisioner recovery complete
I0323 23:57:25.711407  5614 slave.cpp:7212] Finished recovery
I0323 23:57:25.714797  5604 process.cpp:3564] Handling HTTP event for process 'slave(1017)'
with path: '/slave(1017)/containers'
I0323 23:57:25.716655  5618 http.cpp:1099] HTTP GET for /slave(1017)/containers from 172.17.0.2:53234
I0323 23:57:25.716753  5618 http.cpp:936] Authorizing principal 'test-principal' to GET the
'/containers' endpoint
I0323 23:57:25.721079  5610 slave.cpp:919] Agent terminating
[       OK ] Endpoint/SlaveEndpointTest.NoAuthorizer/2 (39 ms)
[----------] 9 tests from Endpoint/SlaveEndpointTest (376 ms total)

[----------] 2 tests from ContainerizerType/DefaultContainerDNSFlagTest
[ RUN      ] ContainerizerType/DefaultContainerDNSFlagTest.ValidateFlag/0
[       OK ] ContainerizerType/DefaultContainerDNSFlagTest.ValidateFlag/0 (11 ms)
[ RUN      ] ContainerizerType/DefaultContainerDNSFlagTest.ValidateFlag/1
[       OK ] ContainerizerType/DefaultContainerDNSFlagTest.ValidateFlag/1 (11 ms)
[----------] 2 tests from ContainerizerType/DefaultContainerDNSFlagTest (22 ms total)

[----------] Global test environment tear-down
[==========] 1939 tests from 194 test cases ran. (790877 ms total)
[  PASSED  ] 1938 tests.
[  FAILED  ] 1 test, listed below:
[  FAILED  ] HealthCheckTest.HealthyTaskViaHTTPWithoutType

 1 FAILED TEST
  YOU HAVE 23 DISABLED TESTS

I0323 23:57:25.819818  5624 process.cpp:929] Stopped the socket accept loop
Makefile:14626: recipe for target 'check-local' failed
make[4]: *** [check-local] Error 1
make[4]: Leaving directory '/tmp/SRC/build/mesos-1.6.0/_build/sub/src'
Makefile:13759: recipe for target 'check-am' failed
make[3]: *** [check-am] Error 2
make[3]: Leaving directory '/tmp/SRC/build/mesos-1.6.0/_build/sub/src'
Makefile:13763: recipe for target 'check' failed
make[2]: *** [check] Error 2
make[2]: Leaving directory '/tmp/SRC/build/mesos-1.6.0/_build/sub/src'
Makefile:774: recipe for target 'check-recursive' failed
make[1]: *** [check-recursive] Error 1
make[1]: Leaving directory '/tmp/SRC/build/mesos-1.6.0/_build/sub'
Makefile:980: recipe for target 'distcheck' failed
make: *** [distcheck] Error 1
Untagged: mesos/mesos-build:ubuntu-16.04
Untagged: mesos/mesos-build@sha256:3643a2cc107ff04ee2d7628a48cff8bee6186b98bcaa5ce36f685d28d8b04dae
Deleted: sha256:df13eb8a4c4b15c8e09329265603b7fcacc7753bc731057e91c06554acab5a10
Deleted: sha256:f50f81f71ec4d5b88ef535ef34e07a1abfe00cec71bd4518a0bee2348c0c6229
Deleted: sha256:334c2f430d63071d6f077369f301016b59d5421b28a6df435c63aa2209f480e7
Deleted: sha256:7a41f53b59bb61bde6d3dc9a41c4dd87e6ff5141b36da06529c2cb32e6733d63
Deleted: sha256:4b569c802f795bb918a504e6ce315cddecfb633aee338ee535e7cfbe5c2801a3
Deleted: sha256:77e6ddba346d8ad1e436256f6373dede5af4002006981b7d4116c561c759cefa
Deleted: sha256:8db758ab2fdb54da0aec53aeac876934337e6170f5a8c8872b3d4171e3d465b7
Deleted: sha256:a7fc6b405fe8ef71edfa6163d1dc9f1cb1df426049eefaa7d388e9df21a061ad
Deleted: sha256:5a3e35538f7f2e2727c8ac92f08c30002b9e8a77737de0dab91244344d59f69b
Deleted: sha256:ff986b10a018b48074e6d3a68b39aad8ccc002cdad912d4148c0f92b3729323e
Build step 'Execute shell' marked build as failure


Mime
View raw message