mesos-builds mailing list archives

Site index · List index
Message view « Date » · « Thread »
Top « Date » · « Thread »
From Apache Jenkins Server <jenk...@builds.apache.org>
Subject Build failed in Jenkins: Mesos-Reviewbot #21880
Date Sat, 10 Mar 2018 03:13:24 GMT
See <https://builds.apache.org/job/Mesos-Reviewbot/21880/display/redirect?page=changes>

Changes:

[andrew] Windows: Changed sharing semantics in `get_handle_follow`.

------------------------------------------
[...truncated 37.09 MB...]
I0310 03:13:15.910748   620 slave.cpp:924] Agent terminating
[       OK ] Endpoint/SlaveEndpointTest.AuthorizedRequest/0 (54 ms)
[ RUN      ] Endpoint/SlaveEndpointTest.AuthorizedRequest/1
I0310 03:13:15.931046   613 containerizer.cpp:304] Using isolation { environment_secret, posix/cpu,
posix/mem, filesystem/posix, network/cni }
W0310 03:13:15.931813   613 backend.cpp:76] Failed to create 'aufs' backend: AufsBackend requires
root privileges
W0310 03:13:15.931851   613 backend.cpp:76] Failed to create 'bind' backend: BindBackend requires
root privileges
I0310 03:13:15.931913   613 provisioner.cpp:299] Using default backend 'copy'
I0310 03:13:15.938187   615 slave.cpp:264] Mesos agent started on (1002)@172.17.0.5:41113
I0310 03:13:15.938244   615 slave.cpp:265] Flags at startup: --acls="" --appc_simple_discovery_uri_prefix="http://"
--appc_store_dir="/tmp/Endpoint_SlaveEndpointTest_AuthorizedRequest_1_1l15sa/store/appc" --authenticate_http_readonly="true"
--authenticate_http_readwrite="false" --authenticatee="crammd5" --authentication_backoff_factor="1secs"
--authorizer="local" --cgroups_cpu_enable_pids_and_tids_count="false" --cgroups_enable_cfs="false"
--cgroups_hierarchy="/sys/fs/cgroup" --cgroups_limit_swap="false" --cgroups_root="mesos" --container_disk_watch_interval="15secs"
--containerizers="mesos" --credential="/tmp/Endpoint_SlaveEndpointTest_AuthorizedRequest_1_1l15sa/credential"
--default_role="*" --disallow_sharing_agent_pid_namespace="false" --disk_watch_interval="1mins"
--docker="docker" --docker_kill_orphans="true" --docker_registry="https://registry-1.docker.io"
--docker_remove_delay="6hrs" --docker_socket="/var/run/docker.sock" --docker_stop_timeout="0ns"
--docker_store_dir="/tmp/Endpoint_SlaveEndpointTest_AuthorizedRequest_1_1l15sa/store/docker"
--docker_volume_checkpoint_dir="/var/run/mesos/isolators/docker/volume" --enforce_container_disk_quota="false"
--executor_registration_timeout="1mins" --executor_reregistration_timeout="2secs" --executor_shutdown_grace_period="5secs"
--fetcher_cache_dir="/tmp/Endpoint_SlaveEndpointTest_AuthorizedRequest_1_1l15sa/fetch" --fetcher_cache_size="2GB"
--frameworks_home="" --gc_delay="1weeks" --gc_disk_headroom="0.1" --hadoop_home="" --help="false"
--hostname_lookup="true" --http_command_executor="false" --http_credentials="/tmp/Endpoint_SlaveEndpointTest_AuthorizedRequest_1_1l15sa/http_credentials"
--http_heartbeat_interval="30secs" --initialize_driver_logging="true" --isolation="posix/cpu,posix/mem"
--launcher="posix" --launcher_dir="/tmp/SRC/build/mesos-1.6.0/_build/sub/src" --logbufsecs="0"
--logging_level="INFO" --max_completed_executors_per_framework="150" --oversubscribed_resources_interval="15secs"
--perf_duration="10secs" --perf_interval="1mins" --port="5051" --qos_correction_interval_min="0ns"
--quiet="false" --reconfiguration_policy="equal" --recover="reconnect" --recovery_timeout="15mins"
--registration_backoff_factor="10ms" --resources="cpus:2;gpus:0;mem:1024;disk:1024;ports:[31000-32000]"
--revocable_cpu_low_priority="true" --runtime_dir="/tmp/Endpoint_SlaveEndpointTest_AuthorizedRequest_1_1l15sa"
--sandbox_directory="/mnt/mesos/sandbox" --strict="true" --switch_user="true" --systemd_enable_support="true"
--systemd_runtime_directory="/run/systemd/system" --version="false" --work_dir="/tmp/Endpoint_SlaveEndpointTest_AuthorizedRequest_1_6tXjJG"
--zk_session_timeout="10secs"
I0310 03:13:15.938946   615 credentials.hpp:86] Loading credential for authentication from
'/tmp/Endpoint_SlaveEndpointTest_AuthorizedRequest_1_1l15sa/credential'
I0310 03:13:15.939187   615 slave.cpp:297] Agent using credential for: test-principal
I0310 03:13:15.939222   615 credentials.hpp:37] Loading credentials for authentication from
'/tmp/Endpoint_SlaveEndpointTest_AuthorizedRequest_1_1l15sa/http_credentials'
I0310 03:13:15.939555   615 http.cpp:1045] Creating default 'basic' HTTP authenticator for
realm 'mesos-agent-readonly'
I0310 03:13:15.941995   615 slave.cpp:614] Agent resources: [{"name":"cpus","scalar":{"value":2.0},"type":"SCALAR"},{"name":"mem","scalar":{"value":1024.0},"type":"SCALAR"},{"name":"disk","scalar":{"value":1024.0},"type":"SCALAR"},{"name":"ports","ranges":{"range":[{"begin":31000,"end":32000}]},"type":"RANGES"}]
I0310 03:13:15.942306   615 slave.cpp:622] Agent attributes: [  ]
I0310 03:13:15.942329   615 slave.cpp:631] Agent hostname: e784e345f803
I0310 03:13:15.942543   633 task_status_update_manager.cpp:181] Pausing sending task status
updates
I0310 03:13:15.945309   623 state.cpp:66] Recovering state from '/tmp/Endpoint_SlaveEndpointTest_AuthorizedRequest_1_6tXjJG/meta'
I0310 03:13:15.945843   627 task_status_update_manager.cpp:207] Recovering task status update
manager
I0310 03:13:15.946156   634 containerizer.cpp:674] Recovering containerizer
I0310 03:13:15.948514   622 provisioner.cpp:495] Provisioner recovery complete
I0310 03:13:15.949282   619 slave.cpp:7217] Finished recovery
I0310 03:13:15.953997   620 process.cpp:3564] Handling HTTP event for process 'slave(1002)'
with path: '/slave(1002)/monitor/statistics.json'
I0310 03:13:15.955998   617 http.cpp:1185] HTTP GET for /slave(1002)/monitor/statistics.json
from 172.17.0.5:37584
I0310 03:13:15.956095   617 http.cpp:976] Authorizing principal 'test-principal' to GET the
'/monitor/statistics.json' endpoint
I0310 03:13:15.960067   621 slave.cpp:924] Agent terminating
[       OK ] Endpoint/SlaveEndpointTest.AuthorizedRequest/1 (47 ms)
[ RUN      ] Endpoint/SlaveEndpointTest.AuthorizedRequest/2
I0310 03:13:15.977680   613 containerizer.cpp:304] Using isolation { environment_secret, posix/cpu,
posix/mem, filesystem/posix, network/cni }
W0310 03:13:15.978529   613 backend.cpp:76] Failed to create 'aufs' backend: AufsBackend requires
root privileges
W0310 03:13:15.978571   613 backend.cpp:76] Failed to create 'bind' backend: BindBackend requires
root privileges
I0310 03:13:15.978615   613 provisioner.cpp:299] Using default backend 'copy'
I0310 03:13:15.984887   620 slave.cpp:264] Mesos agent started on (1003)@172.17.0.5:41113
I0310 03:13:15.984949   620 slave.cpp:265] Flags at startup: --acls="" --appc_simple_discovery_uri_prefix="http://"
--appc_store_dir="/tmp/Endpoint_SlaveEndpointTest_AuthorizedRequest_2_KZgXM5/store/appc" --authenticate_http_readonly="true"
--authenticate_http_readwrite="false" --authenticatee="crammd5" --authentication_backoff_factor="1secs"
--authorizer="local" --cgroups_cpu_enable_pids_and_tids_count="false" --cgroups_enable_cfs="false"
--cgroups_hierarchy="/sys/fs/cgroup" --cgroups_limit_swap="false" --cgroups_root="mesos" --container_disk_watch_interval="15secs"
--containerizers="mesos" --credential="/tmp/Endpoint_SlaveEndpointTest_AuthorizedRequest_2_KZgXM5/credential"
--default_role="*" --disallow_sharing_agent_pid_namespace="false" --disk_watch_interval="1mins"
--docker="docker" --docker_kill_orphans="true" --docker_registry="https://registry-1.docker.io"
--docker_remove_delay="6hrs" --docker_socket="/var/run/docker.sock" --docker_stop_timeout="0ns"
--docker_store_dir="/tmp/Endpoint_SlaveEndpointTest_AuthorizedRequest_2_KZgXM5/store/docker"
--docker_volume_checkpoint_dir="/var/run/mesos/isolators/docker/volume" --enforce_container_disk_quota="false"
--executor_registration_timeout="1mins" --executor_reregistration_timeout="2secs" --executor_shutdown_grace_period="5secs"
--fetcher_cache_dir="/tmp/Endpoint_SlaveEndpointTest_AuthorizedRequest_2_KZgXM5/fetch" --fetcher_cache_size="2GB"
--frameworks_home="" --gc_delay="1weeks" --gc_disk_headroom="0.1" --hadoop_home="" --help="false"
--hostname_lookup="true" --http_command_executor="false" --http_credentials="/tmp/Endpoint_SlaveEndpointTest_AuthorizedRequest_2_KZgXM5/http_credentials"
--http_heartbeat_interval="30secs" --initialize_driver_logging="true" --isolation="posix/cpu,posix/mem"
--launcher="posix" --launcher_dir="/tmp/SRC/build/mesos-1.6.0/_build/sub/src" --logbufsecs="0"
--logging_level="INFO" --max_completed_executors_per_framework="150" --oversubscribed_resources_interval="15secs"
--perf_duration="10secs" --perf_interval="1mins" --port="5051" --qos_correction_interval_min="0ns"
--quiet="false" --reconfiguration_policy="equal" --recover="reconnect" --recovery_timeout="15mins"
--registration_backoff_factor="10ms" --resources="cpus:2;gpus:0;mem:1024;disk:1024;ports:[31000-32000]"
--revocable_cpu_low_priority="true" --runtime_dir="/tmp/Endpoint_SlaveEndpointTest_AuthorizedRequest_2_KZgXM5"
--sandbox_directory="/mnt/mesos/sandbox" --strict="true" --switch_user="true" --systemd_enable_support="true"
--systemd_runtime_directory="/run/systemd/system" --version="false" --work_dir="/tmp/Endpoint_SlaveEndpointTest_AuthorizedRequest_2_QoVwWB"
--zk_session_timeout="10secs"
I0310 03:13:15.985754   620 credentials.hpp:86] Loading credential for authentication from
'/tmp/Endpoint_SlaveEndpointTest_AuthorizedRequest_2_KZgXM5/credential'
I0310 03:13:15.986078   620 slave.cpp:297] Agent using credential for: test-principal
I0310 03:13:15.986120   620 credentials.hpp:37] Loading credentials for authentication from
'/tmp/Endpoint_SlaveEndpointTest_AuthorizedRequest_2_KZgXM5/http_credentials'
I0310 03:13:15.986541   620 http.cpp:1045] Creating default 'basic' HTTP authenticator for
realm 'mesos-agent-readonly'
I0310 03:13:15.989665   620 slave.cpp:614] Agent resources: [{"name":"cpus","scalar":{"value":2.0},"type":"SCALAR"},{"name":"mem","scalar":{"value":1024.0},"type":"SCALAR"},{"name":"disk","scalar":{"value":1024.0},"type":"SCALAR"},{"name":"ports","ranges":{"range":[{"begin":31000,"end":32000}]},"type":"RANGES"}]
I0310 03:13:15.990061   620 slave.cpp:622] Agent attributes: [  ]
I0310 03:13:15.990087   620 slave.cpp:631] Agent hostname: e784e345f803
I0310 03:13:15.990373   617 task_status_update_manager.cpp:181] Pausing sending task status
updates
I0310 03:13:15.993238   616 state.cpp:66] Recovering state from '/tmp/Endpoint_SlaveEndpointTest_AuthorizedRequest_2_QoVwWB/meta'
I0310 03:13:15.993757   616 task_status_update_manager.cpp:207] Recovering task status update
manager
I0310 03:13:15.994186   636 containerizer.cpp:674] Recovering containerizer
I0310 03:13:15.996994   621 provisioner.cpp:495] Provisioner recovery complete
I0310 03:13:15.997691   628 slave.cpp:7217] Finished recovery
I0310 03:13:16.003635   627 process.cpp:3564] Handling HTTP event for process 'slave(1003)'
with path: '/slave(1003)/containers'
I0310 03:13:16.006709   629 http.cpp:1185] HTTP GET for /slave(1003)/containers from 172.17.0.5:37586
I0310 03:13:16.006862   629 http.cpp:976] Authorizing principal 'test-principal' to GET the
'/containers' endpoint
I0310 03:13:16.013914   613 slave.cpp:924] Agent terminating
[       OK ] Endpoint/SlaveEndpointTest.AuthorizedRequest/2 (58 ms)
[ RUN      ] Endpoint/SlaveEndpointTest.UnauthorizedRequest/0
I0310 03:13:16.037528   613 containerizer.cpp:304] Using isolation { environment_secret, posix/cpu,
posix/mem, filesystem/posix, network/cni }
W0310 03:13:16.038444   613 backend.cpp:76] Failed to create 'aufs' backend: AufsBackend requires
root privileges
W0310 03:13:16.038492   613 backend.cpp:76] Failed to create 'bind' backend: BindBackend requires
root privileges
I0310 03:13:16.038542   613 provisioner.cpp:299] Using default backend 'copy'
I0310 03:13:16.045702   633 slave.cpp:264] Mesos agent started on (1004)@172.17.0.5:41113
I0310 03:13:16.045749   633 slave.cpp:265] Flags at startup: --acls="" --appc_simple_discovery_uri_prefix="http://"
--appc_store_dir="/tmp/Endpoint_SlaveEndpointTest_UnauthorizedRequest_0_jjvRC1/store/appc"
--authenticate_http_readonly="true" --authenticate_http_readwrite="false" --authenticatee="crammd5"
--authentication_backoff_factor="1secs" --authorizer="local" --cgroups_cpu_enable_pids_and_tids_count="false"
--cgroups_enable_cfs="false" --cgroups_hierarchy="/sys/fs/cgroup" --cgroups_limit_swap="false"
--cgroups_root="mesos" --container_disk_watch_interval="15secs" --containerizers="mesos" --credential="/tmp/Endpoint_SlaveEndpointTest_UnauthorizedRequest_0_jjvRC1/credential"
--default_role="*" --disallow_sharing_agent_pid_namespace="false" --disk_watch_interval="1mins"
--docker="docker" --docker_kill_orphans="true" --docker_registry="https://registry-1.docker.io"
--docker_remove_delay="6hrs" --docker_socket="/var/run/docker.sock" --docker_stop_timeout="0ns"
--docker_store_dir="/tmp/Endpoint_SlaveEndpointTest_UnauthorizedRequest_0_jjvRC1/store/docker"
--docker_volume_checkpoint_dir="/var/run/mesos/isolators/docker/volume" --enforce_container_disk_quota="false"
--executor_registration_timeout="1mins" --executor_reregistration_timeout="2secs" --executor_shutdown_grace_period="5secs"
--fetcher_cache_dir="/tmp/Endpoint_SlaveEndpointTest_UnauthorizedRequest_0_jjvRC1/fetch" --fetcher_cache_size="2GB"
--frameworks_home="" --gc_delay="1weeks" --gc_disk_headroom="0.1" --hadoop_home="" --help="false"
--hostname_lookup="true" --http_command_executor="false" --http_credentials="/tmp/Endpoint_SlaveEndpointTest_UnauthorizedRequest_0_jjvRC1/http_credentials"
--http_heartbeat_interval="30secs" --initialize_driver_logging="true" --isolation="posix/cpu,posix/mem"
--launcher="posix" --launcher_dir="/tmp/SRC/build/mesos-1.6.0/_build/sub/src" --logbufsecs="0"
--logging_level="INFO" --max_completed_executors_per_framework="150" --oversubscribed_resources_interval="15secs"
--perf_duration="10secs" --perf_interval="1mins" --port="5051" --qos_correction_interval_min="0ns"
--quiet="false" --reconfiguration_policy="equal" --recover="reconnect" --recovery_timeout="15mins"
--registration_backoff_factor="10ms" --resources="cpus:2;gpus:0;mem:1024;disk:1024;ports:[31000-32000]"
--revocable_cpu_low_priority="true" --runtime_dir="/tmp/Endpoint_SlaveEndpointTest_UnauthorizedRequest_0_jjvRC1"
--sandbox_directory="/mnt/mesos/sandbox" --strict="true" --switch_user="true" --systemd_enable_support="true"
--systemd_runtime_directory="/run/systemd/system" --version="false" --work_dir="/tmp/Endpoint_SlaveEndpointTest_UnauthorizedRequest_0_pJB1Dx"
--zk_session_timeout="10secs"
I0310 03:13:16.046371   633 credentials.hpp:86] Loading credential for authentication from
'/tmp/Endpoint_SlaveEndpointTest_UnauthorizedRequest_0_jjvRC1/credential'
I0310 03:13:16.046630   633 slave.cpp:297] Agent using credential for: test-principal
I0310 03:13:16.046669   633 credentials.hpp:37] Loading credentials for authentication from
'/tmp/Endpoint_SlaveEndpointTest_UnauthorizedRequest_0_jjvRC1/http_credentials'
I0310 03:13:16.047040   633 http.cpp:1045] Creating default 'basic' HTTP authenticator for
realm 'mesos-agent-readonly'
I0310 03:13:16.049684   633 slave.cpp:614] Agent resources: [{"name":"cpus","scalar":{"value":2.0},"type":"SCALAR"},{"name":"mem","scalar":{"value":1024.0},"type":"SCALAR"},{"name":"disk","scalar":{"value":1024.0},"type":"SCALAR"},{"name":"ports","ranges":{"range":[{"begin":31000,"end":32000}]},"type":"RANGES"}]
I0310 03:13:16.050020   633 slave.cpp:622] Agent attributes: [  ]
I0310 03:13:16.050043   633 slave.cpp:631] Agent hostname: e784e345f803
I0310 03:13:16.050294   615 task_status_update_manager.cpp:181] Pausing sending task status
updates
I0310 03:13:16.052908   623 state.cpp:66] Recovering state from '/tmp/Endpoint_SlaveEndpointTest_UnauthorizedRequest_0_pJB1Dx/meta'
I0310 03:13:16.053508   632 task_status_update_manager.cpp:207] Recovering task status update
manager
I0310 03:13:16.053933   630 containerizer.cpp:674] Recovering containerizer
I0310 03:13:16.056638   622 provisioner.cpp:495] Provisioner recovery complete
I0310 03:13:16.057324   637 slave.cpp:7217] Finished recovery
I0310 03:13:16.062824   625 process.cpp:3564] Handling HTTP event for process 'slave(1004)'
with path: '/slave(1004)/monitor/statistics'
I0310 03:13:16.065341   618 http.cpp:1185] HTTP GET for /slave(1004)/monitor/statistics from
172.17.0.5:37588
I0310 03:13:16.065497   618 http.cpp:976] Authorizing principal 'test-principal' to GET the
'/monitor/statistics' endpoint
I0310 03:13:16.068105   616 slave.cpp:924] Agent terminating
[       OK ] Endpoint/SlaveEndpointTest.UnauthorizedRequest/0 (51 ms)
[ RUN      ] Endpoint/SlaveEndpointTest.UnauthorizedRequest/1
I0310 03:13:16.087208   613 containerizer.cpp:304] Using isolation { environment_secret, posix/cpu,
posix/mem, filesystem/posix, network/cni }
W0310 03:13:16.087901   613 backend.cpp:76] Failed to create 'aufs' backend: AufsBackend requires
root privileges
W0310 03:13:16.087932   613 backend.cpp:76] Failed to create 'bind' backend: BindBackend requires
root privileges
I0310 03:13:16.087970   613 provisioner.cpp:299] Using default backend 'copy'
I0310 03:13:16.093305   624 slave.cpp:264] Mesos agent started on (1005)@172.17.0.5:41113
I0310 03:13:16.093338   624 slave.cpp:265] Flags at startup: --acls="" --appc_simple_discovery_uri_prefix="http://"
--appc_store_dir="/tmp/Endpoint_SlaveEndpointTest_UnauthorizedRequest_1_6YR9WX/store/appc"
--authenticate_http_readonly="true" --authenticate_http_readwrite="false" --authenticatee="crammd5"
--authentication_backoff_factor="1secs" --authorizer="local" --cgroups_cpu_enable_pids_and_tids_count="false"
--cgroups_enable_cfs="false" --cgroups_hierarchy="/sys/fs/cgroup" --cgroups_limit_swap="false"
--cgroups_root="mesos" --container_disk_watch_interval="15secs" --containerizers="mesos" --credential="/tmp/Endpoint_SlaveEndpointTest_UnauthorizedRequest_1_6YR9WX/credential"
--default_role="*" --disallow_sharing_agent_pid_namespace="false" --disk_watch_interval="1mins"
--docker="docker" --docker_kill_orphans="true" --docker_registry="https://registry-1.docker.io"
--docker_remove_delay="6hrs" --docker_socket="/var/run/docker.sock" --docker_stop_timeout="0ns"
--docker_store_dir="/tmp/Endpoint_SlaveEndpointTest_UnauthorizedRequest_1_6YR9WX/store/docker"
--docker_volume_checkpoint_dir="/var/run/mesos/isolators/docker/volume" --enforce_container_disk_quota="false"
--executor_registration_timeout="1mins" --executor_reregistration_timeout="2secs" --executor_shutdown_grace_period="5secs"
--fetcher_cache_dir="/tmp/Endpoint_SlaveEndpointTest_UnauthorizedRequest_1_6YR9WX/fetch" --fetcher_cache_size="2GB"
--frameworks_home="" --gc_delay="1weeks" --gc_disk_headroom="0.1" --hadoop_home="" --help="false"
--hostname_lookup="true" --http_command_executor="false" --http_credentials="/tmp/Endpoint_SlaveEndpointTest_UnauthorizedRequest_1_6YR9WX/http_credentials"
--http_heartbeat_interval="30secs" --initialize_driver_logging="true" --isolation="posix/cpu,posix/mem"
--launcher="posix" --launcher_dir="/tmp/SRC/build/mesos-1.6.0/_build/sub/src" --logbufsecs="0"
--logging_level="INFO" --max_completed_executors_per_framework="150" --oversubscribed_resources_interval="15secs"
--perf_duration="10secs" --perf_interval="1mins" --port="5051" --qos_correction_interval_min="0ns"
--quiet="false" --reconfiguration_policy="equal" --recover="reconnect" --recovery_timeout="15mins"
--registration_backoff_factor="10ms" --resources="cpus:2;gpus:0;mem:1024;disk:1024;ports:[31000-32000]"
--revocable_cpu_low_priority="true" --runtime_dir="/tmp/Endpoint_SlaveEndpointTest_UnauthorizedRequest_1_6YR9WX"
--sandbox_directory="/mnt/mesos/sandbox" --strict="true" --switch_user="true" --systemd_enable_support="true"
--systemd_runtime_directory="/run/systemd/system" --version="false" --work_dir="/tmp/Endpoint_SlaveEndpointTest_UnauthorizedRequest_1_ATx3Qt"
--zk_session_timeout="10secs"
I0310 03:13:16.093814   624 credentials.hpp:86] Loading credential for authentication from
'/tmp/Endpoint_SlaveEndpointTest_UnauthorizedRequest_1_6YR9WX/credential'
I0310 03:13:16.094015   624 slave.cpp:297] Agent using credential for: test-principal
I0310 03:13:16.094044   624 credentials.hpp:37] Loading credentials for authentication from
'/tmp/Endpoint_SlaveEndpointTest_UnauthorizedRequest_1_6YR9WX/http_credentials'
I0310 03:13:16.094346   624 http.cpp:1045] Creating default 'basic' HTTP authenticator for
realm 'mesos-agent-readonly'
I0310 03:13:16.096338   624 slave.cpp:614] Agent resources: [{"name":"cpus","scalar":{"value":2.0},"type":"SCALAR"},{"name":"mem","scalar":{"value":1024.0},"type":"SCALAR"},{"name":"disk","scalar":{"value":1024.0},"type":"SCALAR"},{"name":"ports","ranges":{"range":[{"begin":31000,"end":32000}]},"type":"RANGES"}]
I0310 03:13:16.096616   624 slave.cpp:622] Agent attributes: [  ]
I0310 03:13:16.096635   624 slave.cpp:631] Agent hostname: e784e345f803
I0310 03:13:16.096804   617 task_status_update_manager.cpp:181] Pausing sending task status
updates
I0310 03:13:16.099524   625 state.cpp:66] Recovering state from '/tmp/Endpoint_SlaveEndpointTest_UnauthorizedRequest_1_ATx3Qt/meta'
I0310 03:13:16.099910   625 task_status_update_manager.cpp:207] Recovering task status update
manager
I0310 03:13:16.100248   615 containerizer.cpp:674] Recovering containerizer
I0310 03:13:16.102588   630 provisioner.cpp:495] Provisioner recovery complete
I0310 03:13:16.103193   631 slave.cpp:7217] Finished recovery
I0310 03:13:16.107151   628 process.cpp:3564] Handling HTTP event for process 'slave(1005)'
with path: '/slave(1005)/monitor/statistics.json'
I0310 03:13:16.109630   626 http.cpp:1185] HTTP GET for /slave(1005)/monitor/statistics.json
from 172.17.0.5:37590
I0310 03:13:16.109725   626 http.cpp:976] Authorizing principal 'test-principal' to GET the
'/monitor/statistics.json' endpoint
I0310 03:13:16.112085   616 slave.cpp:924] Agent terminating
[       OK ] Endpoint/SlaveEndpointTest.UnauthorizedRequest/1 (42 ms)
[ RUN      ] Endpoint/SlaveEndpointTest.UnauthorizedRequest/2
I0310 03:13:16.130951   613 containerizer.cpp:304] Using isolation { environment_secret, posix/cpu,
posix/mem, filesystem/posix, network/cni }
W0310 03:13:16.131750   613 backend.cpp:76] Failed to create 'aufs' backend: AufsBackend requires
root privileges
W0310 03:13:16.131788   613 backend.cpp:76] Failed to create 'bind' backend: BindBackend requires
root privileges
I0310 03:13:16.131832   613 provisioner.cpp:299] Using default backend 'copy'
I0310 03:13:16.138348   618 slave.cpp:264] Mesos agent started on (1006)@172.17.0.5:41113
I0310 03:13:16.138391   618 slave.cpp:265] Flags at startup: --acls="" --appc_simple_discovery_uri_prefix="http://"
--appc_store_dir="/tmp/Endpoint_SlaveEndpointTest_UnauthorizedRequest_2_XvseGU/store/appc"
--authenticate_http_readonly="true" --authenticate_http_readwrite="false" --authenticatee="crammd5"
--authentication_backoff_factor="1secs" --authorizer="local" --cgroups_cpu_enable_pids_and_tids_count="false"
--cgroups_enable_cfs="false" --cgroups_hierarchy="/sys/fs/cgroup" --cgroups_limit_swap="false"
--cgroups_root="mesos" --container_disk_watch_interval="15secs" --containerizers="mesos" --credential="/tmp/Endpoint_SlaveEndpointTest_UnauthorizedRequest_2_XvseGU/credential"
--default_role="*" --disallow_sharing_agent_pid_namespace="false" --disk_watch_interval="1mins"
--docker="docker" --docker_kill_orphans="true" --docker_registry="https://registry-1.docker.io"
--docker_remove_delay="6hrs" --docker_socket="/var/run/docker.sock" --docker_stop_timeout="0ns"
--docker_store_dir="/tmp/Endpoint_SlaveEndpointTest_UnauthorizedRequest_2_XvseGU/store/docker"
--docker_volume_checkpoint_dir="/var/run/mesos/isolators/docker/volume" --enforce_container_disk_quota="false"
--executor_registration_timeout="1mins" --executor_reregistration_timeout="2secs" --executor_shutdown_grace_period="5secs"
--fetcher_cache_dir="/tmp/Endpoint_SlaveEndpointTest_UnauthorizedRequest_2_XvseGU/fetch" --fetcher_cache_size="2GB"
--frameworks_home="" --gc_delay="1weeks" --gc_disk_headroom="0.1" --hadoop_home="" --help="false"
--hostname_lookup="true" --http_command_executor="false" --http_credentials="/tmp/Endpoint_SlaveEndpointTest_UnauthorizedRequest_2_XvseGU/http_credentials"
--http_heartbeat_interval="30secs" --initialize_driver_logging="true" --isolation="posix/cpu,posix/mem"
--launcher="posix" --launcher_dir="/tmp/SRC/build/mesos-1.6.0/_build/sub/src" --logbufsecs="0"
--logging_level="INFO" --max_completed_executors_per_framework="150" --oversubscribed_resources_interval="15secs"
--perf_duration="10secs" --perf_interval="1mins" --port="5051" --qos_correction_interval_min="0ns"
--quiet="false" --reconfiguration_policy="equal" --recover="reconnect" --recovery_timeout="15mins"
--registration_backoff_factor="10ms" --resources="cpus:2;gpus:0;mem:1024;disk:1024;ports:[31000-32000]"
--revocable_cpu_low_priority="true" --runtime_dir="/tmp/Endpoint_SlaveEndpointTest_UnauthorizedRequest_2_XvseGU"
--sandbox_directory="/mnt/mesos/sandbox" --strict="true" --switch_user="true" --systemd_enable_support="true"
--systemd_runtime_directory="/run/systemd/system" --version="false" --work_dir="/tmp/Endpoint_SlaveEndpointTest_UnauthorizedRequest_2_SSJ0tq"
--zk_session_timeout="10secs"
I0310 03:13:16.138936   618 credentials.hpp:86] Loading credential for authentication from
'/tmp/Endpoint_SlaveEndpointTest_UnauthorizedRequest_2_XvseGU/credential'
I0310 03:13:16.139161   618 slave.cpp:297] Agent using credential for: test-principal
I0310 03:13:16.139195   618 credentials.hpp:37] Loading credentials for authentication from
'/tmp/Endpoint_SlaveEndpointTest_UnauthorizedRequest_2_XvseGU/http_credentials'
I0310 03:13:16.139521   618 http.cpp:1045] Creating default 'basic' HTTP authenticator for
realm 'mesos-agent-readonly'
I0310 03:13:16.141891   618 slave.cpp:614] Agent resources: [{"name":"cpus","scalar":{"value":2.0},"type":"SCALAR"},{"name":"mem","scalar":{"value":1024.0},"type":"SCALAR"},{"name":"disk","scalar":{"value":1024.0},"type":"SCALAR"},{"name":"ports","ranges":{"range":[{"begin":31000,"end":32000}]},"type":"RANGES"}]
I0310 03:13:16.142185   618 slave.cpp:622] Agent attributes: [  ]
I0310 03:13:16.142208   618 slave.cpp:631] Agent hostname: e784e345f803
I0310 03:13:16.142468   619 task_status_update_manager.cpp:181] Pausing sending task status
updates
I0310 03:13:16.144806   617 state.cpp:66] Recovering state from '/tmp/Endpoint_SlaveEndpointTest_UnauthorizedRequest_2_SSJ0tq/meta'
I0310 03:13:16.145246   617 task_status_update_manager.cpp:207] Recovering task status update
manager
I0310 03:13:16.145529   629 containerizer.cpp:674] Recovering containerizer
I0310 03:13:16.147792   636 provisioner.cpp:495] Provisioner recovery complete
I0310 03:13:16.148334   621 slave.cpp:7217] Finished recovery
I0310 03:13:16.153506   623 process.cpp:3564] Handling HTTP event for process 'slave(1006)'
with path: '/slave(1006)/containers'
I0310 03:13:16.156150   628 http.cpp:1185] HTTP GET for /slave(1006)/containers from 172.17.0.5:37596
I0310 03:13:16.156282   628 http.cpp:976] Authorizing principal 'test-principal' to GET the
'/containers' endpoint
I0310 03:13:16.158824   613 slave.cpp:924] Agent terminating
[       OK ] Endpoint/SlaveEndpointTest.UnauthorizedRequest/2 (47 ms)
[ RUN      ] Endpoint/SlaveEndpointTest.NoAuthorizer/0
I0310 03:13:16.178853   613 containerizer.cpp:304] Using isolation { environment_secret, posix/cpu,
posix/mem, filesystem/posix, network/cni }
W0310 03:13:16.179646   613 backend.cpp:76] Failed to create 'aufs' backend: AufsBackend requires
root privileges
W0310 03:13:16.179684   613 backend.cpp:76] Failed to create 'bind' backend: BindBackend requires
root privileges
I0310 03:13:16.179728   613 provisioner.cpp:299] Using default backend 'copy'
I0310 03:13:16.182626   613 cluster.cpp:460] Creating default 'local' authorizer
I0310 03:13:16.186336   618 slave.cpp:264] Mesos agent started on (1007)@172.17.0.5:41113
I0310 03:13:16.186379   618 slave.cpp:265] Flags at startup: --acls="" --appc_simple_discovery_uri_prefix="http://"
--appc_store_dir="/tmp/Endpoint_SlaveEndpointTest_NoAuthorizer_0_6IkXPR/store/appc" --authenticate_http_readonly="true"
--authenticate_http_readwrite="false" --authenticatee="crammd5" --authentication_backoff_factor="1secs"
--authorizer="local" --cgroups_cpu_enable_pids_and_tids_count="false" --cgroups_enable_cfs="false"
--cgroups_hierarchy="/sys/fs/cgroup" --cgroups_limit_swap="false" --cgroups_root="mesos" --container_disk_watch_interval="15secs"
--containerizers="mesos" --credential="/tmp/Endpoint_SlaveEndpointTest_NoAuthorizer_0_6IkXPR/credential"
--default_role="*" --disallow_sharing_agent_pid_namespace="false" --disk_watch_interval="1mins"
--docker="docker" --docker_kill_orphans="true" --docker_registry="https://registry-1.docker.io"
--docker_remove_delay="6hrs" --docker_socket="/var/run/docker.sock" --docker_stop_timeout="0ns"
--docker_store_dir="/tmp/Endpoint_SlaveEndpointTest_NoAuthorizer_0_6IkXPR/store/docker" --docker_volume_checkpoint_dir="/var/run/mesos/isolators/docker/volume"
--enforce_container_disk_quota="false" --executor_registration_timeout="1mins" --executor_reregistration_timeout="2secs"
--executor_shutdown_grace_period="5secs" --fetcher_cache_dir="/tmp/Endpoint_SlaveEndpointTest_NoAuthorizer_0_6IkXPR/fetch"
--fetcher_cache_size="2GB" --frameworks_home="" --gc_delay="1weeks" --gc_disk_headroom="0.1"
--hadoop_home="" --help="false" --hostname_lookup="true" --http_command_executor="false" --http_credentials="/tmp/Endpoint_SlaveEndpointTest_NoAuthorizer_0_6IkXPR/http_credentials"
--http_heartbeat_interval="30secs" --initialize_driver_logging="true" --isolation="posix/cpu,posix/mem"
--launcher="posix" --launcher_dir="/tmp/SRC/build/mesos-1.6.0/_build/sub/src" --logbufsecs="0"
--logging_level="INFO" --max_completed_executors_per_framework="150" --oversubscribed_resources_interval="15secs"
--perf_duration="10secs" --perf_interval="1mins" --port="5051" --qos_correction_interval_min="0ns"
--quiet="false" --reconfiguration_policy="equal" --recover="reconnect" --recovery_timeout="15mins"
--registration_backoff_factor="10ms" --resources="cpus:2;gpus:0;mem:1024;disk:1024;ports:[31000-32000]"
--revocable_cpu_low_priority="true" --runtime_dir="/tmp/Endpoint_SlaveEndpointTest_NoAuthorizer_0_6IkXPR"
--sandbox_directory="/mnt/mesos/sandbox" --strict="true" --switch_user="true" --systemd_enable_support="true"
--systemd_runtime_directory="/run/systemd/system" --version="false" --work_dir="/tmp/Endpoint_SlaveEndpointTest_NoAuthorizer_0_b2o0wn"
--zk_session_timeout="10secs"
I0310 03:13:16.186957   618 credentials.hpp:86] Loading credential for authentication from
'/tmp/Endpoint_SlaveEndpointTest_NoAuthorizer_0_6IkXPR/credential'
I0310 03:13:16.187187   618 slave.cpp:297] Agent using credential for: test-principal
I0310 03:13:16.187223   618 credentials.hpp:37] Loading credentials for authentication from
'/tmp/Endpoint_SlaveEndpointTest_NoAuthorizer_0_6IkXPR/http_credentials'
I0310 03:13:16.187558   618 http.cpp:1045] Creating default 'basic' HTTP authenticator for
realm 'mesos-agent-readonly'
I0310 03:13:16.189920   618 slave.cpp:614] Agent resources: [{"name":"cpus","scalar":{"value":2.0},"type":"SCALAR"},{"name":"mem","scalar":{"value":1024.0},"type":"SCALAR"},{"name":"disk","scalar":{"value":1024.0},"type":"SCALAR"},{"name":"ports","ranges":{"range":[{"begin":31000,"end":32000}]},"type":"RANGES"}]
I0310 03:13:16.190214   618 slave.cpp:622] Agent attributes: [  ]
I0310 03:13:16.190237   618 slave.cpp:631] Agent hostname: e784e345f803
I0310 03:13:16.190472   625 task_status_update_manager.cpp:181] Pausing sending task status
updates
I0310 03:13:16.192811   627 state.cpp:66] Recovering state from '/tmp/Endpoint_SlaveEndpointTest_NoAuthorizer_0_b2o0wn/meta'
I0310 03:13:16.193249   615 task_status_update_manager.cpp:207] Recovering task status update
manager
I0310 03:13:16.193528   628 containerizer.cpp:674] Recovering containerizer
I0310 03:13:16.195935   624 provisioner.cpp:495] Provisioner recovery complete
I0310 03:13:16.196527   625 slave.cpp:7217] Finished recovery
I0310 03:13:16.201470   633 process.cpp:3564] Handling HTTP event for process 'slave(1007)'
with path: '/slave(1007)/monitor/statistics'
I0310 03:13:16.204563   631 http.cpp:1185] HTTP GET for /slave(1007)/monitor/statistics from
172.17.0.5:37598
I0310 03:13:16.204676   631 http.cpp:976] Authorizing principal 'test-principal' to GET the
'/monitor/statistics' endpoint
I0310 03:13:16.209722   622 slave.cpp:924] Agent terminating
[       OK ] Endpoint/SlaveEndpointTest.NoAuthorizer/0 (50 ms)
[ RUN      ] Endpoint/SlaveEndpointTest.NoAuthorizer/1
I0310 03:13:16.228468   613 containerizer.cpp:304] Using isolation { environment_secret, posix/cpu,
posix/mem, filesystem/posix, network/cni }
W0310 03:13:16.229589   613 backend.cpp:76] Failed to create 'aufs' backend: AufsBackend requires
root privileges
W0310 03:13:16.229634   613 backend.cpp:76] Failed to create 'bind' backend: BindBackend requires
root privileges
I0310 03:13:16.229684   613 provisioner.cpp:299] Using default backend 'copy'
I0310 03:13:16.233505   613 cluster.cpp:460] Creating default 'local' authorizer
I0310 03:13:16.237838   617 slave.cpp:264] Mesos agent started on (1008)@172.17.0.5:41113
I0310 03:13:16.237876   617 slave.cpp:265] Flags at startup: --acls="" --appc_simple_discovery_uri_prefix="http://"
--appc_store_dir="/tmp/Endpoint_SlaveEndpointTest_NoAuthorizer_1_SPXXrP/store/appc" --authenticate_http_readonly="true"
--authenticate_http_readwrite="false" --authenticatee="crammd5" --authentication_backoff_factor="1secs"
--authorizer="local" --cgroups_cpu_enable_pids_and_tids_count="false" --cgroups_enable_cfs="false"
--cgroups_hierarchy="/sys/fs/cgroup" --cgroups_limit_swap="false" --cgroups_root="mesos" --container_disk_watch_interval="15secs"
--containerizers="mesos" --credential="/tmp/Endpoint_SlaveEndpointTest_NoAuthorizer_1_SPXXrP/credential"
--default_role="*" --disallow_sharing_agent_pid_namespace="false" --disk_watch_interval="1mins"
--docker="docker" --docker_kill_orphans="true" --docker_registry="https://registry-1.docker.io"
--docker_remove_delay="6hrs" --docker_socket="/var/run/docker.sock" --docker_stop_timeout="0ns"
--docker_store_dir="/tmp/Endpoint_SlaveEndpointTest_NoAuthorizer_1_SPXXrP/store/docker" --docker_volume_checkpoint_dir="/var/run/mesos/isolators/docker/volume"
--enforce_container_disk_quota="false" --executor_registration_timeout="1mins" --executor_reregistration_timeout="2secs"
--executor_shutdown_grace_period="5secs" --fetcher_cache_dir="/tmp/Endpoint_SlaveEndpointTest_NoAuthorizer_1_SPXXrP/fetch"
--fetcher_cache_size="2GB" --frameworks_home="" --gc_delay="1weeks" --gc_disk_headroom="0.1"
--hadoop_home="" --help="false" --hostname_lookup="true" --http_command_executor="false" --http_credentials="/tmp/Endpoint_SlaveEndpointTest_NoAuthorizer_1_SPXXrP/http_credentials"
--http_heartbeat_interval="30secs" --initialize_driver_logging="true" --isolation="posix/cpu,posix/mem"
--launcher="posix" --launcher_dir="/tmp/SRC/build/mesos-1.6.0/_build/sub/src" --logbufsecs="0"
--logging_level="INFO" --max_completed_executors_per_framework="150" --oversubscribed_resources_interval="15secs"
--perf_duration="10secs" --perf_interval="1mins" --port="5051" --qos_correction_interval_min="0ns"
--quiet="false" --reconfiguration_policy="equal" --recover="reconnect" --recovery_timeout="15mins"
--registration_backoff_factor="10ms" --resources="cpus:2;gpus:0;mem:1024;disk:1024;ports:[31000-32000]"
--revocable_cpu_low_priority="true" --runtime_dir="/tmp/Endpoint_SlaveEndpointTest_NoAuthorizer_1_SPXXrP"
--sandbox_directory="/mnt/mesos/sandbox" --strict="true" --switch_user="true" --systemd_enable_support="true"
--systemd_runtime_directory="/run/systemd/system" --version="false" --work_dir="/tmp/Endpoint_SlaveEndpointTest_NoAuthorizer_1_In0S1k"
--zk_session_timeout="10secs"
I0310 03:13:16.238389   617 credentials.hpp:86] Loading credential for authentication from
'/tmp/Endpoint_SlaveEndpointTest_NoAuthorizer_1_SPXXrP/credential'
I0310 03:13:16.238603   617 slave.cpp:297] Agent using credential for: test-principal
I0310 03:13:16.238631   617 credentials.hpp:37] Loading credentials for authentication from
'/tmp/Endpoint_SlaveEndpointTest_NoAuthorizer_1_SPXXrP/http_credentials'
I0310 03:13:16.238906   617 http.cpp:1045] Creating default 'basic' HTTP authenticator for
realm 'mesos-agent-readonly'
I0310 03:13:16.241048   617 slave.cpp:614] Agent resources: [{"name":"cpus","scalar":{"value":2.0},"type":"SCALAR"},{"name":"mem","scalar":{"value":1024.0},"type":"SCALAR"},{"name":"disk","scalar":{"value":1024.0},"type":"SCALAR"},{"name":"ports","ranges":{"range":[{"begin":31000,"end":32000}]},"type":"RANGES"}]
I0310 03:13:16.241291   617 slave.cpp:622] Agent attributes: [  ]
I0310 03:13:16.241308   617 slave.cpp:631] Agent hostname: e784e345f803
I0310 03:13:16.241492   628 task_status_update_manager.cpp:181] Pausing sending task status
updates
I0310 03:13:16.243536   624 state.cpp:66] Recovering state from '/tmp/Endpoint_SlaveEndpointTest_NoAuthorizer_1_In0S1k/meta'
I0310 03:13:16.244091   621 task_status_update_manager.cpp:207] Recovering task status update
manager
I0310 03:13:16.244400   629 containerizer.cpp:674] Recovering containerizer
I0310 03:13:16.246323   632 provisioner.cpp:495] Provisioner recovery complete
I0310 03:13:16.246860   620 slave.cpp:7217] Finished recovery
I0310 03:13:16.251921   616 process.cpp:3564] Handling HTTP event for process 'slave(1008)'
with path: '/slave(1008)/monitor/statistics.json'
I0310 03:13:16.253916   623 http.cpp:1185] HTTP GET for /slave(1008)/monitor/statistics.json
from 172.17.0.5:37602
I0310 03:13:16.254019   623 http.cpp:976] Authorizing principal 'test-principal' to GET the
'/monitor/statistics.json' endpoint
I0310 03:13:16.257443   613 slave.cpp:924] Agent terminating
[       OK ] Endpoint/SlaveEndpointTest.NoAuthorizer/1 (44 ms)
[ RUN      ] Endpoint/SlaveEndpointTest.NoAuthorizer/2
I0310 03:13:16.273085   613 containerizer.cpp:304] Using isolation { environment_secret, posix/cpu,
posix/mem, filesystem/posix, network/cni }
W0310 03:13:16.273725   613 backend.cpp:76] Failed to create 'aufs' backend: AufsBackend requires
root privileges
W0310 03:13:16.273768   613 backend.cpp:76] Failed to create 'bind' backend: BindBackend requires
root privileges
I0310 03:13:16.273814   613 provisioner.cpp:299] Using default backend 'copy'
I0310 03:13:16.276137   613 cluster.cpp:460] Creating default 'local' authorizer
I0310 03:13:16.280684   614 slave.cpp:264] Mesos agent started on (1009)@172.17.0.5:41113
I0310 03:13:16.280731   614 slave.cpp:265] Flags at startup: --acls="" --appc_simple_discovery_uri_prefix="http://"
--appc_store_dir="/tmp/Endpoint_SlaveEndpointTest_NoAuthorizer_2_dtpiuN/store/appc" --authenticate_http_readonly="true"
--authenticate_http_readwrite="false" --authenticatee="crammd5" --authentication_backoff_factor="1secs"
--authorizer="local" --cgroups_cpu_enable_pids_and_tids_count="false" --cgroups_enable_cfs="false"
--cgroups_hierarchy="/sys/fs/cgroup" --cgroups_limit_swap="false" --cgroups_root="mesos" --container_disk_watch_interval="15secs"
--containerizers="mesos" --credential="/tmp/Endpoint_SlaveEndpointTest_NoAuthorizer_2_dtpiuN/credential"
--default_role="*" --disallow_sharing_agent_pid_namespace="false" --disk_watch_interval="1mins"
--docker="docker" --docker_kill_orphans="true" --docker_registry="https://registry-1.docker.io"
--docker_remove_delay="6hrs" --docker_socket="/var/run/docker.sock" --docker_stop_timeout="0ns"
--docker_store_dir="/tmp/Endpoint_SlaveEndpointTest_NoAuthorizer_2_dtpiuN/store/docker" --docker_volume_checkpoint_dir="/var/run/mesos/isolators/docker/volume"
--enforce_container_disk_quota="false" --executor_registration_timeout="1mins" --executor_reregistration_timeout="2secs"
--executor_shutdown_grace_period="5secs" --fetcher_cache_dir="/tmp/Endpoint_SlaveEndpointTest_NoAuthorizer_2_dtpiuN/fetch"
--fetcher_cache_size="2GB" --frameworks_home="" --gc_delay="1weeks" --gc_disk_headroom="0.1"
--hadoop_home="" --help="false" --hostname_lookup="true" --http_command_executor="false" --http_credentials="/tmp/Endpoint_SlaveEndpointTest_NoAuthorizer_2_dtpiuN/http_credentials"
--http_heartbeat_interval="30secs" --initialize_driver_logging="true" --isolation="posix/cpu,posix/mem"
--launcher="posix" --launcher_dir="/tmp/SRC/build/mesos-1.6.0/_build/sub/src" --logbufsecs="0"
--logging_level="INFO" --max_completed_executors_per_framework="150" --oversubscribed_resources_interval="15secs"
--perf_duration="10secs" --perf_interval="1mins" --port="5051" --qos_correction_interval_min="0ns"
--quiet="false" --reconfiguration_policy="equal" --recover="reconnect" --recovery_timeout="15mins"
--registration_backoff_factor="10ms" --resources="cpus:2;gpus:0;mem:1024;disk:1024;ports:[31000-32000]"
--revocable_cpu_low_priority="true" --runtime_dir="/tmp/Endpoint_SlaveEndpointTest_NoAuthorizer_2_dtpiuN"
--sandbox_directory="/mnt/mesos/sandbox" --strict="true" --switch_user="true" --systemd_enable_support="true"
--systemd_runtime_directory="/run/systemd/system" --version="false" --work_dir="/tmp/Endpoint_SlaveEndpointTest_NoAuthorizer_2_ep0PXi"
--zk_session_timeout="10secs"
I0310 03:13:16.281538   614 credentials.hpp:86] Loading credential for authentication from
'/tmp/Endpoint_SlaveEndpointTest_NoAuthorizer_2_dtpiuN/credential'
I0310 03:13:16.281769   614 slave.cpp:297] Agent using credential for: test-principal
I0310 03:13:16.281803   614 credentials.hpp:37] Loading credentials for authentication from
'/tmp/Endpoint_SlaveEndpointTest_NoAuthorizer_2_dtpiuN/http_credentials'
I0310 03:13:16.282151   614 http.cpp:1045] Creating default 'basic' HTTP authenticator for
realm 'mesos-agent-readonly'
I0310 03:13:16.284584   614 slave.cpp:614] Agent resources: [{"name":"cpus","scalar":{"value":2.0},"type":"SCALAR"},{"name":"mem","scalar":{"value":1024.0},"type":"SCALAR"},{"name":"disk","scalar":{"value":1024.0},"type":"SCALAR"},{"name":"ports","ranges":{"range":[{"begin":31000,"end":32000}]},"type":"RANGES"}]
I0310 03:13:16.284869   614 slave.cpp:622] Agent attributes: [  ]
I0310 03:13:16.284888   614 slave.cpp:631] Agent hostname: e784e345f803
I0310 03:13:16.285174   633 task_status_update_manager.cpp:181] Pausing sending task status
updates
I0310 03:13:16.287575   629 state.cpp:66] Recovering state from '/tmp/Endpoint_SlaveEndpointTest_NoAuthorizer_2_ep0PXi/meta'
I0310 03:13:16.288120   628 task_status_update_manager.cpp:207] Recovering task status update
manager
I0310 03:13:16.288514   628 containerizer.cpp:674] Recovering containerizer
I0310 03:13:16.290814   616 provisioner.cpp:495] Provisioner recovery complete
I0310 03:13:16.291416   627 slave.cpp:7217] Finished recovery
I0310 03:13:16.296705   620 process.cpp:3564] Handling HTTP event for process 'slave(1009)'
with path: '/slave(1009)/containers'
I0310 03:13:16.299068   634 http.cpp:1185] HTTP GET for /slave(1009)/containers from 172.17.0.5:37604
I0310 03:13:16.299185   634 http.cpp:976] Authorizing principal 'test-principal' to GET the
'/containers' endpoint
I0310 03:13:16.304723   618 slave.cpp:924] Agent terminating
[       OK ] Endpoint/SlaveEndpointTest.NoAuthorizer/2 (47 ms)
[----------] 9 tests from Endpoint/SlaveEndpointTest (447 ms total)

[----------] 2 tests from ContainerizerType/DefaultContainerDNSFlagTest
[ RUN      ] ContainerizerType/DefaultContainerDNSFlagTest.ValidateFlag/0
[       OK ] ContainerizerType/DefaultContainerDNSFlagTest.ValidateFlag/0 (13 ms)
[ RUN      ] ContainerizerType/DefaultContainerDNSFlagTest.ValidateFlag/1
[       OK ] ContainerizerType/DefaultContainerDNSFlagTest.ValidateFlag/1 (13 ms)
[----------] 2 tests from ContainerizerType/DefaultContainerDNSFlagTest (26 ms total)

[----------] Global test environment tear-down
[==========] 1928 tests from 193 test cases ran. (867657 ms total)
[  PASSED  ] 1927 tests.
[  FAILED  ] 1 test, listed below:
[  FAILED  ] DiskQuotaTest.SlaveRecovery

 1 FAILED TEST
  YOU HAVE 22 DISABLED TESTS

I0310 03:13:16.442477   638 process.cpp:929] Stopped the socket accept loop
Makefile:14667: recipe for target 'check-local' failed
make[4]: *** [check-local] Error 1
make[4]: Leaving directory '/tmp/SRC/build/mesos-1.6.0/_build/sub/src'
Makefile:13800: recipe for target 'check-am' failed
make[3]: *** [check-am] Error 2
make[3]: Leaving directory '/tmp/SRC/build/mesos-1.6.0/_build/sub/src'
Makefile:13804: recipe for target 'check' failed
make[2]: *** [check] Error 2
make[2]: Leaving directory '/tmp/SRC/build/mesos-1.6.0/_build/sub/src'
Makefile:774: recipe for target 'check-recursive' failed
make[1]: *** [check-recursive] Error 1
make[1]: Leaving directory '/tmp/SRC/build/mesos-1.6.0/_build/sub'
Makefile:980: recipe for target 'distcheck' failed
make: *** [distcheck] Error 1
Untagged: mesos/mesos-build:centos-7
Untagged: mesos/mesos-build@sha256:f31e69b40b8119281b3257167c2ab4a7ab3611b9ee900a3cba98cedbd51edc7f
Deleted: sha256:2b97bb4ea8a1cd28b42a92d1c3f2ec5af5ec04f0480a972cc9fd5e3202027195
Deleted: sha256:abcc9e37bf398f9f9f87ca57b5403739336c2bf7ad4d50d1f4648223f650c3da
Deleted: sha256:0e9868690b8ec64e4f02af1dd21a0da6f64c7629d232ff6e5fb41caf0cbc15ba
Deleted: sha256:8a4622791b31ca5e2e98b270c0408cbfe21842f91606a21c032fa8dc42b8689e
Deleted: sha256:b8d78ee36bea1e942fdf6d7f281f41f3b4443e0c3a1d36cf897ec58903fe0d2d
Deleted: sha256:47e5c1063fe9c4591b882d7d8d0b922ee4f07f74ee5cb6d2c9e7619449e65f93
Deleted: sha256:81437373896b716d71e6e50624775140b84744c8ce81d21f191086afc508cc04
Error response from daemon: conflict: unable to delete df13eb8a4c4b (cannot be forced) - image
is being used by running container b298da100ea5
Build step 'Execute shell' marked build as failure


Mime
View raw message