mesos-builds mailing list archives

Site index · List index
Message view « Date » · « Thread »
Top « Date » · « Thread »
From Apache Jenkins Server <jenk...@builds.apache.org>
Subject Build failed in Jenkins: Mesos-Reviewbot #21626
Date Tue, 13 Feb 2018 14:10:10 GMT
See <https://builds.apache.org/job/Mesos-Reviewbot/21626/display/redirect>

------------------------------------------
[...truncated 36.56 MB...]
I0213 14:09:52.687290 32475 process.cpp:3564] Handling HTTP event for process 'slave(989)'
with path: '/slave(989)/monitor/statistics'
I0213 14:09:52.689651 32476 http.cpp:1185] HTTP GET for /slave(989)/monitor/statistics from
172.17.0.3:56702
I0213 14:09:52.689784 32476 http.cpp:976] Authorizing principal 'test-principal' to GET the
'/monitor/statistics' endpoint
I0213 14:09:52.693471 32472 slave.cpp:931] Agent terminating
[       OK ] Endpoint/SlaveEndpointTest.AuthorizedRequest/0 (47 ms)
[ RUN      ] Endpoint/SlaveEndpointTest.AuthorizedRequest/1
I0213 14:09:52.712088 32472 containerizer.cpp:304] Using isolation { environment_secret, posix/cpu,
posix/mem, filesystem/posix, network/cni }
W0213 14:09:52.712827 32472 backend.cpp:76] Failed to create 'aufs' backend: AufsBackend requires
root privileges
W0213 14:09:52.712859 32472 backend.cpp:76] Failed to create 'bind' backend: BindBackend requires
root privileges
I0213 14:09:52.712898 32472 provisioner.cpp:299] Using default backend 'copy'
I0213 14:09:52.718384 32478 slave.cpp:262] Mesos agent started on (990)@172.17.0.3:39070
I0213 14:09:52.718410 32478 slave.cpp:263] Flags at startup: --acls="" --appc_simple_discovery_uri_prefix="http://"
--appc_store_dir="/tmp/Endpoint_SlaveEndpointTest_AuthorizedRequest_1_Lti7pd/store/appc" --authenticate_http_readonly="true"
--authenticate_http_readwrite="false" --authenticatee="crammd5" --authentication_backoff_factor="1secs"
--authorizer="local" --cgroups_cpu_enable_pids_and_tids_count="false" --cgroups_enable_cfs="false"
--cgroups_hierarchy="/sys/fs/cgroup" --cgroups_limit_swap="false" --cgroups_root="mesos" --container_disk_watch_interval="15secs"
--containerizers="mesos" --credential="/tmp/Endpoint_SlaveEndpointTest_AuthorizedRequest_1_Lti7pd/credential"
--default_role="*" --disallow_sharing_agent_pid_namespace="false" --disk_watch_interval="1mins"
--docker="docker" --docker_kill_orphans="true" --docker_registry="https://registry-1.docker.io"
--docker_remove_delay="6hrs" --docker_socket="/var/run/docker.sock" --docker_stop_timeout="0ns"
--docker_store_dir="/tmp/Endpoint_SlaveEndpointTest_AuthorizedRequest_1_Lti7pd/store/docker"
--docker_volume_checkpoint_dir="/var/run/mesos/isolators/docker/volume" --enforce_container_disk_quota="false"
--executor_registration_timeout="1mins" --executor_reregistration_timeout="2secs" --executor_shutdown_grace_period="5secs"
--fetcher_cache_dir="/tmp/Endpoint_SlaveEndpointTest_AuthorizedRequest_1_Lti7pd/fetch" --fetcher_cache_size="2GB"
--frameworks_home="" --gc_delay="1weeks" --gc_disk_headroom="0.1" --hadoop_home="" --help="false"
--hostname_lookup="true" --http_command_executor="false" --http_credentials="/tmp/Endpoint_SlaveEndpointTest_AuthorizedRequest_1_Lti7pd/http_credentials"
--http_heartbeat_interval="30secs" --initialize_driver_logging="true" --isolation="posix/cpu,posix/mem"
--launcher="posix" --launcher_dir="/tmp/SRC/build/mesos-1.6.0/_build/sub/src" --logbufsecs="0"
--logging_level="INFO" --max_completed_executors_per_framework="150" --oversubscribed_resources_interval="15secs"
--perf_duration="10secs" --perf_interval="1mins" --port="5051" --qos_correction_interval_min="0ns"
--quiet="false" --reconfiguration_policy="equal" --recover="reconnect" --recovery_timeout="15mins"
--registration_backoff_factor="10ms" --resources="cpus:2;gpus:0;mem:1024;disk:1024;ports:[31000-32000]"
--revocable_cpu_low_priority="true" --runtime_dir="/tmp/Endpoint_SlaveEndpointTest_AuthorizedRequest_1_Lti7pd"
--sandbox_directory="/mnt/mesos/sandbox" --strict="true" --switch_user="true" --systemd_enable_support="true"
--systemd_runtime_directory="/run/systemd/system" --version="false" --work_dir="/tmp/Endpoint_SlaveEndpointTest_AuthorizedRequest_1_JOVvyC"
--zk_session_timeout="10secs"
I0213 14:09:52.719221 32478 credentials.hpp:86] Loading credential for authentication from
'/tmp/Endpoint_SlaveEndpointTest_AuthorizedRequest_1_Lti7pd/credential'
I0213 14:09:52.719475 32478 slave.cpp:295] Agent using credential for: test-principal
I0213 14:09:52.719502 32478 credentials.hpp:37] Loading credentials for authentication from
'/tmp/Endpoint_SlaveEndpointTest_AuthorizedRequest_1_Lti7pd/http_credentials'
I0213 14:09:52.719938 32478 http.cpp:1045] Creating default 'basic' HTTP authenticator for
realm 'mesos-agent-readonly'
I0213 14:09:52.722487 32478 slave.cpp:612] Agent resources: [{"name":"cpus","scalar":{"value":2.0},"type":"SCALAR"},{"name":"mem","scalar":{"value":1024.0},"type":"SCALAR"},{"name":"disk","scalar":{"value":1024.0},"type":"SCALAR"},{"name":"ports","ranges":{"range":[{"begin":31000,"end":32000}]},"type":"RANGES"}]
I0213 14:09:52.722784 32478 slave.cpp:620] Agent attributes: [  ]
I0213 14:09:52.722815 32478 slave.cpp:629] Agent hostname: 72e58848cd2b
I0213 14:09:52.723028 32485 task_status_update_manager.cpp:181] Pausing sending task status
updates
I0213 14:09:52.725412 32487 state.cpp:66] Recovering state from '/tmp/Endpoint_SlaveEndpointTest_AuthorizedRequest_1_JOVvyC/meta'
I0213 14:09:52.725853 32480 task_status_update_manager.cpp:207] Recovering task status update
manager
I0213 14:09:52.726157 32476 containerizer.cpp:674] Recovering containerizer
I0213 14:09:52.728210 32487 provisioner.cpp:495] Provisioner recovery complete
I0213 14:09:52.728708 32475 slave.cpp:6860] Finished recovery
I0213 14:09:52.732976 32479 process.cpp:3564] Handling HTTP event for process 'slave(990)'
with path: '/slave(990)/monitor/statistics.json'
I0213 14:09:52.735213 32475 http.cpp:1185] HTTP GET for /slave(990)/monitor/statistics.json
from 172.17.0.3:56705
I0213 14:09:52.735313 32475 http.cpp:976] Authorizing principal 'test-principal' to GET the
'/monitor/statistics.json' endpoint
I0213 14:09:52.738934 32484 slave.cpp:931] Agent terminating
[       OK ] Endpoint/SlaveEndpointTest.AuthorizedRequest/1 (44 ms)
[ RUN      ] Endpoint/SlaveEndpointTest.AuthorizedRequest/2
I0213 14:09:52.756681 32472 containerizer.cpp:304] Using isolation { environment_secret, posix/cpu,
posix/mem, filesystem/posix, network/cni }
W0213 14:09:52.757388 32472 backend.cpp:76] Failed to create 'aufs' backend: AufsBackend requires
root privileges
W0213 14:09:52.757412 32472 backend.cpp:76] Failed to create 'bind' backend: BindBackend requires
root privileges
I0213 14:09:52.757441 32472 provisioner.cpp:299] Using default backend 'copy'
I0213 14:09:52.762107 32473 slave.cpp:262] Mesos agent started on (991)@172.17.0.3:39070
I0213 14:09:52.762137 32473 slave.cpp:263] Flags at startup: --acls="" --appc_simple_discovery_uri_prefix="http://"
--appc_store_dir="/tmp/Endpoint_SlaveEndpointTest_AuthorizedRequest_2_JnEihB/store/appc" --authenticate_http_readonly="true"
--authenticate_http_readwrite="false" --authenticatee="crammd5" --authentication_backoff_factor="1secs"
--authorizer="local" --cgroups_cpu_enable_pids_and_tids_count="false" --cgroups_enable_cfs="false"
--cgroups_hierarchy="/sys/fs/cgroup" --cgroups_limit_swap="false" --cgroups_root="mesos" --container_disk_watch_interval="15secs"
--containerizers="mesos" --credential="/tmp/Endpoint_SlaveEndpointTest_AuthorizedRequest_2_JnEihB/credential"
--default_role="*" --disallow_sharing_agent_pid_namespace="false" --disk_watch_interval="1mins"
--docker="docker" --docker_kill_orphans="true" --docker_registry="https://registry-1.docker.io"
--docker_remove_delay="6hrs" --docker_socket="/var/run/docker.sock" --docker_stop_timeout="0ns"
--docker_store_dir="/tmp/Endpoint_SlaveEndpointTest_AuthorizedRequest_2_JnEihB/store/docker"
--docker_volume_checkpoint_dir="/var/run/mesos/isolators/docker/volume" --enforce_container_disk_quota="false"
--executor_registration_timeout="1mins" --executor_reregistration_timeout="2secs" --executor_shutdown_grace_period="5secs"
--fetcher_cache_dir="/tmp/Endpoint_SlaveEndpointTest_AuthorizedRequest_2_JnEihB/fetch" --fetcher_cache_size="2GB"
--frameworks_home="" --gc_delay="1weeks" --gc_disk_headroom="0.1" --hadoop_home="" --help="false"
--hostname_lookup="true" --http_command_executor="false" --http_credentials="/tmp/Endpoint_SlaveEndpointTest_AuthorizedRequest_2_JnEihB/http_credentials"
--http_heartbeat_interval="30secs" --initialize_driver_logging="true" --isolation="posix/cpu,posix/mem"
--launcher="posix" --launcher_dir="/tmp/SRC/build/mesos-1.6.0/_build/sub/src" --logbufsecs="0"
--logging_level="INFO" --max_completed_executors_per_framework="150" --oversubscribed_resources_interval="15secs"
--perf_duration="10secs" --perf_interval="1mins" --port="5051" --qos_correction_interval_min="0ns"
--quiet="false" --reconfiguration_policy="equal" --recover="reconnect" --recovery_timeout="15mins"
--registration_backoff_factor="10ms" --resources="cpus:2;gpus:0;mem:1024;disk:1024;ports:[31000-32000]"
--revocable_cpu_low_priority="true" --runtime_dir="/tmp/Endpoint_SlaveEndpointTest_AuthorizedRequest_2_JnEihB"
--sandbox_directory="/mnt/mesos/sandbox" --strict="true" --switch_user="true" --systemd_enable_support="true"
--systemd_runtime_directory="/run/systemd/system" --version="false" --work_dir="/tmp/Endpoint_SlaveEndpointTest_AuthorizedRequest_2_N6Uni0"
--zk_session_timeout="10secs"
I0213 14:09:52.762707 32473 credentials.hpp:86] Loading credential for authentication from
'/tmp/Endpoint_SlaveEndpointTest_AuthorizedRequest_2_JnEihB/credential'
I0213 14:09:52.762974 32473 slave.cpp:295] Agent using credential for: test-principal
I0213 14:09:52.763062 32473 credentials.hpp:37] Loading credentials for authentication from
'/tmp/Endpoint_SlaveEndpointTest_AuthorizedRequest_2_JnEihB/http_credentials'
I0213 14:09:52.763434 32473 http.cpp:1045] Creating default 'basic' HTTP authenticator for
realm 'mesos-agent-readonly'
I0213 14:09:52.765753 32473 slave.cpp:612] Agent resources: [{"name":"cpus","scalar":{"value":2.0},"type":"SCALAR"},{"name":"mem","scalar":{"value":1024.0},"type":"SCALAR"},{"name":"disk","scalar":{"value":1024.0},"type":"SCALAR"},{"name":"ports","ranges":{"range":[{"begin":31000,"end":32000}]},"type":"RANGES"}]
I0213 14:09:52.766046 32473 slave.cpp:620] Agent attributes: [  ]
I0213 14:09:52.766068 32473 slave.cpp:629] Agent hostname: 72e58848cd2b
I0213 14:09:52.766369 32478 task_status_update_manager.cpp:181] Pausing sending task status
updates
I0213 14:09:52.768414 32475 state.cpp:66] Recovering state from '/tmp/Endpoint_SlaveEndpointTest_AuthorizedRequest_2_N6Uni0/meta'
I0213 14:09:52.768869 32481 task_status_update_manager.cpp:207] Recovering task status update
manager
I0213 14:09:52.769199 32486 containerizer.cpp:674] Recovering containerizer
I0213 14:09:52.771780 32475 provisioner.cpp:495] Provisioner recovery complete
I0213 14:09:52.772533 32482 slave.cpp:6860] Finished recovery
I0213 14:09:52.777577 32474 process.cpp:3564] Handling HTTP event for process 'slave(991)'
with path: '/slave(991)/containers'
I0213 14:09:52.779872 32482 http.cpp:1185] HTTP GET for /slave(991)/containers from 172.17.0.3:56707
I0213 14:09:52.779997 32482 http.cpp:976] Authorizing principal 'test-principal' to GET the
'/containers' endpoint
I0213 14:09:52.785614 32481 slave.cpp:931] Agent terminating
[       OK ] Endpoint/SlaveEndpointTest.AuthorizedRequest/2 (47 ms)
[ RUN      ] Endpoint/SlaveEndpointTest.UnauthorizedRequest/0
I0213 14:09:52.803812 32472 containerizer.cpp:304] Using isolation { environment_secret, posix/cpu,
posix/mem, filesystem/posix, network/cni }
W0213 14:09:52.804514 32472 backend.cpp:76] Failed to create 'aufs' backend: AufsBackend requires
root privileges
W0213 14:09:52.804545 32472 backend.cpp:76] Failed to create 'bind' backend: BindBackend requires
root privileges
I0213 14:09:52.804605 32472 provisioner.cpp:299] Using default backend 'copy'
I0213 14:09:52.810189 32474 slave.cpp:262] Mesos agent started on (992)@172.17.0.3:39070
I0213 14:09:52.810245 32474 slave.cpp:263] Flags at startup: --acls="" --appc_simple_discovery_uri_prefix="http://"
--appc_store_dir="/tmp/Endpoint_SlaveEndpointTest_UnauthorizedRequest_0_48hrCZ/store/appc"
--authenticate_http_readonly="true" --authenticate_http_readwrite="false" --authenticatee="crammd5"
--authentication_backoff_factor="1secs" --authorizer="local" --cgroups_cpu_enable_pids_and_tids_count="false"
--cgroups_enable_cfs="false" --cgroups_hierarchy="/sys/fs/cgroup" --cgroups_limit_swap="false"
--cgroups_root="mesos" --container_disk_watch_interval="15secs" --containerizers="mesos" --credential="/tmp/Endpoint_SlaveEndpointTest_UnauthorizedRequest_0_48hrCZ/credential"
--default_role="*" --disallow_sharing_agent_pid_namespace="false" --disk_watch_interval="1mins"
--docker="docker" --docker_kill_orphans="true" --docker_registry="https://registry-1.docker.io"
--docker_remove_delay="6hrs" --docker_socket="/var/run/docker.sock" --docker_stop_timeout="0ns"
--docker_store_dir="/tmp/Endpoint_SlaveEndpointTest_UnauthorizedRequest_0_48hrCZ/store/docker"
--docker_volume_checkpoint_dir="/var/run/mesos/isolators/docker/volume" --enforce_container_disk_quota="false"
--executor_registration_timeout="1mins" --executor_reregistration_timeout="2secs" --executor_shutdown_grace_period="5secs"
--fetcher_cache_dir="/tmp/Endpoint_SlaveEndpointTest_UnauthorizedRequest_0_48hrCZ/fetch" --fetcher_cache_size="2GB"
--frameworks_home="" --gc_delay="1weeks" --gc_disk_headroom="0.1" --hadoop_home="" --help="false"
--hostname_lookup="true" --http_command_executor="false" --http_credentials="/tmp/Endpoint_SlaveEndpointTest_UnauthorizedRequest_0_48hrCZ/http_credentials"
--http_heartbeat_interval="30secs" --initialize_driver_logging="true" --isolation="posix/cpu,posix/mem"
--launcher="posix" --launcher_dir="/tmp/SRC/build/mesos-1.6.0/_build/sub/src" --logbufsecs="0"
--logging_level="INFO" --max_completed_executors_per_framework="150" --oversubscribed_resources_interval="15secs"
--perf_duration="10secs" --perf_interval="1mins" --port="5051" --qos_correction_interval_min="0ns"
--quiet="false" --reconfiguration_policy="equal" --recover="reconnect" --recovery_timeout="15mins"
--registration_backoff_factor="10ms" --resources="cpus:2;gpus:0;mem:1024;disk:1024;ports:[31000-32000]"
--revocable_cpu_low_priority="true" --runtime_dir="/tmp/Endpoint_SlaveEndpointTest_UnauthorizedRequest_0_48hrCZ"
--sandbox_directory="/mnt/mesos/sandbox" --strict="true" --switch_user="true" --systemd_enable_support="true"
--systemd_runtime_directory="/run/systemd/system" --version="false" --work_dir="/tmp/Endpoint_SlaveEndpointTest_UnauthorizedRequest_0_lMQVvo"
--zk_session_timeout="10secs"
I0213 14:09:52.810763 32474 credentials.hpp:86] Loading credential for authentication from
'/tmp/Endpoint_SlaveEndpointTest_UnauthorizedRequest_0_48hrCZ/credential'
I0213 14:09:52.811017 32474 slave.cpp:295] Agent using credential for: test-principal
I0213 14:09:52.811043 32474 credentials.hpp:37] Loading credentials for authentication from
'/tmp/Endpoint_SlaveEndpointTest_UnauthorizedRequest_0_48hrCZ/http_credentials'
I0213 14:09:52.811357 32474 http.cpp:1045] Creating default 'basic' HTTP authenticator for
realm 'mesos-agent-readonly'
I0213 14:09:52.813071 32474 slave.cpp:612] Agent resources: [{"name":"cpus","scalar":{"value":2.0},"type":"SCALAR"},{"name":"mem","scalar":{"value":1024.0},"type":"SCALAR"},{"name":"disk","scalar":{"value":1024.0},"type":"SCALAR"},{"name":"ports","ranges":{"range":[{"begin":31000,"end":32000}]},"type":"RANGES"}]
I0213 14:09:52.813299 32474 slave.cpp:620] Agent attributes: [  ]
I0213 14:09:52.813314 32474 slave.cpp:629] Agent hostname: 72e58848cd2b
I0213 14:09:52.813537 32485 task_status_update_manager.cpp:181] Pausing sending task status
updates
I0213 14:09:52.815263 32487 state.cpp:66] Recovering state from '/tmp/Endpoint_SlaveEndpointTest_UnauthorizedRequest_0_lMQVvo/meta'
I0213 14:09:52.815742 32488 task_status_update_manager.cpp:207] Recovering task status update
manager
I0213 14:09:52.816076 32480 containerizer.cpp:674] Recovering containerizer
I0213 14:09:52.818313 32487 provisioner.cpp:495] Provisioner recovery complete
I0213 14:09:52.818835 32473 slave.cpp:6860] Finished recovery
I0213 14:09:52.837257 32478 process.cpp:3564] Handling HTTP event for process 'slave(992)'
with path: '/slave(992)/monitor/statistics'
I0213 14:09:52.839421 32473 http.cpp:1185] HTTP GET for /slave(992)/monitor/statistics from
172.17.0.3:56711
I0213 14:09:52.839540 32473 http.cpp:976] Authorizing principal 'test-principal' to GET the
'/monitor/statistics' endpoint
I0213 14:09:52.841994 32472 slave.cpp:931] Agent terminating
[       OK ] Endpoint/SlaveEndpointTest.UnauthorizedRequest/0 (55 ms)
[ RUN      ] Endpoint/SlaveEndpointTest.UnauthorizedRequest/1
I0213 14:09:52.865069 32472 containerizer.cpp:304] Using isolation { environment_secret, posix/cpu,
posix/mem, filesystem/posix, network/cni }
W0213 14:09:52.865813 32472 backend.cpp:76] Failed to create 'aufs' backend: AufsBackend requires
root privileges
W0213 14:09:52.865844 32472 backend.cpp:76] Failed to create 'bind' backend: BindBackend requires
root privileges
I0213 14:09:52.865880 32472 provisioner.cpp:299] Using default backend 'copy'
I0213 14:09:52.870856 32481 slave.cpp:262] Mesos agent started on (993)@172.17.0.3:39070
I0213 14:09:52.870880 32481 slave.cpp:263] Flags at startup: --acls="" --appc_simple_discovery_uri_prefix="http://"
--appc_store_dir="/tmp/Endpoint_SlaveEndpointTest_UnauthorizedRequest_1_wJwMyo/store/appc"
--authenticate_http_readonly="true" --authenticate_http_readwrite="false" --authenticatee="crammd5"
--authentication_backoff_factor="1secs" --authorizer="local" --cgroups_cpu_enable_pids_and_tids_count="false"
--cgroups_enable_cfs="false" --cgroups_hierarchy="/sys/fs/cgroup" --cgroups_limit_swap="false"
--cgroups_root="mesos" --container_disk_watch_interval="15secs" --containerizers="mesos" --credential="/tmp/Endpoint_SlaveEndpointTest_UnauthorizedRequest_1_wJwMyo/credential"
--default_role="*" --disallow_sharing_agent_pid_namespace="false" --disk_watch_interval="1mins"
--docker="docker" --docker_kill_orphans="true" --docker_registry="https://registry-1.docker.io"
--docker_remove_delay="6hrs" --docker_socket="/var/run/docker.sock" --docker_stop_timeout="0ns"
--docker_store_dir="/tmp/Endpoint_SlaveEndpointTest_UnauthorizedRequest_1_wJwMyo/store/docker"
--docker_volume_checkpoint_dir="/var/run/mesos/isolators/docker/volume" --enforce_container_disk_quota="false"
--executor_registration_timeout="1mins" --executor_reregistration_timeout="2secs" --executor_shutdown_grace_period="5secs"
--fetcher_cache_dir="/tmp/Endpoint_SlaveEndpointTest_UnauthorizedRequest_1_wJwMyo/fetch" --fetcher_cache_size="2GB"
--frameworks_home="" --gc_delay="1weeks" --gc_disk_headroom="0.1" --hadoop_home="" --help="false"
--hostname_lookup="true" --http_command_executor="false" --http_credentials="/tmp/Endpoint_SlaveEndpointTest_UnauthorizedRequest_1_wJwMyo/http_credentials"
--http_heartbeat_interval="30secs" --initialize_driver_logging="true" --isolation="posix/cpu,posix/mem"
--launcher="posix" --launcher_dir="/tmp/SRC/build/mesos-1.6.0/_build/sub/src" --logbufsecs="0"
--logging_level="INFO" --max_completed_executors_per_framework="150" --oversubscribed_resources_interval="15secs"
--perf_duration="10secs" --perf_interval="1mins" --port="5051" --qos_correction_interval_min="0ns"
--quiet="false" --reconfiguration_policy="equal" --recover="reconnect" --recovery_timeout="15mins"
--registration_backoff_factor="10ms" --resources="cpus:2;gpus:0;mem:1024;disk:1024;ports:[31000-32000]"
--revocable_cpu_low_priority="true" --runtime_dir="/tmp/Endpoint_SlaveEndpointTest_UnauthorizedRequest_1_wJwMyo"
--sandbox_directory="/mnt/mesos/sandbox" --strict="true" --switch_user="true" --systemd_enable_support="true"
--systemd_runtime_directory="/run/systemd/system" --version="false" --work_dir="/tmp/Endpoint_SlaveEndpointTest_UnauthorizedRequest_1_qKxniN"
--zk_session_timeout="10secs"
I0213 14:09:52.871371 32481 credentials.hpp:86] Loading credential for authentication from
'/tmp/Endpoint_SlaveEndpointTest_UnauthorizedRequest_1_wJwMyo/credential'
I0213 14:09:52.884224 32481 slave.cpp:295] Agent using credential for: test-principal
I0213 14:09:52.884258 32481 credentials.hpp:37] Loading credentials for authentication from
'/tmp/Endpoint_SlaveEndpointTest_UnauthorizedRequest_1_wJwMyo/http_credentials'
I0213 14:09:52.884588 32481 http.cpp:1045] Creating default 'basic' HTTP authenticator for
realm 'mesos-agent-readonly'
I0213 14:09:52.886354 32481 slave.cpp:612] Agent resources: [{"name":"cpus","scalar":{"value":2.0},"type":"SCALAR"},{"name":"mem","scalar":{"value":1024.0},"type":"SCALAR"},{"name":"disk","scalar":{"value":1024.0},"type":"SCALAR"},{"name":"ports","ranges":{"range":[{"begin":31000,"end":32000}]},"type":"RANGES"}]
I0213 14:09:52.886555 32481 slave.cpp:620] Agent attributes: [  ]
I0213 14:09:52.886567 32481 slave.cpp:629] Agent hostname: 72e58848cd2b
I0213 14:09:52.886754 32480 task_status_update_manager.cpp:181] Pausing sending task status
updates
I0213 14:09:52.888232 32486 state.cpp:66] Recovering state from '/tmp/Endpoint_SlaveEndpointTest_UnauthorizedRequest_1_qKxniN/meta'
I0213 14:09:52.888798 32482 task_status_update_manager.cpp:207] Recovering task status update
manager
I0213 14:09:52.889066 32476 containerizer.cpp:674] Recovering containerizer
I0213 14:09:52.891000 32483 provisioner.cpp:495] Provisioner recovery complete
I0213 14:09:52.891392 32478 slave.cpp:6860] Finished recovery
I0213 14:09:52.895071 32482 process.cpp:3564] Handling HTTP event for process 'slave(993)'
with path: '/slave(993)/monitor/statistics.json'
I0213 14:09:52.897336 32478 http.cpp:1185] HTTP GET for /slave(993)/monitor/statistics.json
from 172.17.0.3:56714
I0213 14:09:52.897439 32478 http.cpp:976] Authorizing principal 'test-principal' to GET the
'/monitor/statistics.json' endpoint
I0213 14:09:52.899951 32475 slave.cpp:931] Agent terminating
[       OK ] Endpoint/SlaveEndpointTest.UnauthorizedRequest/1 (53 ms)
[ RUN      ] Endpoint/SlaveEndpointTest.UnauthorizedRequest/2
I0213 14:09:52.917650 32472 containerizer.cpp:304] Using isolation { environment_secret, posix/cpu,
posix/mem, filesystem/posix, network/cni }
W0213 14:09:52.918371 32472 backend.cpp:76] Failed to create 'aufs' backend: AufsBackend requires
root privileges
W0213 14:09:52.918403 32472 backend.cpp:76] Failed to create 'bind' backend: BindBackend requires
root privileges
I0213 14:09:52.918439 32472 provisioner.cpp:299] Using default backend 'copy'
I0213 14:09:52.923346 32476 slave.cpp:262] Mesos agent started on (994)@172.17.0.3:39070
I0213 14:09:52.923383 32476 slave.cpp:263] Flags at startup: --acls="" --appc_simple_discovery_uri_prefix="http://"
--appc_store_dir="/tmp/Endpoint_SlaveEndpointTest_UnauthorizedRequest_2_YQ5E6N/store/appc"
--authenticate_http_readonly="true" --authenticate_http_readwrite="false" --authenticatee="crammd5"
--authentication_backoff_factor="1secs" --authorizer="local" --cgroups_cpu_enable_pids_and_tids_count="false"
--cgroups_enable_cfs="false" --cgroups_hierarchy="/sys/fs/cgroup" --cgroups_limit_swap="false"
--cgroups_root="mesos" --container_disk_watch_interval="15secs" --containerizers="mesos" --credential="/tmp/Endpoint_SlaveEndpointTest_UnauthorizedRequest_2_YQ5E6N/credential"
--default_role="*" --disallow_sharing_agent_pid_namespace="false" --disk_watch_interval="1mins"
--docker="docker" --docker_kill_orphans="true" --docker_registry="https://registry-1.docker.io"
--docker_remove_delay="6hrs" --docker_socket="/var/run/docker.sock" --docker_stop_timeout="0ns"
--docker_store_dir="/tmp/Endpoint_SlaveEndpointTest_UnauthorizedRequest_2_YQ5E6N/store/docker"
--docker_volume_checkpoint_dir="/var/run/mesos/isolators/docker/volume" --enforce_container_disk_quota="false"
--executor_registration_timeout="1mins" --executor_reregistration_timeout="2secs" --executor_shutdown_grace_period="5secs"
--fetcher_cache_dir="/tmp/Endpoint_SlaveEndpointTest_UnauthorizedRequest_2_YQ5E6N/fetch" --fetcher_cache_size="2GB"
--frameworks_home="" --gc_delay="1weeks" --gc_disk_headroom="0.1" --hadoop_home="" --help="false"
--hostname_lookup="true" --http_command_executor="false" --http_credentials="/tmp/Endpoint_SlaveEndpointTest_UnauthorizedRequest_2_YQ5E6N/http_credentials"
--http_heartbeat_interval="30secs" --initialize_driver_logging="true" --isolation="posix/cpu,posix/mem"
--launcher="posix" --launcher_dir="/tmp/SRC/build/mesos-1.6.0/_build/sub/src" --logbufsecs="0"
--logging_level="INFO" --max_completed_executors_per_framework="150" --oversubscribed_resources_interval="15secs"
--perf_duration="10secs" --perf_interval="1mins" --port="5051" --qos_correction_interval_min="0ns"
--quiet="false" --reconfiguration_policy="equal" --recover="reconnect" --recovery_timeout="15mins"
--registration_backoff_factor="10ms" --resources="cpus:2;gpus:0;mem:1024;disk:1024;ports:[31000-32000]"
--revocable_cpu_low_priority="true" --runtime_dir="/tmp/Endpoint_SlaveEndpointTest_UnauthorizedRequest_2_YQ5E6N"
--sandbox_directory="/mnt/mesos/sandbox" --strict="true" --switch_user="true" --systemd_enable_support="true"
--systemd_runtime_directory="/run/systemd/system" --version="false" --work_dir="/tmp/Endpoint_SlaveEndpointTest_UnauthorizedRequest_2_4GKFHc"
--zk_session_timeout="10secs"
I0213 14:09:52.923964 32476 credentials.hpp:86] Loading credential for authentication from
'/tmp/Endpoint_SlaveEndpointTest_UnauthorizedRequest_2_YQ5E6N/credential'
I0213 14:09:52.924181 32476 slave.cpp:295] Agent using credential for: test-principal
I0213 14:09:52.924213 32476 credentials.hpp:37] Loading credentials for authentication from
'/tmp/Endpoint_SlaveEndpointTest_UnauthorizedRequest_2_YQ5E6N/http_credentials'
I0213 14:09:52.924533 32476 http.cpp:1045] Creating default 'basic' HTTP authenticator for
realm 'mesos-agent-readonly'
I0213 14:09:52.926820 32476 slave.cpp:612] Agent resources: [{"name":"cpus","scalar":{"value":2.0},"type":"SCALAR"},{"name":"mem","scalar":{"value":1024.0},"type":"SCALAR"},{"name":"disk","scalar":{"value":1024.0},"type":"SCALAR"},{"name":"ports","ranges":{"range":[{"begin":31000,"end":32000}]},"type":"RANGES"}]
I0213 14:09:52.927120 32476 slave.cpp:620] Agent attributes: [  ]
I0213 14:09:52.927152 32476 slave.cpp:629] Agent hostname: 72e58848cd2b
I0213 14:09:52.927398 32486 task_status_update_manager.cpp:181] Pausing sending task status
updates
I0213 14:09:52.929607 32475 state.cpp:66] Recovering state from '/tmp/Endpoint_SlaveEndpointTest_UnauthorizedRequest_2_4GKFHc/meta'
I0213 14:09:52.929989 32475 task_status_update_manager.cpp:207] Recovering task status update
manager
I0213 14:09:52.930276 32482 containerizer.cpp:674] Recovering containerizer
I0213 14:09:52.932288 32484 provisioner.cpp:495] Provisioner recovery complete
I0213 14:09:52.932831 32475 slave.cpp:6860] Finished recovery
I0213 14:09:52.943241 32473 process.cpp:3564] Handling HTTP event for process 'slave(994)'
with path: '/slave(994)/containers'
I0213 14:09:52.945374 32477 http.cpp:1185] HTTP GET for /slave(994)/containers from 172.17.0.3:56717
I0213 14:09:52.945482 32477 http.cpp:976] Authorizing principal 'test-principal' to GET the
'/containers' endpoint
I0213 14:09:52.947790 32484 slave.cpp:931] Agent terminating
[       OK ] Endpoint/SlaveEndpointTest.UnauthorizedRequest/2 (47 ms)
[ RUN      ] Endpoint/SlaveEndpointTest.NoAuthorizer/0
I0213 14:09:52.968930 32472 containerizer.cpp:304] Using isolation { environment_secret, posix/cpu,
posix/mem, filesystem/posix, network/cni }
W0213 14:09:52.985757 32472 backend.cpp:76] Failed to create 'aufs' backend: AufsBackend requires
root privileges
W0213 14:09:52.985791 32472 backend.cpp:76] Failed to create 'bind' backend: BindBackend requires
root privileges
I0213 14:09:52.985826 32472 provisioner.cpp:299] Using default backend 'copy'
I0213 14:09:52.988315 32472 cluster.cpp:460] Creating default 'local' authorizer
I0213 14:09:52.991062 32486 slave.cpp:262] Mesos agent started on (995)@172.17.0.3:39070
I0213 14:09:52.991091 32486 slave.cpp:263] Flags at startup: --acls="" --appc_simple_discovery_uri_prefix="http://"
--appc_store_dir="/tmp/Endpoint_SlaveEndpointTest_NoAuthorizer_0_u9SVae/store/appc" --authenticate_http_readonly="true"
--authenticate_http_readwrite="false" --authenticatee="crammd5" --authentication_backoff_factor="1secs"
--authorizer="local" --cgroups_cpu_enable_pids_and_tids_count="false" --cgroups_enable_cfs="false"
--cgroups_hierarchy="/sys/fs/cgroup" --cgroups_limit_swap="false" --cgroups_root="mesos" --container_disk_watch_interval="15secs"
--containerizers="mesos" --credential="/tmp/Endpoint_SlaveEndpointTest_NoAuthorizer_0_u9SVae/credential"
--default_role="*" --disallow_sharing_agent_pid_namespace="false" --disk_watch_interval="1mins"
--docker="docker" --docker_kill_orphans="true" --docker_registry="https://registry-1.docker.io"
--docker_remove_delay="6hrs" --docker_socket="/var/run/docker.sock" --docker_stop_timeout="0ns"
--docker_store_dir="/tmp/Endpoint_SlaveEndpointTest_NoAuthorizer_0_u9SVae/store/docker" --docker_volume_checkpoint_dir="/var/run/mesos/isolators/docker/volume"
--enforce_container_disk_quota="false" --executor_registration_timeout="1mins" --executor_reregistration_timeout="2secs"
--executor_shutdown_grace_period="5secs" --fetcher_cache_dir="/tmp/Endpoint_SlaveEndpointTest_NoAuthorizer_0_u9SVae/fetch"
--fetcher_cache_size="2GB" --frameworks_home="" --gc_delay="1weeks" --gc_disk_headroom="0.1"
--hadoop_home="" --help="false" --hostname_lookup="true" --http_command_executor="false" --http_credentials="/tmp/Endpoint_SlaveEndpointTest_NoAuthorizer_0_u9SVae/http_credentials"
--http_heartbeat_interval="30secs" --initialize_driver_logging="true" --isolation="posix/cpu,posix/mem"
--launcher="posix" --launcher_dir="/tmp/SRC/build/mesos-1.6.0/_build/sub/src" --logbufsecs="0"
--logging_level="INFO" --max_completed_executors_per_framework="150" --oversubscribed_resources_interval="15secs"
--perf_duration="10secs" --perf_interval="1mins" --port="5051" --qos_correction_interval_min="0ns"
--quiet="false" --reconfiguration_policy="equal" --recover="reconnect" --recovery_timeout="15mins"
--registration_backoff_factor="10ms" --resources="cpus:2;gpus:0;mem:1024;disk:1024;ports:[31000-32000]"
--revocable_cpu_low_priority="true" --runtime_dir="/tmp/Endpoint_SlaveEndpointTest_NoAuthorizer_0_u9SVae"
--sandbox_directory="/mnt/mesos/sandbox" --strict="true" --switch_user="true" --systemd_enable_support="true"
--systemd_runtime_directory="/run/systemd/system" --version="false" --work_dir="/tmp/Endpoint_SlaveEndpointTest_NoAuthorizer_0_u9sJDC"
--zk_session_timeout="10secs"
I0213 14:09:52.991729 32486 credentials.hpp:86] Loading credential for authentication from
'/tmp/Endpoint_SlaveEndpointTest_NoAuthorizer_0_u9SVae/credential'
I0213 14:09:52.991931 32486 slave.cpp:295] Agent using credential for: test-principal
I0213 14:09:52.991961 32486 credentials.hpp:37] Loading credentials for authentication from
'/tmp/Endpoint_SlaveEndpointTest_NoAuthorizer_0_u9SVae/http_credentials'
I0213 14:09:52.992277 32486 http.cpp:1045] Creating default 'basic' HTTP authenticator for
realm 'mesos-agent-readonly'
I0213 14:09:52.995004 32486 slave.cpp:612] Agent resources: [{"name":"cpus","scalar":{"value":2.0},"type":"SCALAR"},{"name":"mem","scalar":{"value":1024.0},"type":"SCALAR"},{"name":"disk","scalar":{"value":1024.0},"type":"SCALAR"},{"name":"ports","ranges":{"range":[{"begin":31000,"end":32000}]},"type":"RANGES"}]
I0213 14:09:52.995416 32486 slave.cpp:620] Agent attributes: [  ]
I0213 14:09:52.995441 32486 slave.cpp:629] Agent hostname: 72e58848cd2b
I0213 14:09:52.995663 32474 task_status_update_manager.cpp:181] Pausing sending task status
updates
I0213 14:09:52.997736 32476 state.cpp:66] Recovering state from '/tmp/Endpoint_SlaveEndpointTest_NoAuthorizer_0_u9sJDC/meta'
I0213 14:09:52.998185 32476 task_status_update_manager.cpp:207] Recovering task status update
manager
I0213 14:09:52.998529 32479 containerizer.cpp:674] Recovering containerizer
I0213 14:09:53.000700 32481 provisioner.cpp:495] Provisioner recovery complete
I0213 14:09:53.001269 32476 slave.cpp:6860] Finished recovery
I0213 14:09:53.005060 32485 process.cpp:3564] Handling HTTP event for process 'slave(995)'
with path: '/slave(995)/monitor/statistics'
I0213 14:09:53.007232 32487 http.cpp:1185] HTTP GET for /slave(995)/monitor/statistics from
172.17.0.3:56720
I0213 14:09:53.007338 32487 http.cpp:976] Authorizing principal 'test-principal' to GET the
'/monitor/statistics' endpoint
I0213 14:09:53.010906 32482 slave.cpp:931] Agent terminating
[       OK ] Endpoint/SlaveEndpointTest.NoAuthorizer/0 (60 ms)
[ RUN      ] Endpoint/SlaveEndpointTest.NoAuthorizer/1
I0213 14:09:53.029675 32472 containerizer.cpp:304] Using isolation { environment_secret, posix/cpu,
posix/mem, filesystem/posix, network/cni }
W0213 14:09:53.030236 32472 backend.cpp:76] Failed to create 'aufs' backend: AufsBackend requires
root privileges
W0213 14:09:53.030261 32472 backend.cpp:76] Failed to create 'bind' backend: BindBackend requires
root privileges
I0213 14:09:53.030290 32472 provisioner.cpp:299] Using default backend 'copy'
I0213 14:09:53.032280 32472 cluster.cpp:460] Creating default 'local' authorizer
I0213 14:09:53.034714 32487 slave.cpp:262] Mesos agent started on (996)@172.17.0.3:39070
I0213 14:09:53.034740 32487 slave.cpp:263] Flags at startup: --acls="" --appc_simple_discovery_uri_prefix="http://"
--appc_store_dir="/tmp/Endpoint_SlaveEndpointTest_NoAuthorizer_1_0rP7SE/store/appc" --authenticate_http_readonly="true"
--authenticate_http_readwrite="false" --authenticatee="crammd5" --authentication_backoff_factor="1secs"
--authorizer="local" --cgroups_cpu_enable_pids_and_tids_count="false" --cgroups_enable_cfs="false"
--cgroups_hierarchy="/sys/fs/cgroup" --cgroups_limit_swap="false" --cgroups_root="mesos" --container_disk_watch_interval="15secs"
--containerizers="mesos" --credential="/tmp/Endpoint_SlaveEndpointTest_NoAuthorizer_1_0rP7SE/credential"
--default_role="*" --disallow_sharing_agent_pid_namespace="false" --disk_watch_interval="1mins"
--docker="docker" --docker_kill_orphans="true" --docker_registry="https://registry-1.docker.io"
--docker_remove_delay="6hrs" --docker_socket="/var/run/docker.sock" --docker_stop_timeout="0ns"
--docker_store_dir="/tmp/Endpoint_SlaveEndpointTest_NoAuthorizer_1_0rP7SE/store/docker" --docker_volume_checkpoint_dir="/var/run/mesos/isolators/docker/volume"
--enforce_container_disk_quota="false" --executor_registration_timeout="1mins" --executor_reregistration_timeout="2secs"
--executor_shutdown_grace_period="5secs" --fetcher_cache_dir="/tmp/Endpoint_SlaveEndpointTest_NoAuthorizer_1_0rP7SE/fetch"
--fetcher_cache_size="2GB" --frameworks_home="" --gc_delay="1weeks" --gc_disk_headroom="0.1"
--hadoop_home="" --help="false" --hostname_lookup="true" --http_command_executor="false" --http_credentials="/tmp/Endpoint_SlaveEndpointTest_NoAuthorizer_1_0rP7SE/http_credentials"
--http_heartbeat_interval="30secs" --initialize_driver_logging="true" --isolation="posix/cpu,posix/mem"
--launcher="posix" --launcher_dir="/tmp/SRC/build/mesos-1.6.0/_build/sub/src" --logbufsecs="0"
--logging_level="INFO" --max_completed_executors_per_framework="150" --oversubscribed_resources_interval="15secs"
--perf_duration="10secs" --perf_interval="1mins" --port="5051" --qos_correction_interval_min="0ns"
--quiet="false" --reconfiguration_policy="equal" --recover="reconnect" --recovery_timeout="15mins"
--registration_backoff_factor="10ms" --resources="cpus:2;gpus:0;mem:1024;disk:1024;ports:[31000-32000]"
--revocable_cpu_low_priority="true" --runtime_dir="/tmp/Endpoint_SlaveEndpointTest_NoAuthorizer_1_0rP7SE"
--sandbox_directory="/mnt/mesos/sandbox" --strict="true" --switch_user="true" --systemd_enable_support="true"
--systemd_runtime_directory="/run/systemd/system" --version="false" --work_dir="/tmp/Endpoint_SlaveEndpointTest_NoAuthorizer_1_UNhZb3"
--zk_session_timeout="10secs"
I0213 14:09:53.035245 32487 credentials.hpp:86] Loading credential for authentication from
'/tmp/Endpoint_SlaveEndpointTest_NoAuthorizer_1_0rP7SE/credential'
I0213 14:09:53.048832 32487 slave.cpp:295] Agent using credential for: test-principal
I0213 14:09:53.048871 32487 credentials.hpp:37] Loading credentials for authentication from
'/tmp/Endpoint_SlaveEndpointTest_NoAuthorizer_1_0rP7SE/http_credentials'
I0213 14:09:53.049178 32487 http.cpp:1045] Creating default 'basic' HTTP authenticator for
realm 'mesos-agent-readonly'
I0213 14:09:53.050844 32487 slave.cpp:612] Agent resources: [{"name":"cpus","scalar":{"value":2.0},"type":"SCALAR"},{"name":"mem","scalar":{"value":1024.0},"type":"SCALAR"},{"name":"disk","scalar":{"value":1024.0},"type":"SCALAR"},{"name":"ports","ranges":{"range":[{"begin":31000,"end":32000}]},"type":"RANGES"}]
I0213 14:09:53.051057 32487 slave.cpp:620] Agent attributes: [  ]
I0213 14:09:53.051071 32487 slave.cpp:629] Agent hostname: 72e58848cd2b
I0213 14:09:53.051244 32486 task_status_update_manager.cpp:181] Pausing sending task status
updates
I0213 14:09:53.052758 32481 state.cpp:66] Recovering state from '/tmp/Endpoint_SlaveEndpointTest_NoAuthorizer_1_UNhZb3/meta'
I0213 14:09:53.053179 32481 task_status_update_manager.cpp:207] Recovering task status update
manager
I0213 14:09:53.053462 32480 containerizer.cpp:674] Recovering containerizer
I0213 14:09:53.055362 32487 provisioner.cpp:495] Provisioner recovery complete
I0213 14:09:53.055835 32488 slave.cpp:6860] Finished recovery
I0213 14:09:53.059729 32477 process.cpp:3564] Handling HTTP event for process 'slave(996)'
with path: '/slave(996)/monitor/statistics.json'
I0213 14:09:53.061702 32473 http.cpp:1185] HTTP GET for /slave(996)/monitor/statistics.json
from 172.17.0.3:56723
I0213 14:09:53.061789 32473 http.cpp:976] Authorizing principal 'test-principal' to GET the
'/monitor/statistics.json' endpoint
I0213 14:09:53.065644 32482 slave.cpp:931] Agent terminating
[       OK ] Endpoint/SlaveEndpointTest.NoAuthorizer/1 (61 ms)
[ RUN      ] Endpoint/SlaveEndpointTest.NoAuthorizer/2
I0213 14:09:53.090231 32472 containerizer.cpp:304] Using isolation { environment_secret, posix/cpu,
posix/mem, filesystem/posix, network/cni }
W0213 14:09:53.090909 32472 backend.cpp:76] Failed to create 'aufs' backend: AufsBackend requires
root privileges
W0213 14:09:53.090941 32472 backend.cpp:76] Failed to create 'bind' backend: BindBackend requires
root privileges
I0213 14:09:53.090973 32472 provisioner.cpp:299] Using default backend 'copy'
I0213 14:09:53.093497 32472 cluster.cpp:460] Creating default 'local' authorizer
I0213 14:09:53.095770 32483 slave.cpp:262] Mesos agent started on (997)@172.17.0.3:39070
I0213 14:09:53.095811 32483 slave.cpp:263] Flags at startup: --acls="" --appc_simple_discovery_uri_prefix="http://"
--appc_store_dir="/tmp/Endpoint_SlaveEndpointTest_NoAuthorizer_2_wMa3d6/store/appc" --authenticate_http_readonly="true"
--authenticate_http_readwrite="false" --authenticatee="crammd5" --authentication_backoff_factor="1secs"
--authorizer="local" --cgroups_cpu_enable_pids_and_tids_count="false" --cgroups_enable_cfs="false"
--cgroups_hierarchy="/sys/fs/cgroup" --cgroups_limit_swap="false" --cgroups_root="mesos" --container_disk_watch_interval="15secs"
--containerizers="mesos" --credential="/tmp/Endpoint_SlaveEndpointTest_NoAuthorizer_2_wMa3d6/credential"
--default_role="*" --disallow_sharing_agent_pid_namespace="false" --disk_watch_interval="1mins"
--docker="docker" --docker_kill_orphans="true" --docker_registry="https://registry-1.docker.io"
--docker_remove_delay="6hrs" --docker_socket="/var/run/docker.sock" --docker_stop_timeout="0ns"
--docker_store_dir="/tmp/Endpoint_SlaveEndpointTest_NoAuthorizer_2_wMa3d6/store/docker" --docker_volume_checkpoint_dir="/var/run/mesos/isolators/docker/volume"
--enforce_container_disk_quota="false" --executor_registration_timeout="1mins" --executor_reregistration_timeout="2secs"
--executor_shutdown_grace_period="5secs" --fetcher_cache_dir="/tmp/Endpoint_SlaveEndpointTest_NoAuthorizer_2_wMa3d6/fetch"
--fetcher_cache_size="2GB" --frameworks_home="" --gc_delay="1weeks" --gc_disk_headroom="0.1"
--hadoop_home="" --help="false" --hostname_lookup="true" --http_command_executor="false" --http_credentials="/tmp/Endpoint_SlaveEndpointTest_NoAuthorizer_2_wMa3d6/http_credentials"
--http_heartbeat_interval="30secs" --initialize_driver_logging="true" --isolation="posix/cpu,posix/mem"
--launcher="posix" --launcher_dir="/tmp/SRC/build/mesos-1.6.0/_build/sub/src" --logbufsecs="0"
--logging_level="INFO" --max_completed_executors_per_framework="150" --oversubscribed_resources_interval="15secs"
--perf_duration="10secs" --perf_interval="1mins" --port="5051" --qos_correction_interval_min="0ns"
--quiet="false" --reconfiguration_policy="equal" --recover="reconnect" --recovery_timeout="15mins"
--registration_backoff_factor="10ms" --resources="cpus:2;gpus:0;mem:1024;disk:1024;ports:[31000-32000]"
--revocable_cpu_low_priority="true" --runtime_dir="/tmp/Endpoint_SlaveEndpointTest_NoAuthorizer_2_wMa3d6"
--sandbox_directory="/mnt/mesos/sandbox" --strict="true" --switch_user="true" --systemd_enable_support="true"
--systemd_runtime_directory="/run/systemd/system" --version="false" --work_dir="/tmp/Endpoint_SlaveEndpointTest_NoAuthorizer_2_4sjYmu"
--zk_session_timeout="10secs"
I0213 14:09:53.096316 32483 credentials.hpp:86] Loading credential for authentication from
'/tmp/Endpoint_SlaveEndpointTest_NoAuthorizer_2_wMa3d6/credential'
I0213 14:09:53.096483 32483 slave.cpp:295] Agent using credential for: test-principal
I0213 14:09:53.096508 32483 credentials.hpp:37] Loading credentials for authentication from
'/tmp/Endpoint_SlaveEndpointTest_NoAuthorizer_2_wMa3d6/http_credentials'
I0213 14:09:53.096783 32483 http.cpp:1045] Creating default 'basic' HTTP authenticator for
realm 'mesos-agent-readonly'
I0213 14:09:53.098713 32483 slave.cpp:612] Agent resources: [{"name":"cpus","scalar":{"value":2.0},"type":"SCALAR"},{"name":"mem","scalar":{"value":1024.0},"type":"SCALAR"},{"name":"disk","scalar":{"value":1024.0},"type":"SCALAR"},{"name":"ports","ranges":{"range":[{"begin":31000,"end":32000}]},"type":"RANGES"}]
I0213 14:09:53.098960 32483 slave.cpp:620] Agent attributes: [  ]
I0213 14:09:53.098978 32483 slave.cpp:629] Agent hostname: 72e58848cd2b
I0213 14:09:53.099153 32481 task_status_update_manager.cpp:181] Pausing sending task status
updates
I0213 14:09:53.100996 32476 state.cpp:66] Recovering state from '/tmp/Endpoint_SlaveEndpointTest_NoAuthorizer_2_4sjYmu/meta'
I0213 14:09:53.101575 32487 task_status_update_manager.cpp:207] Recovering task status update
manager
I0213 14:09:53.101923 32475 containerizer.cpp:674] Recovering containerizer
I0213 14:09:53.104176 32476 provisioner.cpp:495] Provisioner recovery complete
I0213 14:09:53.104652 32487 slave.cpp:6860] Finished recovery
I0213 14:09:53.128254 32483 process.cpp:3564] Handling HTTP event for process 'slave(997)'
with path: '/slave(997)/containers'
I0213 14:09:53.130194 32487 http.cpp:1185] HTTP GET for /slave(997)/containers from 172.17.0.3:56729
I0213 14:09:53.130288 32487 http.cpp:976] Authorizing principal 'test-principal' to GET the
'/containers' endpoint
I0213 14:09:53.134763 32475 slave.cpp:931] Agent terminating
[       OK ] Endpoint/SlaveEndpointTest.NoAuthorizer/2 (108 ms)
[----------] 9 tests from Endpoint/SlaveEndpointTest (536 ms total)

[----------] 2 tests from ContainerizerType/DefaultContainerDNSFlagTest
[ RUN      ] ContainerizerType/DefaultContainerDNSFlagTest.ValidateFlag/0
[       OK ] ContainerizerType/DefaultContainerDNSFlagTest.ValidateFlag/0 (11 ms)
[ RUN      ] ContainerizerType/DefaultContainerDNSFlagTest.ValidateFlag/1
[       OK ] ContainerizerType/DefaultContainerDNSFlagTest.ValidateFlag/1 (10 ms)
[----------] 2 tests from ContainerizerType/DefaultContainerDNSFlagTest (21 ms total)

[----------] Global test environment tear-down
[==========] 1913 tests from 192 test cases ran. (768211 ms total)
[  PASSED  ] 1912 tests.
[  FAILED  ] 1 test, listed below:
[  FAILED  ] PersistentVolumeEndpointsTest.EndpointCreateThenOfferRemove

 1 FAILED TEST
  YOU HAVE 23 DISABLED TESTS

I0213 14:09:53.312342 32489 process.cpp:929] Stopped the socket accept loop
Makefile:14660: recipe for target 'check-local' failed
make[4]: *** [check-local] Error 1
make[4]: Leaving directory '/tmp/SRC/build/mesos-1.6.0/_build/sub/src'
Makefile:13793: recipe for target 'check-am' failed
make[3]: *** [check-am] Error 2
make[3]: Leaving directory '/tmp/SRC/build/mesos-1.6.0/_build/sub/src'
Makefile:13797: recipe for target 'check' failed
make[2]: *** [check] Error 2
make[2]: Leaving directory '/tmp/SRC/build/mesos-1.6.0/_build/sub/src'
Makefile:774: recipe for target 'check-recursive' failed
make[1]: *** [check-recursive] Error 1
make[1]: Leaving directory '/tmp/SRC/build/mesos-1.6.0/_build/sub'
Makefile:980: recipe for target 'distcheck' failed
make: *** [distcheck] Error 1
Untagged: mesos/mesos-build:ubuntu-16.04
Untagged: mesos/mesos-build@sha256:3643a2cc107ff04ee2d7628a48cff8bee6186b98bcaa5ce36f685d28d8b04dae
Deleted: sha256:df13eb8a4c4b15c8e09329265603b7fcacc7753bc731057e91c06554acab5a10
Deleted: sha256:f50f81f71ec4d5b88ef535ef34e07a1abfe00cec71bd4518a0bee2348c0c6229
Deleted: sha256:334c2f430d63071d6f077369f301016b59d5421b28a6df435c63aa2209f480e7
Deleted: sha256:7a41f53b59bb61bde6d3dc9a41c4dd87e6ff5141b36da06529c2cb32e6733d63
Deleted: sha256:4b569c802f795bb918a504e6ce315cddecfb633aee338ee535e7cfbe5c2801a3
Build step 'Execute shell' marked build as failure


Mime
View raw message