mesos-builds mailing list archives

Site index · List index
Message view « Date » · « Thread »
Top « Date » · « Thread »
From Apache Jenkins Server <jenk...@builds.apache.org>
Subject Build failed in Jenkins: Mesos-Reviewbot #21670
Date Fri, 16 Feb 2018 19:55:25 GMT
See <https://builds.apache.org/job/Mesos-Reviewbot/21670/display/redirect?page=changes>

Changes:

[alexr] Added MESOS-6616 to the 1.4.2 CHANGELOG.

------------------------------------------
[...truncated 37.00 MB...]
I0216 19:55:11.540259 32483 http.cpp:1185] HTTP GET for /slave(992)/monitor/statistics from
172.17.0.3:53660
I0216 19:55:11.540441 32483 http.cpp:976] Authorizing principal 'test-principal' to GET the
'/monitor/statistics' endpoint
I0216 19:55:11.589395 32479 slave.cpp:922] Agent terminating
[       OK ] Endpoint/SlaveEndpointTest.AuthorizedRequest/0 (179 ms)
[ RUN      ] Endpoint/SlaveEndpointTest.AuthorizedRequest/1
I0216 19:55:11.673895 32475 containerizer.cpp:304] Using isolation { environment_secret, posix/cpu,
posix/mem, filesystem/posix, network/cni }
W0216 19:55:11.674664 32475 backend.cpp:76] Failed to create 'aufs' backend: AufsBackend requires
root privileges
W0216 19:55:11.674702 32475 backend.cpp:76] Failed to create 'bind' backend: BindBackend requires
root privileges
I0216 19:55:11.674747 32475 provisioner.cpp:299] Using default backend 'copy'
I0216 19:55:11.681332 32480 slave.cpp:262] Mesos agent started on (993)@172.17.0.3:43196
I0216 19:55:11.681367 32480 slave.cpp:263] Flags at startup: --acls="" --appc_simple_discovery_uri_prefix="http://"
--appc_store_dir="/tmp/Endpoint_SlaveEndpointTest_AuthorizedRequest_1_MZtCa3/store/appc" --authenticate_http_readonly="true"
--authenticate_http_readwrite="false" --authenticatee="crammd5" --authentication_backoff_factor="1secs"
--authorizer="local" --cgroups_cpu_enable_pids_and_tids_count="false" --cgroups_enable_cfs="false"
--cgroups_hierarchy="/sys/fs/cgroup" --cgroups_limit_swap="false" --cgroups_root="mesos" --container_disk_watch_interval="15secs"
--containerizers="mesos" --credential="/tmp/Endpoint_SlaveEndpointTest_AuthorizedRequest_1_MZtCa3/credential"
--default_role="*" --disallow_sharing_agent_pid_namespace="false" --disk_watch_interval="1mins"
--docker="docker" --docker_kill_orphans="true" --docker_registry="https://registry-1.docker.io"
--docker_remove_delay="6hrs" --docker_socket="/var/run/docker.sock" --docker_stop_timeout="0ns"
--docker_store_dir="/tmp/Endpoint_SlaveEndpointTest_AuthorizedRequest_1_MZtCa3/store/docker"
--docker_volume_checkpoint_dir="/var/run/mesos/isolators/docker/volume" --enforce_container_disk_quota="false"
--executor_registration_timeout="1mins" --executor_reregistration_timeout="2secs" --executor_shutdown_grace_period="5secs"
--fetcher_cache_dir="/tmp/Endpoint_SlaveEndpointTest_AuthorizedRequest_1_MZtCa3/fetch" --fetcher_cache_size="2GB"
--frameworks_home="" --gc_delay="1weeks" --gc_disk_headroom="0.1" --hadoop_home="" --help="false"
--hostname_lookup="true" --http_command_executor="false" --http_credentials="/tmp/Endpoint_SlaveEndpointTest_AuthorizedRequest_1_MZtCa3/http_credentials"
--http_heartbeat_interval="30secs" --initialize_driver_logging="true" --isolation="posix/cpu,posix/mem"
--launcher="posix" --launcher_dir="/tmp/SRC/build/mesos-1.6.0/_build/sub/src" --logbufsecs="0"
--logging_level="INFO" --max_completed_executors_per_framework="150" --oversubscribed_resources_interval="15secs"
--perf_duration="10secs" --perf_interval="1mins" --port="5051" --qos_correction_interval_min="0ns"
--quiet="false" --reconfiguration_policy="equal" --recover="reconnect" --recovery_timeout="15mins"
--registration_backoff_factor="10ms" --resources="cpus:2;gpus:0;mem:1024;disk:1024;ports:[31000-32000]"
--revocable_cpu_low_priority="true" --runtime_dir="/tmp/Endpoint_SlaveEndpointTest_AuthorizedRequest_1_MZtCa3"
--sandbox_directory="/mnt/mesos/sandbox" --strict="true" --switch_user="true" --systemd_enable_support="true"
--systemd_runtime_directory="/run/systemd/system" --version="false" --work_dir="/tmp/Endpoint_SlaveEndpointTest_AuthorizedRequest_1_TUwnCA"
--zk_session_timeout="10secs"
I0216 19:55:11.681949 32480 credentials.hpp:86] Loading credential for authentication from
'/tmp/Endpoint_SlaveEndpointTest_AuthorizedRequest_1_MZtCa3/credential'
I0216 19:55:11.682195 32480 slave.cpp:295] Agent using credential for: test-principal
I0216 19:55:11.682224 32480 credentials.hpp:37] Loading credentials for authentication from
'/tmp/Endpoint_SlaveEndpointTest_AuthorizedRequest_1_MZtCa3/http_credentials'
I0216 19:55:11.682533 32480 http.cpp:1045] Creating default 'basic' HTTP authenticator for
realm 'mesos-agent-readonly'
I0216 19:55:11.684890 32480 slave.cpp:612] Agent resources: [{"name":"cpus","scalar":{"value":2.0},"type":"SCALAR"},{"name":"mem","scalar":{"value":1024.0},"type":"SCALAR"},{"name":"disk","scalar":{"value":1024.0},"type":"SCALAR"},{"name":"ports","ranges":{"range":[{"begin":31000,"end":32000}]},"type":"RANGES"}]
I0216 19:55:11.685243 32480 slave.cpp:620] Agent attributes: [  ]
I0216 19:55:11.685267 32480 slave.cpp:629] Agent hostname: 2a6ad27a7fef
I0216 19:55:11.686235 32486 task_status_update_manager.cpp:181] Pausing sending task status
updates
I0216 19:55:11.687994 32480 state.cpp:66] Recovering state from '/tmp/Endpoint_SlaveEndpointTest_AuthorizedRequest_1_TUwnCA/meta'
I0216 19:55:11.688482 32479 task_status_update_manager.cpp:207] Recovering task status update
manager
I0216 19:55:11.688758 32481 containerizer.cpp:674] Recovering containerizer
I0216 19:55:11.691393 32483 provisioner.cpp:495] Provisioner recovery complete
I0216 19:55:11.697139 32483 slave.cpp:7232] Finished recovery
I0216 19:55:11.702586 32480 process.cpp:3564] Handling HTTP event for process 'slave(993)'
with path: '/slave(993)/monitor/statistics.json'
I0216 19:55:11.705548 32480 http.cpp:1185] HTTP GET for /slave(993)/monitor/statistics.json
from 172.17.0.3:53665
I0216 19:55:11.705651 32480 http.cpp:976] Authorizing principal 'test-principal' to GET the
'/monitor/statistics.json' endpoint
I0216 19:55:11.727393 32475 slave.cpp:922] Agent terminating
[       OK ] Endpoint/SlaveEndpointTest.AuthorizedRequest/1 (167 ms)
[ RUN      ] Endpoint/SlaveEndpointTest.AuthorizedRequest/2
I0216 19:55:11.842605 32475 containerizer.cpp:304] Using isolation { environment_secret, posix/cpu,
posix/mem, filesystem/posix, network/cni }
W0216 19:55:11.843546 32475 backend.cpp:76] Failed to create 'aufs' backend: AufsBackend requires
root privileges
W0216 19:55:11.843647 32475 backend.cpp:76] Failed to create 'bind' backend: BindBackend requires
root privileges
I0216 19:55:11.843739 32475 provisioner.cpp:299] Using default backend 'copy'
I0216 19:55:11.850445 32480 slave.cpp:262] Mesos agent started on (994)@172.17.0.3:43196
I0216 19:55:11.850554 32480 slave.cpp:263] Flags at startup: --acls="" --appc_simple_discovery_uri_prefix="http://"
--appc_store_dir="/tmp/Endpoint_SlaveEndpointTest_AuthorizedRequest_2_w8vgLU/store/appc" --authenticate_http_readonly="true"
--authenticate_http_readwrite="false" --authenticatee="crammd5" --authentication_backoff_factor="1secs"
--authorizer="local" --cgroups_cpu_enable_pids_and_tids_count="false" --cgroups_enable_cfs="false"
--cgroups_hierarchy="/sys/fs/cgroup" --cgroups_limit_swap="false" --cgroups_root="mesos" --container_disk_watch_interval="15secs"
--containerizers="mesos" --credential="/tmp/Endpoint_SlaveEndpointTest_AuthorizedRequest_2_w8vgLU/credential"
--default_role="*" --disallow_sharing_agent_pid_namespace="false" --disk_watch_interval="1mins"
--docker="docker" --docker_kill_orphans="true" --docker_registry="https://registry-1.docker.io"
--docker_remove_delay="6hrs" --docker_socket="/var/run/docker.sock" --docker_stop_timeout="0ns"
--docker_store_dir="/tmp/Endpoint_SlaveEndpointTest_AuthorizedRequest_2_w8vgLU/store/docker"
--docker_volume_checkpoint_dir="/var/run/mesos/isolators/docker/volume" --enforce_container_disk_quota="false"
--executor_registration_timeout="1mins" --executor_reregistration_timeout="2secs" --executor_shutdown_grace_period="5secs"
--fetcher_cache_dir="/tmp/Endpoint_SlaveEndpointTest_AuthorizedRequest_2_w8vgLU/fetch" --fetcher_cache_size="2GB"
--frameworks_home="" --gc_delay="1weeks" --gc_disk_headroom="0.1" --hadoop_home="" --help="false"
--hostname_lookup="true" --http_command_executor="false" --http_credentials="/tmp/Endpoint_SlaveEndpointTest_AuthorizedRequest_2_w8vgLU/http_credentials"
--http_heartbeat_interval="30secs" --initialize_driver_logging="true" --isolation="posix/cpu,posix/mem"
--launcher="posix" --launcher_dir="/tmp/SRC/build/mesos-1.6.0/_build/sub/src" --logbufsecs="0"
--logging_level="INFO" --max_completed_executors_per_framework="150" --oversubscribed_resources_interval="15secs"
--perf_duration="10secs" --perf_interval="1mins" --port="5051" --qos_correction_interval_min="0ns"
--quiet="false" --reconfiguration_policy="equal" --recover="reconnect" --recovery_timeout="15mins"
--registration_backoff_factor="10ms" --resources="cpus:2;gpus:0;mem:1024;disk:1024;ports:[31000-32000]"
--revocable_cpu_low_priority="true" --runtime_dir="/tmp/Endpoint_SlaveEndpointTest_AuthorizedRequest_2_w8vgLU"
--sandbox_directory="/mnt/mesos/sandbox" --strict="true" --switch_user="true" --systemd_enable_support="true"
--systemd_runtime_directory="/run/systemd/system" --version="false" --work_dir="/tmp/Endpoint_SlaveEndpointTest_AuthorizedRequest_2_fC7OLr"
--zk_session_timeout="10secs"
I0216 19:55:11.851209 32480 credentials.hpp:86] Loading credential for authentication from
'/tmp/Endpoint_SlaveEndpointTest_AuthorizedRequest_2_w8vgLU/credential'
I0216 19:55:11.851495 32480 slave.cpp:295] Agent using credential for: test-principal
I0216 19:55:11.851577 32480 credentials.hpp:37] Loading credentials for authentication from
'/tmp/Endpoint_SlaveEndpointTest_AuthorizedRequest_2_w8vgLU/http_credentials'
I0216 19:55:11.851941 32480 http.cpp:1045] Creating default 'basic' HTTP authenticator for
realm 'mesos-agent-readonly'
I0216 19:55:11.854552 32480 slave.cpp:612] Agent resources: [{"name":"cpus","scalar":{"value":2.0},"type":"SCALAR"},{"name":"mem","scalar":{"value":1024.0},"type":"SCALAR"},{"name":"disk","scalar":{"value":1024.0},"type":"SCALAR"},{"name":"ports","ranges":{"range":[{"begin":31000,"end":32000}]},"type":"RANGES"}]
I0216 19:55:11.854940 32480 slave.cpp:620] Agent attributes: [  ]
I0216 19:55:11.855003 32480 slave.cpp:629] Agent hostname: 2a6ad27a7fef
I0216 19:55:11.856015 32488 task_status_update_manager.cpp:181] Pausing sending task status
updates
I0216 19:55:11.857832 32480 state.cpp:66] Recovering state from '/tmp/Endpoint_SlaveEndpointTest_AuthorizedRequest_2_fC7OLr/meta'
I0216 19:55:11.858505 32485 task_status_update_manager.cpp:207] Recovering task status update
manager
I0216 19:55:11.858860 32477 containerizer.cpp:674] Recovering containerizer
I0216 19:55:11.862009 32479 provisioner.cpp:495] Provisioner recovery complete
I0216 19:55:11.862896 32482 slave.cpp:7232] Finished recovery
I0216 19:55:11.872988 32479 process.cpp:3564] Handling HTTP event for process 'slave(994)'
with path: '/slave(994)/containers'
I0216 19:55:11.875969 32479 http.cpp:1185] HTTP GET for /slave(994)/containers from 172.17.0.3:53668
I0216 19:55:11.876071 32479 http.cpp:976] Authorizing principal 'test-principal' to GET the
'/containers' endpoint
I0216 19:55:11.913529 32475 slave.cpp:922] Agent terminating
[       OK ] Endpoint/SlaveEndpointTest.AuthorizedRequest/2 (149 ms)
[ RUN      ] Endpoint/SlaveEndpointTest.UnauthorizedRequest/0
I0216 19:55:11.990924 32475 containerizer.cpp:304] Using isolation { environment_secret, posix/cpu,
posix/mem, filesystem/posix, network/cni }
W0216 19:55:11.991799 32475 backend.cpp:76] Failed to create 'aufs' backend: AufsBackend requires
root privileges
W0216 19:55:11.991837 32475 backend.cpp:76] Failed to create 'bind' backend: BindBackend requires
root privileges
I0216 19:55:11.991886 32475 provisioner.cpp:299] Using default backend 'copy'
I0216 19:55:12.000227 32482 slave.cpp:262] Mesos agent started on (995)@172.17.0.3:43196
I0216 19:55:12.000272 32482 slave.cpp:263] Flags at startup: --acls="" --appc_simple_discovery_uri_prefix="http://"
--appc_store_dir="/tmp/Endpoint_SlaveEndpointTest_UnauthorizedRequest_0_UQKIXN/store/appc"
--authenticate_http_readonly="true" --authenticate_http_readwrite="false" --authenticatee="crammd5"
--authentication_backoff_factor="1secs" --authorizer="local" --cgroups_cpu_enable_pids_and_tids_count="false"
--cgroups_enable_cfs="false" --cgroups_hierarchy="/sys/fs/cgroup" --cgroups_limit_swap="false"
--cgroups_root="mesos" --container_disk_watch_interval="15secs" --containerizers="mesos" --credential="/tmp/Endpoint_SlaveEndpointTest_UnauthorizedRequest_0_UQKIXN/credential"
--default_role="*" --disallow_sharing_agent_pid_namespace="false" --disk_watch_interval="1mins"
--docker="docker" --docker_kill_orphans="true" --docker_registry="https://registry-1.docker.io"
--docker_remove_delay="6hrs" --docker_socket="/var/run/docker.sock" --docker_stop_timeout="0ns"
--docker_store_dir="/tmp/Endpoint_SlaveEndpointTest_UnauthorizedRequest_0_UQKIXN/store/docker"
--docker_volume_checkpoint_dir="/var/run/mesos/isolators/docker/volume" --enforce_container_disk_quota="false"
--executor_registration_timeout="1mins" --executor_reregistration_timeout="2secs" --executor_shutdown_grace_period="5secs"
--fetcher_cache_dir="/tmp/Endpoint_SlaveEndpointTest_UnauthorizedRequest_0_UQKIXN/fetch" --fetcher_cache_size="2GB"
--frameworks_home="" --gc_delay="1weeks" --gc_disk_headroom="0.1" --hadoop_home="" --help="false"
--hostname_lookup="true" --http_command_executor="false" --http_credentials="/tmp/Endpoint_SlaveEndpointTest_UnauthorizedRequest_0_UQKIXN/http_credentials"
--http_heartbeat_interval="30secs" --initialize_driver_logging="true" --isolation="posix/cpu,posix/mem"
--launcher="posix" --launcher_dir="/tmp/SRC/build/mesos-1.6.0/_build/sub/src" --logbufsecs="0"
--logging_level="INFO" --max_completed_executors_per_framework="150" --oversubscribed_resources_interval="15secs"
--perf_duration="10secs" --perf_interval="1mins" --port="5051" --qos_correction_interval_min="0ns"
--quiet="false" --reconfiguration_policy="equal" --recover="reconnect" --recovery_timeout="15mins"
--registration_backoff_factor="10ms" --resources="cpus:2;gpus:0;mem:1024;disk:1024;ports:[31000-32000]"
--revocable_cpu_low_priority="true" --runtime_dir="/tmp/Endpoint_SlaveEndpointTest_UnauthorizedRequest_0_UQKIXN"
--sandbox_directory="/mnt/mesos/sandbox" --strict="true" --switch_user="true" --systemd_enable_support="true"
--systemd_runtime_directory="/run/systemd/system" --version="false" --work_dir="/tmp/Endpoint_SlaveEndpointTest_UnauthorizedRequest_0_MOvXzk"
--zk_session_timeout="10secs"
I0216 19:55:12.000967 32482 credentials.hpp:86] Loading credential for authentication from
'/tmp/Endpoint_SlaveEndpointTest_UnauthorizedRequest_0_UQKIXN/credential'
I0216 19:55:12.001245 32482 slave.cpp:295] Agent using credential for: test-principal
I0216 19:55:12.001277 32482 credentials.hpp:37] Loading credentials for authentication from
'/tmp/Endpoint_SlaveEndpointTest_UnauthorizedRequest_0_UQKIXN/http_credentials'
I0216 19:55:12.001621 32482 http.cpp:1045] Creating default 'basic' HTTP authenticator for
realm 'mesos-agent-readonly'
I0216 19:55:12.004328 32482 slave.cpp:612] Agent resources: [{"name":"cpus","scalar":{"value":2.0},"type":"SCALAR"},{"name":"mem","scalar":{"value":1024.0},"type":"SCALAR"},{"name":"disk","scalar":{"value":1024.0},"type":"SCALAR"},{"name":"ports","ranges":{"range":[{"begin":31000,"end":32000}]},"type":"RANGES"}]
I0216 19:55:12.004658 32482 slave.cpp:620] Agent attributes: [  ]
I0216 19:55:12.004684 32482 slave.cpp:629] Agent hostname: 2a6ad27a7fef
I0216 19:55:12.005230 32486 task_status_update_manager.cpp:181] Pausing sending task status
updates
I0216 19:55:12.008795 32481 state.cpp:66] Recovering state from '/tmp/Endpoint_SlaveEndpointTest_UnauthorizedRequest_0_MOvXzk/meta'
I0216 19:55:12.021797 32482 task_status_update_manager.cpp:207] Recovering task status update
manager
I0216 19:55:12.022228 32489 containerizer.cpp:674] Recovering containerizer
I0216 19:55:12.025669 32489 provisioner.cpp:495] Provisioner recovery complete
I0216 19:55:12.026311 32491 slave.cpp:7232] Finished recovery
I0216 19:55:12.037142 32488 process.cpp:3564] Handling HTTP event for process 'slave(995)'
with path: '/slave(995)/monitor/statistics'
I0216 19:55:12.040089 32478 http.cpp:1185] HTTP GET for /slave(995)/monitor/statistics from
172.17.0.3:53674
I0216 19:55:12.040854 32478 http.cpp:976] Authorizing principal 'test-principal' to GET the
'/monitor/statistics' endpoint
I0216 19:55:12.046022 32475 slave.cpp:922] Agent terminating
[       OK ] Endpoint/SlaveEndpointTest.UnauthorizedRequest/0 (147 ms)
[ RUN      ] Endpoint/SlaveEndpointTest.UnauthorizedRequest/1
I0216 19:55:12.139334 32475 containerizer.cpp:304] Using isolation { environment_secret, posix/cpu,
posix/mem, filesystem/posix, network/cni }
W0216 19:55:12.140147 32475 backend.cpp:76] Failed to create 'aufs' backend: AufsBackend requires
root privileges
W0216 19:55:12.140187 32475 backend.cpp:76] Failed to create 'bind' backend: BindBackend requires
root privileges
I0216 19:55:12.140233 32475 provisioner.cpp:299] Using default backend 'copy'
I0216 19:55:12.148964 32486 slave.cpp:262] Mesos agent started on (996)@172.17.0.3:43196
I0216 19:55:12.149006 32486 slave.cpp:263] Flags at startup: --acls="" --appc_simple_discovery_uri_prefix="http://"
--appc_store_dir="/tmp/Endpoint_SlaveEndpointTest_UnauthorizedRequest_1_nHY3KI/store/appc"
--authenticate_http_readonly="true" --authenticate_http_readwrite="false" --authenticatee="crammd5"
--authentication_backoff_factor="1secs" --authorizer="local" --cgroups_cpu_enable_pids_and_tids_count="false"
--cgroups_enable_cfs="false" --cgroups_hierarchy="/sys/fs/cgroup" --cgroups_limit_swap="false"
--cgroups_root="mesos" --container_disk_watch_interval="15secs" --containerizers="mesos" --credential="/tmp/Endpoint_SlaveEndpointTest_UnauthorizedRequest_1_nHY3KI/credential"
--default_role="*" --disallow_sharing_agent_pid_namespace="false" --disk_watch_interval="1mins"
--docker="docker" --docker_kill_orphans="true" --docker_registry="https://registry-1.docker.io"
--docker_remove_delay="6hrs" --docker_socket="/var/run/docker.sock" --docker_stop_timeout="0ns"
--docker_store_dir="/tmp/Endpoint_SlaveEndpointTest_UnauthorizedRequest_1_nHY3KI/store/docker"
--docker_volume_checkpoint_dir="/var/run/mesos/isolators/docker/volume" --enforce_container_disk_quota="false"
--executor_registration_timeout="1mins" --executor_reregistration_timeout="2secs" --executor_shutdown_grace_period="5secs"
--fetcher_cache_dir="/tmp/Endpoint_SlaveEndpointTest_UnauthorizedRequest_1_nHY3KI/fetch" --fetcher_cache_size="2GB"
--frameworks_home="" --gc_delay="1weeks" --gc_disk_headroom="0.1" --hadoop_home="" --help="false"
--hostname_lookup="true" --http_command_executor="false" --http_credentials="/tmp/Endpoint_SlaveEndpointTest_UnauthorizedRequest_1_nHY3KI/http_credentials"
--http_heartbeat_interval="30secs" --initialize_driver_logging="true" --isolation="posix/cpu,posix/mem"
--launcher="posix" --launcher_dir="/tmp/SRC/build/mesos-1.6.0/_build/sub/src" --logbufsecs="0"
--logging_level="INFO" --max_completed_executors_per_framework="150" --oversubscribed_resources_interval="15secs"
--perf_duration="10secs" --perf_interval="1mins" --port="5051" --qos_correction_interval_min="0ns"
--quiet="false" --reconfiguration_policy="equal" --recover="reconnect" --recovery_timeout="15mins"
--registration_backoff_factor="10ms" --resources="cpus:2;gpus:0;mem:1024;disk:1024;ports:[31000-32000]"
--revocable_cpu_low_priority="true" --runtime_dir="/tmp/Endpoint_SlaveEndpointTest_UnauthorizedRequest_1_nHY3KI"
--sandbox_directory="/mnt/mesos/sandbox" --strict="true" --switch_user="true" --systemd_enable_support="true"
--systemd_runtime_directory="/run/systemd/system" --version="false" --work_dir="/tmp/Endpoint_SlaveEndpointTest_UnauthorizedRequest_1_kFgdZe"
--zk_session_timeout="10secs"
I0216 19:55:12.149650 32486 credentials.hpp:86] Loading credential for authentication from
'/tmp/Endpoint_SlaveEndpointTest_UnauthorizedRequest_1_nHY3KI/credential'
I0216 19:55:12.149914 32486 slave.cpp:295] Agent using credential for: test-principal
I0216 19:55:12.149943 32486 credentials.hpp:37] Loading credentials for authentication from
'/tmp/Endpoint_SlaveEndpointTest_UnauthorizedRequest_1_nHY3KI/http_credentials'
I0216 19:55:12.150274 32486 http.cpp:1045] Creating default 'basic' HTTP authenticator for
realm 'mesos-agent-readonly'
I0216 19:55:12.152861 32486 slave.cpp:612] Agent resources: [{"name":"cpus","scalar":{"value":2.0},"type":"SCALAR"},{"name":"mem","scalar":{"value":1024.0},"type":"SCALAR"},{"name":"disk","scalar":{"value":1024.0},"type":"SCALAR"},{"name":"ports","ranges":{"range":[{"begin":31000,"end":32000}]},"type":"RANGES"}]
I0216 19:55:12.157213 32486 slave.cpp:620] Agent attributes: [  ]
I0216 19:55:12.157243 32486 slave.cpp:629] Agent hostname: 2a6ad27a7fef
I0216 19:55:12.158242 32480 task_status_update_manager.cpp:181] Pausing sending task status
updates
I0216 19:55:12.159654 32486 state.cpp:66] Recovering state from '/tmp/Endpoint_SlaveEndpointTest_UnauthorizedRequest_1_kFgdZe/meta'
I0216 19:55:12.164113 32487 task_status_update_manager.cpp:207] Recovering task status update
manager
I0216 19:55:12.164417 32483 containerizer.cpp:674] Recovering containerizer
I0216 19:55:12.167656 32477 provisioner.cpp:495] Provisioner recovery complete
I0216 19:55:12.168507 32486 slave.cpp:7232] Finished recovery
I0216 19:55:12.179886 32490 process.cpp:3564] Handling HTTP event for process 'slave(996)'
with path: '/slave(996)/monitor/statistics.json'
I0216 19:55:12.182788 32490 http.cpp:1185] HTTP GET for /slave(996)/monitor/statistics.json
from 172.17.0.3:53677
I0216 19:55:12.182893 32490 http.cpp:976] Authorizing principal 'test-principal' to GET the
'/monitor/statistics.json' endpoint
I0216 19:55:12.201357 32490 slave.cpp:922] Agent terminating
[       OK ] Endpoint/SlaveEndpointTest.UnauthorizedRequest/1 (158 ms)
[ RUN      ] Endpoint/SlaveEndpointTest.UnauthorizedRequest/2
I0216 19:55:12.299568 32475 containerizer.cpp:304] Using isolation { environment_secret, posix/cpu,
posix/mem, filesystem/posix, network/cni }
W0216 19:55:12.300449 32475 backend.cpp:76] Failed to create 'aufs' backend: AufsBackend requires
root privileges
W0216 19:55:12.300482 32475 backend.cpp:76] Failed to create 'bind' backend: BindBackend requires
root privileges
I0216 19:55:12.300525 32475 provisioner.cpp:299] Using default backend 'copy'
I0216 19:55:12.307363 32483 slave.cpp:262] Mesos agent started on (997)@172.17.0.3:43196
I0216 19:55:12.307409 32483 slave.cpp:263] Flags at startup: --acls="" --appc_simple_discovery_uri_prefix="http://"
--appc_store_dir="/tmp/Endpoint_SlaveEndpointTest_UnauthorizedRequest_2_EpZFaF/store/appc"
--authenticate_http_readonly="true" --authenticate_http_readwrite="false" --authenticatee="crammd5"
--authentication_backoff_factor="1secs" --authorizer="local" --cgroups_cpu_enable_pids_and_tids_count="false"
--cgroups_enable_cfs="false" --cgroups_hierarchy="/sys/fs/cgroup" --cgroups_limit_swap="false"
--cgroups_root="mesos" --container_disk_watch_interval="15secs" --containerizers="mesos" --credential="/tmp/Endpoint_SlaveEndpointTest_UnauthorizedRequest_2_EpZFaF/credential"
--default_role="*" --disallow_sharing_agent_pid_namespace="false" --disk_watch_interval="1mins"
--docker="docker" --docker_kill_orphans="true" --docker_registry="https://registry-1.docker.io"
--docker_remove_delay="6hrs" --docker_socket="/var/run/docker.sock" --docker_stop_timeout="0ns"
--docker_store_dir="/tmp/Endpoint_SlaveEndpointTest_UnauthorizedRequest_2_EpZFaF/store/docker"
--docker_volume_checkpoint_dir="/var/run/mesos/isolators/docker/volume" --enforce_container_disk_quota="false"
--executor_registration_timeout="1mins" --executor_reregistration_timeout="2secs" --executor_shutdown_grace_period="5secs"
--fetcher_cache_dir="/tmp/Endpoint_SlaveEndpointTest_UnauthorizedRequest_2_EpZFaF/fetch" --fetcher_cache_size="2GB"
--frameworks_home="" --gc_delay="1weeks" --gc_disk_headroom="0.1" --hadoop_home="" --help="false"
--hostname_lookup="true" --http_command_executor="false" --http_credentials="/tmp/Endpoint_SlaveEndpointTest_UnauthorizedRequest_2_EpZFaF/http_credentials"
--http_heartbeat_interval="30secs" --initialize_driver_logging="true" --isolation="posix/cpu,posix/mem"
--launcher="posix" --launcher_dir="/tmp/SRC/build/mesos-1.6.0/_build/sub/src" --logbufsecs="0"
--logging_level="INFO" --max_completed_executors_per_framework="150" --oversubscribed_resources_interval="15secs"
--perf_duration="10secs" --perf_interval="1mins" --port="5051" --qos_correction_interval_min="0ns"
--quiet="false" --reconfiguration_policy="equal" --recover="reconnect" --recovery_timeout="15mins"
--registration_backoff_factor="10ms" --resources="cpus:2;gpus:0;mem:1024;disk:1024;ports:[31000-32000]"
--revocable_cpu_low_priority="true" --runtime_dir="/tmp/Endpoint_SlaveEndpointTest_UnauthorizedRequest_2_EpZFaF"
--sandbox_directory="/mnt/mesos/sandbox" --strict="true" --switch_user="true" --systemd_enable_support="true"
--systemd_runtime_directory="/run/systemd/system" --version="false" --work_dir="/tmp/Endpoint_SlaveEndpointTest_UnauthorizedRequest_2_BO65Ya"
--zk_session_timeout="10secs"
I0216 19:55:12.308022 32483 credentials.hpp:86] Loading credential for authentication from
'/tmp/Endpoint_SlaveEndpointTest_UnauthorizedRequest_2_EpZFaF/credential'
I0216 19:55:12.308288 32483 slave.cpp:295] Agent using credential for: test-principal
I0216 19:55:12.308318 32483 credentials.hpp:37] Loading credentials for authentication from
'/tmp/Endpoint_SlaveEndpointTest_UnauthorizedRequest_2_EpZFaF/http_credentials'
I0216 19:55:12.308634 32483 http.cpp:1045] Creating default 'basic' HTTP authenticator for
realm 'mesos-agent-readonly'
I0216 19:55:12.311236 32483 slave.cpp:612] Agent resources: [{"name":"cpus","scalar":{"value":2.0},"type":"SCALAR"},{"name":"mem","scalar":{"value":1024.0},"type":"SCALAR"},{"name":"disk","scalar":{"value":1024.0},"type":"SCALAR"},{"name":"ports","ranges":{"range":[{"begin":31000,"end":32000}]},"type":"RANGES"}]
I0216 19:55:12.311561 32483 slave.cpp:620] Agent attributes: [  ]
I0216 19:55:12.311586 32483 slave.cpp:629] Agent hostname: 2a6ad27a7fef
I0216 19:55:12.311796 32490 task_status_update_manager.cpp:181] Pausing sending task status
updates
I0216 19:55:12.314370 32483 state.cpp:66] Recovering state from '/tmp/Endpoint_SlaveEndpointTest_UnauthorizedRequest_2_BO65Ya/meta'
I0216 19:55:12.314877 32477 task_status_update_manager.cpp:207] Recovering task status update
manager
I0216 19:55:12.316504 32484 containerizer.cpp:674] Recovering containerizer
I0216 19:55:12.321830 32481 provisioner.cpp:495] Provisioner recovery complete
I0216 19:55:12.322582 32489 slave.cpp:7232] Finished recovery
I0216 19:55:12.329344 32489 process.cpp:3564] Handling HTTP event for process 'slave(997)'
with path: '/slave(997)/containers'
I0216 19:55:12.332715 32489 http.cpp:1185] HTTP GET for /slave(997)/containers from 172.17.0.3:53684
I0216 19:55:12.332907 32489 http.cpp:976] Authorizing principal 'test-principal' to GET the
'/containers' endpoint
I0216 19:55:12.377192 32483 slave.cpp:922] Agent terminating
[       OK ] Endpoint/SlaveEndpointTest.UnauthorizedRequest/2 (193 ms)
[ RUN      ] Endpoint/SlaveEndpointTest.NoAuthorizer/0
I0216 19:55:12.494122 32475 containerizer.cpp:304] Using isolation { environment_secret, posix/cpu,
posix/mem, filesystem/posix, network/cni }
W0216 19:55:12.495000 32475 backend.cpp:76] Failed to create 'aufs' backend: AufsBackend requires
root privileges
W0216 19:55:12.498522 32475 backend.cpp:76] Failed to create 'bind' backend: BindBackend requires
root privileges
I0216 19:55:12.498621 32475 provisioner.cpp:299] Using default backend 'copy'
I0216 19:55:12.501855 32475 cluster.cpp:460] Creating default 'local' authorizer
I0216 19:55:12.506865 32486 slave.cpp:262] Mesos agent started on (998)@172.17.0.3:43196
I0216 19:55:12.507069 32486 slave.cpp:263] Flags at startup: --acls="" --appc_simple_discovery_uri_prefix="http://"
--appc_store_dir="/tmp/Endpoint_SlaveEndpointTest_NoAuthorizer_0_vvtpwD/store/appc" --authenticate_http_readonly="true"
--authenticate_http_readwrite="false" --authenticatee="crammd5" --authentication_backoff_factor="1secs"
--authorizer="local" --cgroups_cpu_enable_pids_and_tids_count="false" --cgroups_enable_cfs="false"
--cgroups_hierarchy="/sys/fs/cgroup" --cgroups_limit_swap="false" --cgroups_root="mesos" --container_disk_watch_interval="15secs"
--containerizers="mesos" --credential="/tmp/Endpoint_SlaveEndpointTest_NoAuthorizer_0_vvtpwD/credential"
--default_role="*" --disallow_sharing_agent_pid_namespace="false" --disk_watch_interval="1mins"
--docker="docker" --docker_kill_orphans="true" --docker_registry="https://registry-1.docker.io"
--docker_remove_delay="6hrs" --docker_socket="/var/run/docker.sock" --docker_stop_timeout="0ns"
--docker_store_dir="/tmp/Endpoint_SlaveEndpointTest_NoAuthorizer_0_vvtpwD/store/docker" --docker_volume_checkpoint_dir="/var/run/mesos/isolators/docker/volume"
--enforce_container_disk_quota="false" --executor_registration_timeout="1mins" --executor_reregistration_timeout="2secs"
--executor_shutdown_grace_period="5secs" --fetcher_cache_dir="/tmp/Endpoint_SlaveEndpointTest_NoAuthorizer_0_vvtpwD/fetch"
--fetcher_cache_size="2GB" --frameworks_home="" --gc_delay="1weeks" --gc_disk_headroom="0.1"
--hadoop_home="" --help="false" --hostname_lookup="true" --http_command_executor="false" --http_credentials="/tmp/Endpoint_SlaveEndpointTest_NoAuthorizer_0_vvtpwD/http_credentials"
--http_heartbeat_interval="30secs" --initialize_driver_logging="true" --isolation="posix/cpu,posix/mem"
--launcher="posix" --launcher_dir="/tmp/SRC/build/mesos-1.6.0/_build/sub/src" --logbufsecs="0"
--logging_level="INFO" --max_completed_executors_per_framework="150" --oversubscribed_resources_interval="15secs"
--perf_duration="10secs" --perf_interval="1mins" --port="5051" --qos_correction_interval_min="0ns"
--quiet="false" --reconfiguration_policy="equal" --recover="reconnect" --recovery_timeout="15mins"
--registration_backoff_factor="10ms" --resources="cpus:2;gpus:0;mem:1024;disk:1024;ports:[31000-32000]"
--revocable_cpu_low_priority="true" --runtime_dir="/tmp/Endpoint_SlaveEndpointTest_NoAuthorizer_0_vvtpwD"
--sandbox_directory="/mnt/mesos/sandbox" --strict="true" --switch_user="true" --systemd_enable_support="true"
--systemd_runtime_directory="/run/systemd/system" --version="false" --work_dir="/tmp/Endpoint_SlaveEndpointTest_NoAuthorizer_0_AEW4O8"
--zk_session_timeout="10secs"
I0216 19:55:12.507935 32486 credentials.hpp:86] Loading credential for authentication from
'/tmp/Endpoint_SlaveEndpointTest_NoAuthorizer_0_vvtpwD/credential'
I0216 19:55:12.508396 32486 slave.cpp:295] Agent using credential for: test-principal
I0216 19:55:12.508575 32486 credentials.hpp:37] Loading credentials for authentication from
'/tmp/Endpoint_SlaveEndpointTest_NoAuthorizer_0_vvtpwD/http_credentials'
I0216 19:55:12.509111 32486 http.cpp:1045] Creating default 'basic' HTTP authenticator for
realm 'mesos-agent-readonly'
I0216 19:55:12.511847 32486 slave.cpp:612] Agent resources: [{"name":"cpus","scalar":{"value":2.0},"type":"SCALAR"},{"name":"mem","scalar":{"value":1024.0},"type":"SCALAR"},{"name":"disk","scalar":{"value":1024.0},"type":"SCALAR"},{"name":"ports","ranges":{"range":[{"begin":31000,"end":32000}]},"type":"RANGES"}]
I0216 19:55:12.512308 32486 slave.cpp:620] Agent attributes: [  ]
I0216 19:55:12.512413 32486 slave.cpp:629] Agent hostname: 2a6ad27a7fef
I0216 19:55:12.512800 32476 task_status_update_manager.cpp:181] Pausing sending task status
updates
I0216 19:55:12.516780 32477 state.cpp:66] Recovering state from '/tmp/Endpoint_SlaveEndpointTest_NoAuthorizer_0_AEW4O8/meta'
I0216 19:55:12.525732 32486 task_status_update_manager.cpp:207] Recovering task status update
manager
I0216 19:55:12.526223 32482 containerizer.cpp:674] Recovering containerizer
I0216 19:55:12.534586 32489 provisioner.cpp:495] Provisioner recovery complete
I0216 19:55:12.535610 32482 slave.cpp:7232] Finished recovery
I0216 19:55:12.573141 32485 process.cpp:3564] Handling HTTP event for process 'slave(998)'
with path: '/slave(998)/monitor/statistics'
I0216 19:55:12.576354 32485 http.cpp:1185] HTTP GET for /slave(998)/monitor/statistics from
172.17.0.3:53690
I0216 19:55:12.576560 32485 http.cpp:976] Authorizing principal 'test-principal' to GET the
'/monitor/statistics' endpoint
I0216 19:55:12.601156 32476 slave.cpp:922] Agent terminating
[       OK ] Endpoint/SlaveEndpointTest.NoAuthorizer/0 (211 ms)
[ RUN      ] Endpoint/SlaveEndpointTest.NoAuthorizer/1
I0216 19:55:12.705879 32475 containerizer.cpp:304] Using isolation { environment_secret, posix/cpu,
posix/mem, filesystem/posix, network/cni }
W0216 19:55:12.706718 32475 backend.cpp:76] Failed to create 'aufs' backend: AufsBackend requires
root privileges
W0216 19:55:12.706755 32475 backend.cpp:76] Failed to create 'bind' backend: BindBackend requires
root privileges
I0216 19:55:12.706804 32475 provisioner.cpp:299] Using default backend 'copy'
I0216 19:55:12.710698 32475 cluster.cpp:460] Creating default 'local' authorizer
I0216 19:55:12.715358 32485 slave.cpp:262] Mesos agent started on (999)@172.17.0.3:43196
I0216 19:55:12.715390 32485 slave.cpp:263] Flags at startup: --acls="" --appc_simple_discovery_uri_prefix="http://"
--appc_store_dir="/tmp/Endpoint_SlaveEndpointTest_NoAuthorizer_1_YK5r5D/store/appc" --authenticate_http_readonly="true"
--authenticate_http_readwrite="false" --authenticatee="crammd5" --authentication_backoff_factor="1secs"
--authorizer="local" --cgroups_cpu_enable_pids_and_tids_count="false" --cgroups_enable_cfs="false"
--cgroups_hierarchy="/sys/fs/cgroup" --cgroups_limit_swap="false" --cgroups_root="mesos" --container_disk_watch_interval="15secs"
--containerizers="mesos" --credential="/tmp/Endpoint_SlaveEndpointTest_NoAuthorizer_1_YK5r5D/credential"
--default_role="*" --disallow_sharing_agent_pid_namespace="false" --disk_watch_interval="1mins"
--docker="docker" --docker_kill_orphans="true" --docker_registry="https://registry-1.docker.io"
--docker_remove_delay="6hrs" --docker_socket="/var/run/docker.sock" --docker_stop_timeout="0ns"
--docker_store_dir="/tmp/Endpoint_SlaveEndpointTest_NoAuthorizer_1_YK5r5D/store/docker" --docker_volume_checkpoint_dir="/var/run/mesos/isolators/docker/volume"
--enforce_container_disk_quota="false" --executor_registration_timeout="1mins" --executor_reregistration_timeout="2secs"
--executor_shutdown_grace_period="5secs" --fetcher_cache_dir="/tmp/Endpoint_SlaveEndpointTest_NoAuthorizer_1_YK5r5D/fetch"
--fetcher_cache_size="2GB" --frameworks_home="" --gc_delay="1weeks" --gc_disk_headroom="0.1"
--hadoop_home="" --help="false" --hostname_lookup="true" --http_command_executor="false" --http_credentials="/tmp/Endpoint_SlaveEndpointTest_NoAuthorizer_1_YK5r5D/http_credentials"
--http_heartbeat_interval="30secs" --initialize_driver_logging="true" --isolation="posix/cpu,posix/mem"
--launcher="posix" --launcher_dir="/tmp/SRC/build/mesos-1.6.0/_build/sub/src" --logbufsecs="0"
--logging_level="INFO" --max_completed_executors_per_framework="150" --oversubscribed_resources_interval="15secs"
--perf_duration="10secs" --perf_interval="1mins" --port="5051" --qos_correction_interval_min="0ns"
--quiet="false" --reconfiguration_policy="equal" --recover="reconnect" --recovery_timeout="15mins"
--registration_backoff_factor="10ms" --resources="cpus:2;gpus:0;mem:1024;disk:1024;ports:[31000-32000]"
--revocable_cpu_low_priority="true" --runtime_dir="/tmp/Endpoint_SlaveEndpointTest_NoAuthorizer_1_YK5r5D"
--sandbox_directory="/mnt/mesos/sandbox" --strict="true" --switch_user="true" --systemd_enable_support="true"
--systemd_runtime_directory="/run/systemd/system" --version="false" --work_dir="/tmp/Endpoint_SlaveEndpointTest_NoAuthorizer_1_HCpWP8"
--zk_session_timeout="10secs"
I0216 19:55:12.715970 32485 credentials.hpp:86] Loading credential for authentication from
'/tmp/Endpoint_SlaveEndpointTest_NoAuthorizer_1_YK5r5D/credential'
I0216 19:55:12.716212 32485 slave.cpp:295] Agent using credential for: test-principal
I0216 19:55:12.716241 32485 credentials.hpp:37] Loading credentials for authentication from
'/tmp/Endpoint_SlaveEndpointTest_NoAuthorizer_1_YK5r5D/http_credentials'
I0216 19:55:12.716553 32485 http.cpp:1045] Creating default 'basic' HTTP authenticator for
realm 'mesos-agent-readonly'
I0216 19:55:12.719091 32485 slave.cpp:612] Agent resources: [{"name":"cpus","scalar":{"value":2.0},"type":"SCALAR"},{"name":"mem","scalar":{"value":1024.0},"type":"SCALAR"},{"name":"disk","scalar":{"value":1024.0},"type":"SCALAR"},{"name":"ports","ranges":{"range":[{"begin":31000,"end":32000}]},"type":"RANGES"}]
I0216 19:55:12.719413 32485 slave.cpp:620] Agent attributes: [  ]
I0216 19:55:12.719435 32485 slave.cpp:629] Agent hostname: 2a6ad27a7fef
I0216 19:55:12.719674 32483 task_status_update_manager.cpp:181] Pausing sending task status
updates
I0216 19:55:12.722896 32485 state.cpp:66] Recovering state from '/tmp/Endpoint_SlaveEndpointTest_NoAuthorizer_1_HCpWP8/meta'
I0216 19:55:12.723321 32491 task_status_update_manager.cpp:207] Recovering task status update
manager
I0216 19:55:12.723614 32491 containerizer.cpp:674] Recovering containerizer
I0216 19:55:12.726387 32484 provisioner.cpp:495] Provisioner recovery complete
I0216 19:55:12.726912 32484 slave.cpp:7232] Finished recovery
I0216 19:55:12.734016 32485 process.cpp:3564] Handling HTTP event for process 'slave(999)'
with path: '/slave(999)/monitor/statistics.json'
I0216 19:55:12.737344 32485 http.cpp:1185] HTTP GET for /slave(999)/monitor/statistics.json
from 172.17.0.3:53695
I0216 19:55:12.737736 32485 http.cpp:976] Authorizing principal 'test-principal' to GET the
'/monitor/statistics.json' endpoint
I0216 19:55:12.762596 32475 slave.cpp:922] Agent terminating
[       OK ] Endpoint/SlaveEndpointTest.NoAuthorizer/1 (157 ms)
[ RUN      ] Endpoint/SlaveEndpointTest.NoAuthorizer/2
I0216 19:55:12.863515 32475 containerizer.cpp:304] Using isolation { environment_secret, posix/cpu,
posix/mem, filesystem/posix, network/cni }
W0216 19:55:12.864326 32475 backend.cpp:76] Failed to create 'aufs' backend: AufsBackend requires
root privileges
W0216 19:55:12.864361 32475 backend.cpp:76] Failed to create 'bind' backend: BindBackend requires
root privileges
I0216 19:55:12.864406 32475 provisioner.cpp:299] Using default backend 'copy'
I0216 19:55:12.867370 32475 cluster.cpp:460] Creating default 'local' authorizer
I0216 19:55:12.872222 32490 slave.cpp:262] Mesos agent started on (1000)@172.17.0.3:43196
I0216 19:55:12.872257 32490 slave.cpp:263] Flags at startup: --acls="" --appc_simple_discovery_uri_prefix="http://"
--appc_store_dir="/tmp/Endpoint_SlaveEndpointTest_NoAuthorizer_2_fehqoG/store/appc" --authenticate_http_readonly="true"
--authenticate_http_readwrite="false" --authenticatee="crammd5" --authentication_backoff_factor="1secs"
--authorizer="local" --cgroups_cpu_enable_pids_and_tids_count="false" --cgroups_enable_cfs="false"
--cgroups_hierarchy="/sys/fs/cgroup" --cgroups_limit_swap="false" --cgroups_root="mesos" --container_disk_watch_interval="15secs"
--containerizers="mesos" --credential="/tmp/Endpoint_SlaveEndpointTest_NoAuthorizer_2_fehqoG/credential"
--default_role="*" --disallow_sharing_agent_pid_namespace="false" --disk_watch_interval="1mins"
--docker="docker" --docker_kill_orphans="true" --docker_registry="https://registry-1.docker.io"
--docker_remove_delay="6hrs" --docker_socket="/var/run/docker.sock" --docker_stop_timeout="0ns"
--docker_store_dir="/tmp/Endpoint_SlaveEndpointTest_NoAuthorizer_2_fehqoG/store/docker" --docker_volume_checkpoint_dir="/var/run/mesos/isolators/docker/volume"
--enforce_container_disk_quota="false" --executor_registration_timeout="1mins" --executor_reregistration_timeout="2secs"
--executor_shutdown_grace_period="5secs" --fetcher_cache_dir="/tmp/Endpoint_SlaveEndpointTest_NoAuthorizer_2_fehqoG/fetch"
--fetcher_cache_size="2GB" --frameworks_home="" --gc_delay="1weeks" --gc_disk_headroom="0.1"
--hadoop_home="" --help="false" --hostname_lookup="true" --http_command_executor="false" --http_credentials="/tmp/Endpoint_SlaveEndpointTest_NoAuthorizer_2_fehqoG/http_credentials"
--http_heartbeat_interval="30secs" --initialize_driver_logging="true" --isolation="posix/cpu,posix/mem"
--launcher="posix" --launcher_dir="/tmp/SRC/build/mesos-1.6.0/_build/sub/src" --logbufsecs="0"
--logging_level="INFO" --max_completed_executors_per_framework="150" --oversubscribed_resources_interval="15secs"
--perf_duration="10secs" --perf_interval="1mins" --port="5051" --qos_correction_interval_min="0ns"
--quiet="false" --reconfiguration_policy="equal" --recover="reconnect" --recovery_timeout="15mins"
--registration_backoff_factor="10ms" --resources="cpus:2;gpus:0;mem:1024;disk:1024;ports:[31000-32000]"
--revocable_cpu_low_priority="true" --runtime_dir="/tmp/Endpoint_SlaveEndpointTest_NoAuthorizer_2_fehqoG"
--sandbox_directory="/mnt/mesos/sandbox" --strict="true" --switch_user="true" --systemd_enable_support="true"
--systemd_runtime_directory="/run/systemd/system" --version="false" --work_dir="/tmp/Endpoint_SlaveEndpointTest_NoAuthorizer_2_cnzgJa"
--zk_session_timeout="10secs"
I0216 19:55:12.872884 32490 credentials.hpp:86] Loading credential for authentication from
'/tmp/Endpoint_SlaveEndpointTest_NoAuthorizer_2_fehqoG/credential'
I0216 19:55:12.873162 32490 slave.cpp:295] Agent using credential for: test-principal
I0216 19:55:12.873193 32490 credentials.hpp:37] Loading credentials for authentication from
'/tmp/Endpoint_SlaveEndpointTest_NoAuthorizer_2_fehqoG/http_credentials'
I0216 19:55:12.873512 32490 http.cpp:1045] Creating default 'basic' HTTP authenticator for
realm 'mesos-agent-readonly'
I0216 19:55:12.876915 32490 slave.cpp:612] Agent resources: [{"name":"cpus","scalar":{"value":2.0},"type":"SCALAR"},{"name":"mem","scalar":{"value":1024.0},"type":"SCALAR"},{"name":"disk","scalar":{"value":1024.0},"type":"SCALAR"},{"name":"ports","ranges":{"range":[{"begin":31000,"end":32000}]},"type":"RANGES"}]
I0216 19:55:12.877259 32490 slave.cpp:620] Agent attributes: [  ]
I0216 19:55:12.877282 32490 slave.cpp:629] Agent hostname: 2a6ad27a7fef
I0216 19:55:12.877640 32489 task_status_update_manager.cpp:181] Pausing sending task status
updates
I0216 19:55:12.880918 32478 state.cpp:66] Recovering state from '/tmp/Endpoint_SlaveEndpointTest_NoAuthorizer_2_cnzgJa/meta'
I0216 19:55:12.897676 32490 task_status_update_manager.cpp:207] Recovering task status update
manager
I0216 19:55:12.897990 32490 containerizer.cpp:674] Recovering containerizer
I0216 19:55:12.900652 32476 provisioner.cpp:495] Provisioner recovery complete
I0216 19:55:12.901489 32476 slave.cpp:7232] Finished recovery
I0216 19:55:12.909253 32484 process.cpp:3564] Handling HTTP event for process 'slave(1000)'
with path: '/slave(1000)/containers'
I0216 19:55:12.912616 32484 http.cpp:1185] HTTP GET for /slave(1000)/containers from 172.17.0.3:53700
I0216 19:55:12.913471 32484 http.cpp:976] Authorizing principal 'test-principal' to GET the
'/containers' endpoint
I0216 19:55:12.930725 32475 slave.cpp:922] Agent terminating
[       OK ] Endpoint/SlaveEndpointTest.NoAuthorizer/2 (176 ms)
[----------] 9 tests from Endpoint/SlaveEndpointTest (1543 ms total)

[----------] 2 tests from ContainerizerType/DefaultContainerDNSFlagTest
[ RUN      ] ContainerizerType/DefaultContainerDNSFlagTest.ValidateFlag/0
[       OK ] ContainerizerType/DefaultContainerDNSFlagTest.ValidateFlag/0 (14 ms)
[ RUN      ] ContainerizerType/DefaultContainerDNSFlagTest.ValidateFlag/1
[       OK ] ContainerizerType/DefaultContainerDNSFlagTest.ValidateFlag/1 (15 ms)
[----------] 2 tests from ContainerizerType/DefaultContainerDNSFlagTest (29 ms total)

[----------] Global test environment tear-down
[==========] 1916 tests from 192 test cases ran. (933956 ms total)
[  PASSED  ] 1915 tests.
[  FAILED  ] 1 test, listed below:
[  FAILED  ] DiskQuotaTest.SlaveRecovery

 1 FAILED TEST
  YOU HAVE 23 DISABLED TESTS

I0216 19:55:13.168864 32492 process.cpp:929] Stopped the socket accept loop
Makefile:14663: recipe for target 'check-local' failed
make[4]: *** [check-local] Error 1
make[4]: Leaving directory '/tmp/SRC/build/mesos-1.6.0/_build/sub/src'
Makefile:13796: recipe for target 'check-am' failed
make[3]: *** [check-am] Error 2
make[3]: Leaving directory '/tmp/SRC/build/mesos-1.6.0/_build/sub/src'
Makefile:13800: recipe for target 'check' failed
make[2]: *** [check] Error 2
make[2]: Leaving directory '/tmp/SRC/build/mesos-1.6.0/_build/sub/src'
Makefile:774: recipe for target 'check-recursive' failed
make[1]: *** [check-recursive] Error 1
make[1]: Leaving directory '/tmp/SRC/build/mesos-1.6.0/_build/sub'
Makefile:980: recipe for target 'distcheck' failed
make: *** [distcheck] Error 1
Untagged: mesos/mesos-build:ubuntu-16.04
Untagged: mesos/mesos-build@sha256:3643a2cc107ff04ee2d7628a48cff8bee6186b98bcaa5ce36f685d28d8b04dae
Deleted: sha256:df13eb8a4c4b15c8e09329265603b7fcacc7753bc731057e91c06554acab5a10
Deleted: sha256:f50f81f71ec4d5b88ef535ef34e07a1abfe00cec71bd4518a0bee2348c0c6229
Deleted: sha256:334c2f430d63071d6f077369f301016b59d5421b28a6df435c63aa2209f480e7
Deleted: sha256:7a41f53b59bb61bde6d3dc9a41c4dd87e6ff5141b36da06529c2cb32e6733d63
Deleted: sha256:4b569c802f795bb918a504e6ce315cddecfb633aee338ee535e7cfbe5c2801a3
Error response from daemon: conflict: unable to delete 2b97bb4ea8a1 (cannot be forced) - image
is being used by running container 27e57929846a
Build step 'Execute shell' marked build as failure


Mime
View raw message