mesos-builds mailing list archives

Site index · List index
Message view « Date » · « Thread »
Top « Date » · « Thread »
From Apache Jenkins Server <jenk...@builds.apache.org>
Subject Build failed in Jenkins: Mesos-Reviewbot #21684
Date Mon, 19 Feb 2018 05:10:00 GMT
See <https://builds.apache.org/job/Mesos-Reviewbot/21684/display/redirect>

------------------------------------------
[...truncated 36.74 MB...]
I0219 05:09:53.595471   718 process.cpp:3564] Handling HTTP event for process 'slave(992)'
with path: '/slave(992)/monitor/statistics'
I0219 05:09:53.598095   713 http.cpp:1185] HTTP GET for /slave(992)/monitor/statistics from
172.17.0.2:53492
I0219 05:09:53.598225   713 http.cpp:976] Authorizing principal 'test-principal' to GET the
'/monitor/statistics' endpoint
I0219 05:09:53.602406   718 slave.cpp:922] Agent terminating
[       OK ] Endpoint/SlaveEndpointTest.AuthorizedRequest/0 (54 ms)
[ RUN      ] Endpoint/SlaveEndpointTest.AuthorizedRequest/1
I0219 05:09:53.624517   709 containerizer.cpp:304] Using isolation { environment_secret, posix/cpu,
posix/mem, filesystem/posix, network/cni }
W0219 05:09:53.625336   709 backend.cpp:76] Failed to create 'aufs' backend: AufsBackend requires
root privileges
W0219 05:09:53.625376   709 backend.cpp:76] Failed to create 'bind' backend: BindBackend requires
root privileges
I0219 05:09:53.625421   709 provisioner.cpp:299] Using default backend 'copy'
I0219 05:09:53.631611   722 slave.cpp:262] Mesos agent started on (993)@172.17.0.2:35241
I0219 05:09:53.631654   722 slave.cpp:263] Flags at startup: --acls="" --appc_simple_discovery_uri_prefix="http://"
--appc_store_dir="/tmp/Endpoint_SlaveEndpointTest_AuthorizedRequest_1_GxpmX4/store/appc" --authenticate_http_readonly="true"
--authenticate_http_readwrite="false" --authenticatee="crammd5" --authentication_backoff_factor="1secs"
--authorizer="local" --cgroups_cpu_enable_pids_and_tids_count="false" --cgroups_enable_cfs="false"
--cgroups_hierarchy="/sys/fs/cgroup" --cgroups_limit_swap="false" --cgroups_root="mesos" --container_disk_watch_interval="15secs"
--containerizers="mesos" --credential="/tmp/Endpoint_SlaveEndpointTest_AuthorizedRequest_1_GxpmX4/credential"
--default_role="*" --disallow_sharing_agent_pid_namespace="false" --disk_watch_interval="1mins"
--docker="docker" --docker_kill_orphans="true" --docker_registry="https://registry-1.docker.io"
--docker_remove_delay="6hrs" --docker_socket="/var/run/docker.sock" --docker_stop_timeout="0ns"
--docker_store_dir="/tmp/Endpoint_SlaveEndpointTest_AuthorizedRequest_1_GxpmX4/store/docker"
--docker_volume_checkpoint_dir="/var/run/mesos/isolators/docker/volume" --enforce_container_disk_quota="false"
--executor_registration_timeout="1mins" --executor_reregistration_timeout="2secs" --executor_shutdown_grace_period="5secs"
--fetcher_cache_dir="/tmp/Endpoint_SlaveEndpointTest_AuthorizedRequest_1_GxpmX4/fetch" --fetcher_cache_size="2GB"
--frameworks_home="" --gc_delay="1weeks" --gc_disk_headroom="0.1" --hadoop_home="" --help="false"
--hostname_lookup="true" --http_command_executor="false" --http_credentials="/tmp/Endpoint_SlaveEndpointTest_AuthorizedRequest_1_GxpmX4/http_credentials"
--http_heartbeat_interval="30secs" --initialize_driver_logging="true" --isolation="posix/cpu,posix/mem"
--launcher="posix" --launcher_dir="/tmp/SRC/build/mesos-1.6.0/_build/sub/src" --logbufsecs="0"
--logging_level="INFO" --max_completed_executors_per_framework="150" --oversubscribed_resources_interval="15secs"
--perf_duration="10secs" --perf_interval="1mins" --port="5051" --qos_correction_interval_min="0ns"
--quiet="false" --reconfiguration_policy="equal" --recover="reconnect" --recovery_timeout="15mins"
--registration_backoff_factor="10ms" --resources="cpus:2;gpus:0;mem:1024;disk:1024;ports:[31000-32000]"
--revocable_cpu_low_priority="true" --runtime_dir="/tmp/Endpoint_SlaveEndpointTest_AuthorizedRequest_1_GxpmX4"
--sandbox_directory="/mnt/mesos/sandbox" --strict="true" --switch_user="true" --systemd_enable_support="true"
--systemd_runtime_directory="/run/systemd/system" --version="false" --work_dir="/tmp/Endpoint_SlaveEndpointTest_AuthorizedRequest_1_piSTG3"
--zk_session_timeout="10secs"
I0219 05:09:53.632194   722 credentials.hpp:86] Loading credential for authentication from
'/tmp/Endpoint_SlaveEndpointTest_AuthorizedRequest_1_GxpmX4/credential'
I0219 05:09:53.632431   722 slave.cpp:295] Agent using credential for: test-principal
I0219 05:09:53.632467   722 credentials.hpp:37] Loading credentials for authentication from
'/tmp/Endpoint_SlaveEndpointTest_AuthorizedRequest_1_GxpmX4/http_credentials'
I0219 05:09:53.632799   722 http.cpp:1045] Creating default 'basic' HTTP authenticator for
realm 'mesos-agent-readonly'
I0219 05:09:53.635871   722 slave.cpp:612] Agent resources: [{"name":"cpus","scalar":{"value":2.0},"type":"SCALAR"},{"name":"mem","scalar":{"value":1024.0},"type":"SCALAR"},{"name":"disk","scalar":{"value":1024.0},"type":"SCALAR"},{"name":"ports","ranges":{"range":[{"begin":31000,"end":32000}]},"type":"RANGES"}]
I0219 05:09:53.636262   722 slave.cpp:620] Agent attributes: [  ]
I0219 05:09:53.636291   722 slave.cpp:629] Agent hostname: 1916def4401a
I0219 05:09:53.636548   730 task_status_update_manager.cpp:181] Pausing sending task status
updates
I0219 05:09:53.638988   715 state.cpp:66] Recovering state from '/tmp/Endpoint_SlaveEndpointTest_AuthorizedRequest_1_piSTG3/meta'
I0219 05:09:53.639489   719 task_status_update_manager.cpp:207] Recovering task status update
manager
I0219 05:09:53.639809   711 containerizer.cpp:674] Recovering containerizer
I0219 05:09:53.642361   714 provisioner.cpp:495] Provisioner recovery complete
I0219 05:09:53.642987   723 slave.cpp:7232] Finished recovery
I0219 05:09:53.648191   713 process.cpp:3564] Handling HTTP event for process 'slave(993)'
with path: '/slave(993)/monitor/statistics.json'
I0219 05:09:53.650796   726 http.cpp:1185] HTTP GET for /slave(993)/monitor/statistics.json
from 172.17.0.2:53496
I0219 05:09:53.650928   726 http.cpp:976] Authorizing principal 'test-principal' to GET the
'/monitor/statistics.json' endpoint
I0219 05:09:53.655364   717 slave.cpp:922] Agent terminating
[       OK ] Endpoint/SlaveEndpointTest.AuthorizedRequest/1 (51 ms)
[ RUN      ] Endpoint/SlaveEndpointTest.AuthorizedRequest/2
I0219 05:09:53.677040   709 containerizer.cpp:304] Using isolation { environment_secret, posix/cpu,
posix/mem, filesystem/posix, network/cni }
W0219 05:09:53.677881   709 backend.cpp:76] Failed to create 'aufs' backend: AufsBackend requires
root privileges
W0219 05:09:53.677922   709 backend.cpp:76] Failed to create 'bind' backend: BindBackend requires
root privileges
I0219 05:09:53.677966   709 provisioner.cpp:299] Using default backend 'copy'
I0219 05:09:53.685724   717 slave.cpp:262] Mesos agent started on (994)@172.17.0.2:35241
I0219 05:09:53.685765   717 slave.cpp:263] Flags at startup: --acls="" --appc_simple_discovery_uri_prefix="http://"
--appc_store_dir="/tmp/Endpoint_SlaveEndpointTest_AuthorizedRequest_2_54ghqa/store/appc" --authenticate_http_readonly="true"
--authenticate_http_readwrite="false" --authenticatee="crammd5" --authentication_backoff_factor="1secs"
--authorizer="local" --cgroups_cpu_enable_pids_and_tids_count="false" --cgroups_enable_cfs="false"
--cgroups_hierarchy="/sys/fs/cgroup" --cgroups_limit_swap="false" --cgroups_root="mesos" --container_disk_watch_interval="15secs"
--containerizers="mesos" --credential="/tmp/Endpoint_SlaveEndpointTest_AuthorizedRequest_2_54ghqa/credential"
--default_role="*" --disallow_sharing_agent_pid_namespace="false" --disk_watch_interval="1mins"
--docker="docker" --docker_kill_orphans="true" --docker_registry="https://registry-1.docker.io"
--docker_remove_delay="6hrs" --docker_socket="/var/run/docker.sock" --docker_stop_timeout="0ns"
--docker_store_dir="/tmp/Endpoint_SlaveEndpointTest_AuthorizedRequest_2_54ghqa/store/docker"
--docker_volume_checkpoint_dir="/var/run/mesos/isolators/docker/volume" --enforce_container_disk_quota="false"
--executor_registration_timeout="1mins" --executor_reregistration_timeout="2secs" --executor_shutdown_grace_period="5secs"
--fetcher_cache_dir="/tmp/Endpoint_SlaveEndpointTest_AuthorizedRequest_2_54ghqa/fetch" --fetcher_cache_size="2GB"
--frameworks_home="" --gc_delay="1weeks" --gc_disk_headroom="0.1" --hadoop_home="" --help="false"
--hostname_lookup="true" --http_command_executor="false" --http_credentials="/tmp/Endpoint_SlaveEndpointTest_AuthorizedRequest_2_54ghqa/http_credentials"
--http_heartbeat_interval="30secs" --initialize_driver_logging="true" --isolation="posix/cpu,posix/mem"
--launcher="posix" --launcher_dir="/tmp/SRC/build/mesos-1.6.0/_build/sub/src" --logbufsecs="0"
--logging_level="INFO" --max_completed_executors_per_framework="150" --oversubscribed_resources_interval="15secs"
--perf_duration="10secs" --perf_interval="1mins" --port="5051" --qos_correction_interval_min="0ns"
--quiet="false" --reconfiguration_policy="equal" --recover="reconnect" --recovery_timeout="15mins"
--registration_backoff_factor="10ms" --resources="cpus:2;gpus:0;mem:1024;disk:1024;ports:[31000-32000]"
--revocable_cpu_low_priority="true" --runtime_dir="/tmp/Endpoint_SlaveEndpointTest_AuthorizedRequest_2_54ghqa"
--sandbox_directory="/mnt/mesos/sandbox" --strict="true" --switch_user="true" --systemd_enable_support="true"
--systemd_runtime_directory="/run/systemd/system" --version="false" --work_dir="/tmp/Endpoint_SlaveEndpointTest_AuthorizedRequest_2_4KWn28"
--zk_session_timeout="10secs"
I0219 05:09:53.686338   717 credentials.hpp:86] Loading credential for authentication from
'/tmp/Endpoint_SlaveEndpointTest_AuthorizedRequest_2_54ghqa/credential'
I0219 05:09:53.686589   717 slave.cpp:295] Agent using credential for: test-principal
I0219 05:09:53.686625   717 credentials.hpp:37] Loading credentials for authentication from
'/tmp/Endpoint_SlaveEndpointTest_AuthorizedRequest_2_54ghqa/http_credentials'
I0219 05:09:53.686965   717 http.cpp:1045] Creating default 'basic' HTTP authenticator for
realm 'mesos-agent-readonly'
I0219 05:09:53.689471   717 slave.cpp:612] Agent resources: [{"name":"cpus","scalar":{"value":2.0},"type":"SCALAR"},{"name":"mem","scalar":{"value":1024.0},"type":"SCALAR"},{"name":"disk","scalar":{"value":1024.0},"type":"SCALAR"},{"name":"ports","ranges":{"range":[{"begin":31000,"end":32000}]},"type":"RANGES"}]
I0219 05:09:53.689769   717 slave.cpp:620] Agent attributes: [  ]
I0219 05:09:53.689790   717 slave.cpp:629] Agent hostname: 1916def4401a
I0219 05:09:53.690002   730 task_status_update_manager.cpp:181] Pausing sending task status
updates
I0219 05:09:53.692152   729 state.cpp:66] Recovering state from '/tmp/Endpoint_SlaveEndpointTest_AuthorizedRequest_2_4KWn28/meta'
I0219 05:09:53.692598   723 task_status_update_manager.cpp:207] Recovering task status update
manager
I0219 05:09:53.692922   727 containerizer.cpp:674] Recovering containerizer
I0219 05:09:53.694957   733 provisioner.cpp:495] Provisioner recovery complete
I0219 05:09:53.695461   730 slave.cpp:7232] Finished recovery
I0219 05:09:53.699690   716 process.cpp:3564] Handling HTTP event for process 'slave(994)'
with path: '/slave(994)/containers'
I0219 05:09:53.702167   711 http.cpp:1185] HTTP GET for /slave(994)/containers from 172.17.0.2:53498
I0219 05:09:53.702316   711 http.cpp:976] Authorizing principal 'test-principal' to GET the
'/containers' endpoint
I0219 05:09:53.708147   733 slave.cpp:922] Agent terminating
[       OK ] Endpoint/SlaveEndpointTest.AuthorizedRequest/2 (50 ms)
[ RUN      ] Endpoint/SlaveEndpointTest.UnauthorizedRequest/0
I0219 05:09:53.727028   709 containerizer.cpp:304] Using isolation { environment_secret, posix/cpu,
posix/mem, filesystem/posix, network/cni }
W0219 05:09:53.727871   709 backend.cpp:76] Failed to create 'aufs' backend: AufsBackend requires
root privileges
W0219 05:09:53.727910   709 backend.cpp:76] Failed to create 'bind' backend: BindBackend requires
root privileges
I0219 05:09:53.727955   709 provisioner.cpp:299] Using default backend 'copy'
I0219 05:09:53.735138   720 slave.cpp:262] Mesos agent started on (995)@172.17.0.2:35241
I0219 05:09:53.735180   720 slave.cpp:263] Flags at startup: --acls="" --appc_simple_discovery_uri_prefix="http://"
--appc_store_dir="/tmp/Endpoint_SlaveEndpointTest_UnauthorizedRequest_0_Pbv7lg/store/appc"
--authenticate_http_readonly="true" --authenticate_http_readwrite="false" --authenticatee="crammd5"
--authentication_backoff_factor="1secs" --authorizer="local" --cgroups_cpu_enable_pids_and_tids_count="false"
--cgroups_enable_cfs="false" --cgroups_hierarchy="/sys/fs/cgroup" --cgroups_limit_swap="false"
--cgroups_root="mesos" --container_disk_watch_interval="15secs" --containerizers="mesos" --credential="/tmp/Endpoint_SlaveEndpointTest_UnauthorizedRequest_0_Pbv7lg/credential"
--default_role="*" --disallow_sharing_agent_pid_namespace="false" --disk_watch_interval="1mins"
--docker="docker" --docker_kill_orphans="true" --docker_registry="https://registry-1.docker.io"
--docker_remove_delay="6hrs" --docker_socket="/var/run/docker.sock" --docker_stop_timeout="0ns"
--docker_store_dir="/tmp/Endpoint_SlaveEndpointTest_UnauthorizedRequest_0_Pbv7lg/store/docker"
--docker_volume_checkpoint_dir="/var/run/mesos/isolators/docker/volume" --enforce_container_disk_quota="false"
--executor_registration_timeout="1mins" --executor_reregistration_timeout="2secs" --executor_shutdown_grace_period="5secs"
--fetcher_cache_dir="/tmp/Endpoint_SlaveEndpointTest_UnauthorizedRequest_0_Pbv7lg/fetch" --fetcher_cache_size="2GB"
--frameworks_home="" --gc_delay="1weeks" --gc_disk_headroom="0.1" --hadoop_home="" --help="false"
--hostname_lookup="true" --http_command_executor="false" --http_credentials="/tmp/Endpoint_SlaveEndpointTest_UnauthorizedRequest_0_Pbv7lg/http_credentials"
--http_heartbeat_interval="30secs" --initialize_driver_logging="true" --isolation="posix/cpu,posix/mem"
--launcher="posix" --launcher_dir="/tmp/SRC/build/mesos-1.6.0/_build/sub/src" --logbufsecs="0"
--logging_level="INFO" --max_completed_executors_per_framework="150" --oversubscribed_resources_interval="15secs"
--perf_duration="10secs" --perf_interval="1mins" --port="5051" --qos_correction_interval_min="0ns"
--quiet="false" --reconfiguration_policy="equal" --recover="reconnect" --recovery_timeout="15mins"
--registration_backoff_factor="10ms" --resources="cpus:2;gpus:0;mem:1024;disk:1024;ports:[31000-32000]"
--revocable_cpu_low_priority="true" --runtime_dir="/tmp/Endpoint_SlaveEndpointTest_UnauthorizedRequest_0_Pbv7lg"
--sandbox_directory="/mnt/mesos/sandbox" --strict="true" --switch_user="true" --systemd_enable_support="true"
--systemd_runtime_directory="/run/systemd/system" --version="false" --work_dir="/tmp/Endpoint_SlaveEndpointTest_UnauthorizedRequest_0_ks64Qe"
--zk_session_timeout="10secs"
I0219 05:09:53.735844   720 credentials.hpp:86] Loading credential for authentication from
'/tmp/Endpoint_SlaveEndpointTest_UnauthorizedRequest_0_Pbv7lg/credential'
I0219 05:09:53.736132   720 slave.cpp:295] Agent using credential for: test-principal
I0219 05:09:53.736172   720 credentials.hpp:37] Loading credentials for authentication from
'/tmp/Endpoint_SlaveEndpointTest_UnauthorizedRequest_0_Pbv7lg/http_credentials'
I0219 05:09:53.736536   720 http.cpp:1045] Creating default 'basic' HTTP authenticator for
realm 'mesos-agent-readonly'
I0219 05:09:53.739377   720 slave.cpp:612] Agent resources: [{"name":"cpus","scalar":{"value":2.0},"type":"SCALAR"},{"name":"mem","scalar":{"value":1024.0},"type":"SCALAR"},{"name":"disk","scalar":{"value":1024.0},"type":"SCALAR"},{"name":"ports","ranges":{"range":[{"begin":31000,"end":32000}]},"type":"RANGES"}]
I0219 05:09:53.739763   720 slave.cpp:620] Agent attributes: [  ]
I0219 05:09:53.739789   720 slave.cpp:629] Agent hostname: 1916def4401a
I0219 05:09:53.740027   733 task_status_update_manager.cpp:181] Pausing sending task status
updates
I0219 05:09:53.742624   722 state.cpp:66] Recovering state from '/tmp/Endpoint_SlaveEndpointTest_UnauthorizedRequest_0_ks64Qe/meta'
I0219 05:09:53.743150   731 task_status_update_manager.cpp:207] Recovering task status update
manager
I0219 05:09:53.743512   724 containerizer.cpp:674] Recovering containerizer
I0219 05:09:53.746098   728 provisioner.cpp:495] Provisioner recovery complete
I0219 05:09:53.746795   713 slave.cpp:7232] Finished recovery
I0219 05:09:53.752116   732 process.cpp:3564] Handling HTTP event for process 'slave(995)'
with path: '/slave(995)/monitor/statistics'
I0219 05:09:53.754745   714 http.cpp:1185] HTTP GET for /slave(995)/monitor/statistics from
172.17.0.2:53502
I0219 05:09:53.754876   714 http.cpp:976] Authorizing principal 'test-principal' to GET the
'/monitor/statistics' endpoint
I0219 05:09:53.757622   722 slave.cpp:922] Agent terminating
[       OK ] Endpoint/SlaveEndpointTest.UnauthorizedRequest/0 (50 ms)
[ RUN      ] Endpoint/SlaveEndpointTest.UnauthorizedRequest/1
I0219 05:09:53.779320   709 containerizer.cpp:304] Using isolation { environment_secret, posix/cpu,
posix/mem, filesystem/posix, network/cni }
W0219 05:09:53.780167   709 backend.cpp:76] Failed to create 'aufs' backend: AufsBackend requires
root privileges
W0219 05:09:53.780210   709 backend.cpp:76] Failed to create 'bind' backend: BindBackend requires
root privileges
I0219 05:09:53.780254   709 provisioner.cpp:299] Using default backend 'copy'
I0219 05:09:53.788440   713 slave.cpp:262] Mesos agent started on (996)@172.17.0.2:35241
I0219 05:09:53.788492   713 slave.cpp:263] Flags at startup: --acls="" --appc_simple_discovery_uri_prefix="http://"
--appc_store_dir="/tmp/Endpoint_SlaveEndpointTest_UnauthorizedRequest_1_6XVlLm/store/appc"
--authenticate_http_readonly="true" --authenticate_http_readwrite="false" --authenticatee="crammd5"
--authentication_backoff_factor="1secs" --authorizer="local" --cgroups_cpu_enable_pids_and_tids_count="false"
--cgroups_enable_cfs="false" --cgroups_hierarchy="/sys/fs/cgroup" --cgroups_limit_swap="false"
--cgroups_root="mesos" --container_disk_watch_interval="15secs" --containerizers="mesos" --credential="/tmp/Endpoint_SlaveEndpointTest_UnauthorizedRequest_1_6XVlLm/credential"
--default_role="*" --disallow_sharing_agent_pid_namespace="false" --disk_watch_interval="1mins"
--docker="docker" --docker_kill_orphans="true" --docker_registry="https://registry-1.docker.io"
--docker_remove_delay="6hrs" --docker_socket="/var/run/docker.sock" --docker_stop_timeout="0ns"
--docker_store_dir="/tmp/Endpoint_SlaveEndpointTest_UnauthorizedRequest_1_6XVlLm/store/docker"
--docker_volume_checkpoint_dir="/var/run/mesos/isolators/docker/volume" --enforce_container_disk_quota="false"
--executor_registration_timeout="1mins" --executor_reregistration_timeout="2secs" --executor_shutdown_grace_period="5secs"
--fetcher_cache_dir="/tmp/Endpoint_SlaveEndpointTest_UnauthorizedRequest_1_6XVlLm/fetch" --fetcher_cache_size="2GB"
--frameworks_home="" --gc_delay="1weeks" --gc_disk_headroom="0.1" --hadoop_home="" --help="false"
--hostname_lookup="true" --http_command_executor="false" --http_credentials="/tmp/Endpoint_SlaveEndpointTest_UnauthorizedRequest_1_6XVlLm/http_credentials"
--http_heartbeat_interval="30secs" --initialize_driver_logging="true" --isolation="posix/cpu,posix/mem"
--launcher="posix" --launcher_dir="/tmp/SRC/build/mesos-1.6.0/_build/sub/src" --logbufsecs="0"
--logging_level="INFO" --max_completed_executors_per_framework="150" --oversubscribed_resources_interval="15secs"
--perf_duration="10secs" --perf_interval="1mins" --port="5051" --qos_correction_interval_min="0ns"
--quiet="false" --reconfiguration_policy="equal" --recover="reconnect" --recovery_timeout="15mins"
--registration_backoff_factor="10ms" --resources="cpus:2;gpus:0;mem:1024;disk:1024;ports:[31000-32000]"
--revocable_cpu_low_priority="true" --runtime_dir="/tmp/Endpoint_SlaveEndpointTest_UnauthorizedRequest_1_6XVlLm"
--sandbox_directory="/mnt/mesos/sandbox" --strict="true" --switch_user="true" --systemd_enable_support="true"
--systemd_runtime_directory="/run/systemd/system" --version="false" --work_dir="/tmp/Endpoint_SlaveEndpointTest_UnauthorizedRequest_1_e6FV8k"
--zk_session_timeout="10secs"
I0219 05:09:53.789283   713 credentials.hpp:86] Loading credential for authentication from
'/tmp/Endpoint_SlaveEndpointTest_UnauthorizedRequest_1_6XVlLm/credential'
I0219 05:09:53.789628   713 slave.cpp:295] Agent using credential for: test-principal
I0219 05:09:53.789674   713 credentials.hpp:37] Loading credentials for authentication from
'/tmp/Endpoint_SlaveEndpointTest_UnauthorizedRequest_1_6XVlLm/http_credentials'
I0219 05:09:53.790083   713 http.cpp:1045] Creating default 'basic' HTTP authenticator for
realm 'mesos-agent-readonly'
I0219 05:09:53.793179   713 slave.cpp:612] Agent resources: [{"name":"cpus","scalar":{"value":2.0},"type":"SCALAR"},{"name":"mem","scalar":{"value":1024.0},"type":"SCALAR"},{"name":"disk","scalar":{"value":1024.0},"type":"SCALAR"},{"name":"ports","ranges":{"range":[{"begin":31000,"end":32000}]},"type":"RANGES"}]
I0219 05:09:53.793545   713 slave.cpp:620] Agent attributes: [  ]
I0219 05:09:53.793567   713 slave.cpp:629] Agent hostname: 1916def4401a
I0219 05:09:53.793799   730 task_status_update_manager.cpp:181] Pausing sending task status
updates
I0219 05:09:53.796398   732 state.cpp:66] Recovering state from '/tmp/Endpoint_SlaveEndpointTest_UnauthorizedRequest_1_e6FV8k/meta'
I0219 05:09:53.796969   725 task_status_update_manager.cpp:207] Recovering task status update
manager
I0219 05:09:53.797386   717 containerizer.cpp:674] Recovering containerizer
I0219 05:09:53.800321   733 provisioner.cpp:495] Provisioner recovery complete
I0219 05:09:53.801056   727 slave.cpp:7232] Finished recovery
I0219 05:09:53.806563   728 process.cpp:3564] Handling HTTP event for process 'slave(996)'
with path: '/slave(996)/monitor/statistics.json'
I0219 05:09:53.809326   711 http.cpp:1185] HTTP GET for /slave(996)/monitor/statistics.json
from 172.17.0.2:53504
I0219 05:09:53.809468   711 http.cpp:976] Authorizing principal 'test-principal' to GET the
'/monitor/statistics.json' endpoint
I0219 05:09:53.812229   712 slave.cpp:922] Agent terminating
[       OK ] Endpoint/SlaveEndpointTest.UnauthorizedRequest/1 (53 ms)
[ RUN      ] Endpoint/SlaveEndpointTest.UnauthorizedRequest/2
I0219 05:09:53.832598   709 containerizer.cpp:304] Using isolation { environment_secret, posix/cpu,
posix/mem, filesystem/posix, network/cni }
W0219 05:09:53.833395   709 backend.cpp:76] Failed to create 'aufs' backend: AufsBackend requires
root privileges
W0219 05:09:53.833433   709 backend.cpp:76] Failed to create 'bind' backend: BindBackend requires
root privileges
I0219 05:09:53.833473   709 provisioner.cpp:299] Using default backend 'copy'
I0219 05:09:53.839287   731 slave.cpp:262] Mesos agent started on (997)@172.17.0.2:35241
I0219 05:09:53.839329   731 slave.cpp:263] Flags at startup: --acls="" --appc_simple_discovery_uri_prefix="http://"
--appc_store_dir="/tmp/Endpoint_SlaveEndpointTest_UnauthorizedRequest_2_UwKdFt/store/appc"
--authenticate_http_readonly="true" --authenticate_http_readwrite="false" --authenticatee="crammd5"
--authentication_backoff_factor="1secs" --authorizer="local" --cgroups_cpu_enable_pids_and_tids_count="false"
--cgroups_enable_cfs="false" --cgroups_hierarchy="/sys/fs/cgroup" --cgroups_limit_swap="false"
--cgroups_root="mesos" --container_disk_watch_interval="15secs" --containerizers="mesos" --credential="/tmp/Endpoint_SlaveEndpointTest_UnauthorizedRequest_2_UwKdFt/credential"
--default_role="*" --disallow_sharing_agent_pid_namespace="false" --disk_watch_interval="1mins"
--docker="docker" --docker_kill_orphans="true" --docker_registry="https://registry-1.docker.io"
--docker_remove_delay="6hrs" --docker_socket="/var/run/docker.sock" --docker_stop_timeout="0ns"
--docker_store_dir="/tmp/Endpoint_SlaveEndpointTest_UnauthorizedRequest_2_UwKdFt/store/docker"
--docker_volume_checkpoint_dir="/var/run/mesos/isolators/docker/volume" --enforce_container_disk_quota="false"
--executor_registration_timeout="1mins" --executor_reregistration_timeout="2secs" --executor_shutdown_grace_period="5secs"
--fetcher_cache_dir="/tmp/Endpoint_SlaveEndpointTest_UnauthorizedRequest_2_UwKdFt/fetch" --fetcher_cache_size="2GB"
--frameworks_home="" --gc_delay="1weeks" --gc_disk_headroom="0.1" --hadoop_home="" --help="false"
--hostname_lookup="true" --http_command_executor="false" --http_credentials="/tmp/Endpoint_SlaveEndpointTest_UnauthorizedRequest_2_UwKdFt/http_credentials"
--http_heartbeat_interval="30secs" --initialize_driver_logging="true" --isolation="posix/cpu,posix/mem"
--launcher="posix" --launcher_dir="/tmp/SRC/build/mesos-1.6.0/_build/sub/src" --logbufsecs="0"
--logging_level="INFO" --max_completed_executors_per_framework="150" --oversubscribed_resources_interval="15secs"
--perf_duration="10secs" --perf_interval="1mins" --port="5051" --qos_correction_interval_min="0ns"
--quiet="false" --reconfiguration_policy="equal" --recover="reconnect" --recovery_timeout="15mins"
--registration_backoff_factor="10ms" --resources="cpus:2;gpus:0;mem:1024;disk:1024;ports:[31000-32000]"
--revocable_cpu_low_priority="true" --runtime_dir="/tmp/Endpoint_SlaveEndpointTest_UnauthorizedRequest_2_UwKdFt"
--sandbox_directory="/mnt/mesos/sandbox" --strict="true" --switch_user="true" --systemd_enable_support="true"
--systemd_runtime_directory="/run/systemd/system" --version="false" --work_dir="/tmp/Endpoint_SlaveEndpointTest_UnauthorizedRequest_2_pY3aVr"
--zk_session_timeout="10secs"
I0219 05:09:53.839947   731 credentials.hpp:86] Loading credential for authentication from
'/tmp/Endpoint_SlaveEndpointTest_UnauthorizedRequest_2_UwKdFt/credential'
I0219 05:09:53.840189   731 slave.cpp:295] Agent using credential for: test-principal
I0219 05:09:53.840227   731 credentials.hpp:37] Loading credentials for authentication from
'/tmp/Endpoint_SlaveEndpointTest_UnauthorizedRequest_2_UwKdFt/http_credentials'
I0219 05:09:53.840564   731 http.cpp:1045] Creating default 'basic' HTTP authenticator for
realm 'mesos-agent-readonly'
I0219 05:09:53.842957   731 slave.cpp:612] Agent resources: [{"name":"cpus","scalar":{"value":2.0},"type":"SCALAR"},{"name":"mem","scalar":{"value":1024.0},"type":"SCALAR"},{"name":"disk","scalar":{"value":1024.0},"type":"SCALAR"},{"name":"ports","ranges":{"range":[{"begin":31000,"end":32000}]},"type":"RANGES"}]
I0219 05:09:53.843261   731 slave.cpp:620] Agent attributes: [  ]
I0219 05:09:53.843292   731 slave.cpp:629] Agent hostname: 1916def4401a
I0219 05:09:53.843513   726 task_status_update_manager.cpp:181] Pausing sending task status
updates
I0219 05:09:53.846017   724 state.cpp:66] Recovering state from '/tmp/Endpoint_SlaveEndpointTest_UnauthorizedRequest_2_pY3aVr/meta'
I0219 05:09:53.846460   715 task_status_update_manager.cpp:207] Recovering task status update
manager
I0219 05:09:53.846791   730 containerizer.cpp:674] Recovering containerizer
I0219 05:09:53.848994   717 provisioner.cpp:495] Provisioner recovery complete
I0219 05:09:53.849462   712 slave.cpp:7232] Finished recovery
I0219 05:09:53.853704   732 process.cpp:3564] Handling HTTP event for process 'slave(997)'
with path: '/slave(997)/containers'
I0219 05:09:53.855839   722 http.cpp:1185] HTTP GET for /slave(997)/containers from 172.17.0.2:53508
I0219 05:09:53.855947   722 http.cpp:976] Authorizing principal 'test-principal' to GET the
'/containers' endpoint
I0219 05:09:53.858115   709 slave.cpp:922] Agent terminating
[       OK ] Endpoint/SlaveEndpointTest.UnauthorizedRequest/2 (42 ms)
[ RUN      ] Endpoint/SlaveEndpointTest.NoAuthorizer/0
I0219 05:09:53.882534   709 containerizer.cpp:304] Using isolation { environment_secret, posix/cpu,
posix/mem, filesystem/posix, network/cni }
W0219 05:09:53.883576   709 backend.cpp:76] Failed to create 'aufs' backend: AufsBackend requires
root privileges
W0219 05:09:53.883617   709 backend.cpp:76] Failed to create 'bind' backend: BindBackend requires
root privileges
I0219 05:09:53.883664   709 provisioner.cpp:299] Using default backend 'copy'
I0219 05:09:53.887362   709 cluster.cpp:460] Creating default 'local' authorizer
I0219 05:09:53.891469   710 slave.cpp:262] Mesos agent started on (998)@172.17.0.2:35241
I0219 05:09:53.891499   710 slave.cpp:263] Flags at startup: --acls="" --appc_simple_discovery_uri_prefix="http://"
--appc_store_dir="/tmp/Endpoint_SlaveEndpointTest_NoAuthorizer_0_yQbn0A/store/appc" --authenticate_http_readonly="true"
--authenticate_http_readwrite="false" --authenticatee="crammd5" --authentication_backoff_factor="1secs"
--authorizer="local" --cgroups_cpu_enable_pids_and_tids_count="false" --cgroups_enable_cfs="false"
--cgroups_hierarchy="/sys/fs/cgroup" --cgroups_limit_swap="false" --cgroups_root="mesos" --container_disk_watch_interval="15secs"
--containerizers="mesos" --credential="/tmp/Endpoint_SlaveEndpointTest_NoAuthorizer_0_yQbn0A/credential"
--default_role="*" --disallow_sharing_agent_pid_namespace="false" --disk_watch_interval="1mins"
--docker="docker" --docker_kill_orphans="true" --docker_registry="https://registry-1.docker.io"
--docker_remove_delay="6hrs" --docker_socket="/var/run/docker.sock" --docker_stop_timeout="0ns"
--docker_store_dir="/tmp/Endpoint_SlaveEndpointTest_NoAuthorizer_0_yQbn0A/store/docker" --docker_volume_checkpoint_dir="/var/run/mesos/isolators/docker/volume"
--enforce_container_disk_quota="false" --executor_registration_timeout="1mins" --executor_reregistration_timeout="2secs"
--executor_shutdown_grace_period="5secs" --fetcher_cache_dir="/tmp/Endpoint_SlaveEndpointTest_NoAuthorizer_0_yQbn0A/fetch"
--fetcher_cache_size="2GB" --frameworks_home="" --gc_delay="1weeks" --gc_disk_headroom="0.1"
--hadoop_home="" --help="false" --hostname_lookup="true" --http_command_executor="false" --http_credentials="/tmp/Endpoint_SlaveEndpointTest_NoAuthorizer_0_yQbn0A/http_credentials"
--http_heartbeat_interval="30secs" --initialize_driver_logging="true" --isolation="posix/cpu,posix/mem"
--launcher="posix" --launcher_dir="/tmp/SRC/build/mesos-1.6.0/_build/sub/src" --logbufsecs="0"
--logging_level="INFO" --max_completed_executors_per_framework="150" --oversubscribed_resources_interval="15secs"
--perf_duration="10secs" --perf_interval="1mins" --port="5051" --qos_correction_interval_min="0ns"
--quiet="false" --reconfiguration_policy="equal" --recover="reconnect" --recovery_timeout="15mins"
--registration_backoff_factor="10ms" --resources="cpus:2;gpus:0;mem:1024;disk:1024;ports:[31000-32000]"
--revocable_cpu_low_priority="true" --runtime_dir="/tmp/Endpoint_SlaveEndpointTest_NoAuthorizer_0_yQbn0A"
--sandbox_directory="/mnt/mesos/sandbox" --strict="true" --switch_user="true" --systemd_enable_support="true"
--systemd_runtime_directory="/run/systemd/system" --version="false" --work_dir="/tmp/Endpoint_SlaveEndpointTest_NoAuthorizer_0_EgNu9y"
--zk_session_timeout="10secs"
I0219 05:09:53.891916   710 credentials.hpp:86] Loading credential for authentication from
'/tmp/Endpoint_SlaveEndpointTest_NoAuthorizer_0_yQbn0A/credential'
I0219 05:09:53.892108   710 slave.cpp:295] Agent using credential for: test-principal
I0219 05:09:53.892135   710 credentials.hpp:37] Loading credentials for authentication from
'/tmp/Endpoint_SlaveEndpointTest_NoAuthorizer_0_yQbn0A/http_credentials'
I0219 05:09:53.892388   710 http.cpp:1045] Creating default 'basic' HTTP authenticator for
realm 'mesos-agent-readonly'
I0219 05:09:53.894268   710 slave.cpp:612] Agent resources: [{"name":"cpus","scalar":{"value":2.0},"type":"SCALAR"},{"name":"mem","scalar":{"value":1024.0},"type":"SCALAR"},{"name":"disk","scalar":{"value":1024.0},"type":"SCALAR"},{"name":"ports","ranges":{"range":[{"begin":31000,"end":32000}]},"type":"RANGES"}]
I0219 05:09:53.894512   710 slave.cpp:620] Agent attributes: [  ]
I0219 05:09:53.894529   710 slave.cpp:629] Agent hostname: 1916def4401a
I0219 05:09:53.894718   729 task_status_update_manager.cpp:181] Pausing sending task status
updates
I0219 05:09:53.896451   726 state.cpp:66] Recovering state from '/tmp/Endpoint_SlaveEndpointTest_NoAuthorizer_0_EgNu9y/meta'
I0219 05:09:53.896821   716 task_status_update_manager.cpp:207] Recovering task status update
manager
I0219 05:09:53.897251   711 containerizer.cpp:674] Recovering containerizer
I0219 05:09:53.900095   723 provisioner.cpp:495] Provisioner recovery complete
I0219 05:09:53.900800   732 slave.cpp:7232] Finished recovery
I0219 05:09:53.906493   733 process.cpp:3564] Handling HTTP event for process 'slave(998)'
with path: '/slave(998)/monitor/statistics'
I0219 05:09:53.909387   724 http.cpp:1185] HTTP GET for /slave(998)/monitor/statistics from
172.17.0.2:53510
I0219 05:09:53.909514   724 http.cpp:976] Authorizing principal 'test-principal' to GET the
'/monitor/statistics' endpoint
I0219 05:09:53.913998   709 slave.cpp:922] Agent terminating
[       OK ] Endpoint/SlaveEndpointTest.NoAuthorizer/0 (52 ms)
[ RUN      ] Endpoint/SlaveEndpointTest.NoAuthorizer/1
I0219 05:09:53.933657   709 containerizer.cpp:304] Using isolation { environment_secret, posix/cpu,
posix/mem, filesystem/posix, network/cni }
W0219 05:09:53.934478   709 backend.cpp:76] Failed to create 'aufs' backend: AufsBackend requires
root privileges
W0219 05:09:53.934514   709 backend.cpp:76] Failed to create 'bind' backend: BindBackend requires
root privileges
I0219 05:09:53.934556   709 provisioner.cpp:299] Using default backend 'copy'
I0219 05:09:53.937422   709 cluster.cpp:460] Creating default 'local' authorizer
I0219 05:09:53.940668   731 slave.cpp:262] Mesos agent started on (999)@172.17.0.2:35241
I0219 05:09:53.940704   731 slave.cpp:263] Flags at startup: --acls="" --appc_simple_discovery_uri_prefix="http://"
--appc_store_dir="/tmp/Endpoint_SlaveEndpointTest_NoAuthorizer_1_BeEmPI/store/appc" --authenticate_http_readonly="true"
--authenticate_http_readwrite="false" --authenticatee="crammd5" --authentication_backoff_factor="1secs"
--authorizer="local" --cgroups_cpu_enable_pids_and_tids_count="false" --cgroups_enable_cfs="false"
--cgroups_hierarchy="/sys/fs/cgroup" --cgroups_limit_swap="false" --cgroups_root="mesos" --container_disk_watch_interval="15secs"
--containerizers="mesos" --credential="/tmp/Endpoint_SlaveEndpointTest_NoAuthorizer_1_BeEmPI/credential"
--default_role="*" --disallow_sharing_agent_pid_namespace="false" --disk_watch_interval="1mins"
--docker="docker" --docker_kill_orphans="true" --docker_registry="https://registry-1.docker.io"
--docker_remove_delay="6hrs" --docker_socket="/var/run/docker.sock" --docker_stop_timeout="0ns"
--docker_store_dir="/tmp/Endpoint_SlaveEndpointTest_NoAuthorizer_1_BeEmPI/store/docker" --docker_volume_checkpoint_dir="/var/run/mesos/isolators/docker/volume"
--enforce_container_disk_quota="false" --executor_registration_timeout="1mins" --executor_reregistration_timeout="2secs"
--executor_shutdown_grace_period="5secs" --fetcher_cache_dir="/tmp/Endpoint_SlaveEndpointTest_NoAuthorizer_1_BeEmPI/fetch"
--fetcher_cache_size="2GB" --frameworks_home="" --gc_delay="1weeks" --gc_disk_headroom="0.1"
--hadoop_home="" --help="false" --hostname_lookup="true" --http_command_executor="false" --http_credentials="/tmp/Endpoint_SlaveEndpointTest_NoAuthorizer_1_BeEmPI/http_credentials"
--http_heartbeat_interval="30secs" --initialize_driver_logging="true" --isolation="posix/cpu,posix/mem"
--launcher="posix" --launcher_dir="/tmp/SRC/build/mesos-1.6.0/_build/sub/src" --logbufsecs="0"
--logging_level="INFO" --max_completed_executors_per_framework="150" --oversubscribed_resources_interval="15secs"
--perf_duration="10secs" --perf_interval="1mins" --port="5051" --qos_correction_interval_min="0ns"
--quiet="false" --reconfiguration_policy="equal" --recover="reconnect" --recovery_timeout="15mins"
--registration_backoff_factor="10ms" --resources="cpus:2;gpus:0;mem:1024;disk:1024;ports:[31000-32000]"
--revocable_cpu_low_priority="true" --runtime_dir="/tmp/Endpoint_SlaveEndpointTest_NoAuthorizer_1_BeEmPI"
--sandbox_directory="/mnt/mesos/sandbox" --strict="true" --switch_user="true" --systemd_enable_support="true"
--systemd_runtime_directory="/run/systemd/system" --version="false" --work_dir="/tmp/Endpoint_SlaveEndpointTest_NoAuthorizer_1_Q450QG"
--zk_session_timeout="10secs"
I0219 05:09:53.941282   731 credentials.hpp:86] Loading credential for authentication from
'/tmp/Endpoint_SlaveEndpointTest_NoAuthorizer_1_BeEmPI/credential'
I0219 05:09:53.941558   731 slave.cpp:295] Agent using credential for: test-principal
I0219 05:09:53.941591   731 credentials.hpp:37] Loading credentials for authentication from
'/tmp/Endpoint_SlaveEndpointTest_NoAuthorizer_1_BeEmPI/http_credentials'
I0219 05:09:53.941925   731 http.cpp:1045] Creating default 'basic' HTTP authenticator for
realm 'mesos-agent-readonly'
I0219 05:09:53.944283   731 slave.cpp:612] Agent resources: [{"name":"cpus","scalar":{"value":2.0},"type":"SCALAR"},{"name":"mem","scalar":{"value":1024.0},"type":"SCALAR"},{"name":"disk","scalar":{"value":1024.0},"type":"SCALAR"},{"name":"ports","ranges":{"range":[{"begin":31000,"end":32000}]},"type":"RANGES"}]
I0219 05:09:53.944569   731 slave.cpp:620] Agent attributes: [  ]
I0219 05:09:53.944591   731 slave.cpp:629] Agent hostname: 1916def4401a
I0219 05:09:53.944802   715 task_status_update_manager.cpp:181] Pausing sending task status
updates
I0219 05:09:53.946683   723 state.cpp:66] Recovering state from '/tmp/Endpoint_SlaveEndpointTest_NoAuthorizer_1_Q450QG/meta'
I0219 05:09:53.947072   722 task_status_update_manager.cpp:207] Recovering task status update
manager
I0219 05:09:53.947317   726 containerizer.cpp:674] Recovering containerizer
I0219 05:09:53.949005   719 provisioner.cpp:495] Provisioner recovery complete
I0219 05:09:53.949439   715 slave.cpp:7232] Finished recovery
I0219 05:09:53.953341   720 process.cpp:3564] Handling HTTP event for process 'slave(999)'
with path: '/slave(999)/monitor/statistics.json'
I0219 05:09:53.955313   711 http.cpp:1185] HTTP GET for /slave(999)/monitor/statistics.json
from 172.17.0.2:53514
I0219 05:09:53.955413   711 http.cpp:976] Authorizing principal 'test-principal' to GET the
'/monitor/statistics.json' endpoint
I0219 05:09:53.958791   709 slave.cpp:922] Agent terminating
[       OK ] Endpoint/SlaveEndpointTest.NoAuthorizer/1 (41 ms)
[ RUN      ] Endpoint/SlaveEndpointTest.NoAuthorizer/2
I0219 05:09:53.973882   709 containerizer.cpp:304] Using isolation { environment_secret, posix/cpu,
posix/mem, filesystem/posix, network/cni }
W0219 05:09:53.974509   709 backend.cpp:76] Failed to create 'aufs' backend: AufsBackend requires
root privileges
W0219 05:09:53.974537   709 backend.cpp:76] Failed to create 'bind' backend: BindBackend requires
root privileges
I0219 05:09:53.974572   709 provisioner.cpp:299] Using default backend 'copy'
I0219 05:09:53.976838   709 cluster.cpp:460] Creating default 'local' authorizer
I0219 05:09:53.979637   720 slave.cpp:262] Mesos agent started on (1000)@172.17.0.2:35241
I0219 05:09:53.979668   720 slave.cpp:263] Flags at startup: --acls="" --appc_simple_discovery_uri_prefix="http://"
--appc_store_dir="/tmp/Endpoint_SlaveEndpointTest_NoAuthorizer_2_ZPIV2Q/store/appc" --authenticate_http_readonly="true"
--authenticate_http_readwrite="false" --authenticatee="crammd5" --authentication_backoff_factor="1secs"
--authorizer="local" --cgroups_cpu_enable_pids_and_tids_count="false" --cgroups_enable_cfs="false"
--cgroups_hierarchy="/sys/fs/cgroup" --cgroups_limit_swap="false" --cgroups_root="mesos" --container_disk_watch_interval="15secs"
--containerizers="mesos" --credential="/tmp/Endpoint_SlaveEndpointTest_NoAuthorizer_2_ZPIV2Q/credential"
--default_role="*" --disallow_sharing_agent_pid_namespace="false" --disk_watch_interval="1mins"
--docker="docker" --docker_kill_orphans="true" --docker_registry="https://registry-1.docker.io"
--docker_remove_delay="6hrs" --docker_socket="/var/run/docker.sock" --docker_stop_timeout="0ns"
--docker_store_dir="/tmp/Endpoint_SlaveEndpointTest_NoAuthorizer_2_ZPIV2Q/store/docker" --docker_volume_checkpoint_dir="/var/run/mesos/isolators/docker/volume"
--enforce_container_disk_quota="false" --executor_registration_timeout="1mins" --executor_reregistration_timeout="2secs"
--executor_shutdown_grace_period="5secs" --fetcher_cache_dir="/tmp/Endpoint_SlaveEndpointTest_NoAuthorizer_2_ZPIV2Q/fetch"
--fetcher_cache_size="2GB" --frameworks_home="" --gc_delay="1weeks" --gc_disk_headroom="0.1"
--hadoop_home="" --help="false" --hostname_lookup="true" --http_command_executor="false" --http_credentials="/tmp/Endpoint_SlaveEndpointTest_NoAuthorizer_2_ZPIV2Q/http_credentials"
--http_heartbeat_interval="30secs" --initialize_driver_logging="true" --isolation="posix/cpu,posix/mem"
--launcher="posix" --launcher_dir="/tmp/SRC/build/mesos-1.6.0/_build/sub/src" --logbufsecs="0"
--logging_level="INFO" --max_completed_executors_per_framework="150" --oversubscribed_resources_interval="15secs"
--perf_duration="10secs" --perf_interval="1mins" --port="5051" --qos_correction_interval_min="0ns"
--quiet="false" --reconfiguration_policy="equal" --recover="reconnect" --recovery_timeout="15mins"
--registration_backoff_factor="10ms" --resources="cpus:2;gpus:0;mem:1024;disk:1024;ports:[31000-32000]"
--revocable_cpu_low_priority="true" --runtime_dir="/tmp/Endpoint_SlaveEndpointTest_NoAuthorizer_2_ZPIV2Q"
--sandbox_directory="/mnt/mesos/sandbox" --strict="true" --switch_user="true" --systemd_enable_support="true"
--systemd_runtime_directory="/run/systemd/system" --version="false" --work_dir="/tmp/Endpoint_SlaveEndpointTest_NoAuthorizer_2_6fuIYO"
--zk_session_timeout="10secs"
I0219 05:09:53.980147   720 credentials.hpp:86] Loading credential for authentication from
'/tmp/Endpoint_SlaveEndpointTest_NoAuthorizer_2_ZPIV2Q/credential'
I0219 05:09:53.980371   720 slave.cpp:295] Agent using credential for: test-principal
I0219 05:09:53.980407   720 credentials.hpp:37] Loading credentials for authentication from
'/tmp/Endpoint_SlaveEndpointTest_NoAuthorizer_2_ZPIV2Q/http_credentials'
I0219 05:09:53.980711   720 http.cpp:1045] Creating default 'basic' HTTP authenticator for
realm 'mesos-agent-readonly'
I0219 05:09:53.983781   720 slave.cpp:612] Agent resources: [{"name":"cpus","scalar":{"value":2.0},"type":"SCALAR"},{"name":"mem","scalar":{"value":1024.0},"type":"SCALAR"},{"name":"disk","scalar":{"value":1024.0},"type":"SCALAR"},{"name":"ports","ranges":{"range":[{"begin":31000,"end":32000}]},"type":"RANGES"}]
I0219 05:09:53.984174   720 slave.cpp:620] Agent attributes: [  ]
I0219 05:09:53.984199   720 slave.cpp:629] Agent hostname: 1916def4401a
I0219 05:09:53.984488   730 task_status_update_manager.cpp:181] Pausing sending task status
updates
I0219 05:09:53.986829   723 state.cpp:66] Recovering state from '/tmp/Endpoint_SlaveEndpointTest_NoAuthorizer_2_6fuIYO/meta'
I0219 05:09:53.987346   713 task_status_update_manager.cpp:207] Recovering task status update
manager
I0219 05:09:53.987645   712 containerizer.cpp:674] Recovering containerizer
I0219 05:09:53.990169   728 provisioner.cpp:495] Provisioner recovery complete
I0219 05:09:53.990689   730 slave.cpp:7232] Finished recovery
I0219 05:09:53.995146   716 process.cpp:3564] Handling HTTP event for process 'slave(1000)'
with path: '/slave(1000)/containers'
I0219 05:09:53.997323   710 http.cpp:1185] HTTP GET for /slave(1000)/containers from 172.17.0.2:53516
I0219 05:09:53.997436   710 http.cpp:976] Authorizing principal 'test-principal' to GET the
'/containers' endpoint
I0219 05:09:54.002703   733 slave.cpp:922] Agent terminating
[       OK ] Endpoint/SlaveEndpointTest.NoAuthorizer/2 (46 ms)
[----------] 9 tests from Endpoint/SlaveEndpointTest (453 ms total)

[----------] 2 tests from ContainerizerType/DefaultContainerDNSFlagTest
[ RUN      ] ContainerizerType/DefaultContainerDNSFlagTest.ValidateFlag/0
[       OK ] ContainerizerType/DefaultContainerDNSFlagTest.ValidateFlag/0 (14 ms)
[ RUN      ] ContainerizerType/DefaultContainerDNSFlagTest.ValidateFlag/1
[       OK ] ContainerizerType/DefaultContainerDNSFlagTest.ValidateFlag/1 (14 ms)
[----------] 2 tests from ContainerizerType/DefaultContainerDNSFlagTest (28 ms total)

[----------] Global test environment tear-down
[==========] 1916 tests from 192 test cases ran. (786254 ms total)
[  PASSED  ] 1915 tests.
[  FAILED  ] 1 test, listed below:
[  FAILED  ] MesosContainerizer/DefaultExecutorTest.ResourceLimitation/0, where GetParam()
= "mesos"

 1 FAILED TEST
  YOU HAVE 23 DISABLED TESTS

I0219 05:09:54.119509   734 process.cpp:929] Stopped the socket accept loop
Makefile:14663: recipe for target 'check-local' failed
make[4]: *** [check-local] Error 1
make[4]: Leaving directory '/tmp/SRC/build/mesos-1.6.0/_build/sub/src'
Makefile:13796: recipe for target 'check-am' failed
make[3]: *** [check-am] Error 2
make[3]: Leaving directory '/tmp/SRC/build/mesos-1.6.0/_build/sub/src'
Makefile:13800: recipe for target 'check' failed
make[2]: *** [check] Error 2
make[2]: Leaving directory '/tmp/SRC/build/mesos-1.6.0/_build/sub/src'
Makefile:774: recipe for target 'check-recursive' failed
make[1]: *** [check-recursive] Error 1
make[1]: Leaving directory '/tmp/SRC/build/mesos-1.6.0/_build/sub'
Makefile:980: recipe for target 'distcheck' failed
make: *** [distcheck] Error 1
Untagged: mesos/mesos-build:ubuntu-16.04
Untagged: mesos/mesos-build@sha256:3643a2cc107ff04ee2d7628a48cff8bee6186b98bcaa5ce36f685d28d8b04dae
Deleted: sha256:df13eb8a4c4b15c8e09329265603b7fcacc7753bc731057e91c06554acab5a10
Deleted: sha256:f50f81f71ec4d5b88ef535ef34e07a1abfe00cec71bd4518a0bee2348c0c6229
Deleted: sha256:334c2f430d63071d6f077369f301016b59d5421b28a6df435c63aa2209f480e7
Deleted: sha256:7a41f53b59bb61bde6d3dc9a41c4dd87e6ff5141b36da06529c2cb32e6733d63
Deleted: sha256:4b569c802f795bb918a504e6ce315cddecfb633aee338ee535e7cfbe5c2801a3
Build step 'Execute shell' marked build as failure


Mime
View raw message