mesos-builds mailing list archives

Site index · List index
Message view « Date » · « Thread »
Top « Date » · « Thread »
From Apache Jenkins Server <jenk...@builds.apache.org>
Subject Build failed in Jenkins: Mesos-Buildbot » autotools,gcc,--verbose --disable-libtool-wrappers --enable-libevent --enable-ssl,GLOG_v=1 MESOS_VERBOSE=1,centos:7,(ubuntu)&&(!ubuntu-us1)&&(!ubuntu-eu2)&&(!qnode3)&&(!H23) #4681
Date Tue, 02 Jan 2018 19:16:44 GMT
See <https://builds.apache.org/job/Mesos-Buildbot/BUILDTOOL=autotools,COMPILER=gcc,CONFIGURATION=--verbose%20--disable-libtool-wrappers%20--enable-libevent%20--enable-ssl,ENVIRONMENT=GLOG_v=1%20MESOS_VERBOSE=1,OS=centos%3A7,label_exp=(ubuntu)&&(!ubuntu-us1)&&(!ubuntu-eu2)&&(!qnode3)&&(!H23)/4681/display/redirect?page=changes>

Changes:

[vinodkone] Correctly reset slave status when aborting a registration.

[vinodkone] Added a master flag to disallow agents without domain.

------------------------------------------
[...truncated 153.65 KB...]
configure: Setting up CXXFLAGS for g++ version >= 4.8
checking whether C++ compiler accepts -fstack-protector-strong... yes
checking whether g++ supports C++11 features by default... no
checking whether g++ supports C++11 features with -std=c++11... yes
checking if compiler needs -Werror to reject unknown flags... no
checking for the pthreads library -lpthreads... no
checking whether pthreads work without any flags... no
checking whether pthreads work with -Kthread... no
checking whether pthreads work with -kthread... no
checking for the pthreads library -llthread... no
checking whether pthreads work with -pthread... yes
checking for joinable pthread attribute... PTHREAD_CREATE_JOINABLE
checking if more special flags are required for pthreads... no
checking for PTHREAD_PRIO_INHERIT... yes
configure: Setting up build environment for x86_64 linux-gnu
checking for backtrace in -lunwind... no
checking for main in -lgflags... no
checking for patch... patch
checking fts.h usability... yes
checking fts.h presence... yes
checking for fts.h... yes
checking for library containing fts_close... none required
checking apr_pools.h usability... yes
checking apr_pools.h presence... yes
checking for apr_pools.h... yes
checking for apr_initialize in -lapr-1... yes
checking for curl_global_init in -lcurl... yes
checking for javac... /usr/bin/javac
checking for java... /usr/bin/java
checking value of Java system property 'java.home'... /usr/lib/jvm/java-1.8.0-openjdk-1.8.0.151-5.b12.el7_4.x86_64/jre
configure: using JAVA_HOME=/usr/lib/jvm/java-1.8.0-openjdk-1.8.0.151-5.b12.el7_4.x86_64
checking whether or not we can build with JNI... yes
checking for mvn... /usr/bin/mvn
checking event2/event.h usability... yes
checking event2/event.h presence... yes
checking for event2/event.h... yes
checking for event_base_new in -levent... yes
checking event2/thread.h usability... yes
checking event2/thread.h presence... yes
checking for event2/thread.h... yes
checking for evthread_use_pthreads in -levent_pthreads... yes
checking for sasl_done in -lsasl2... yes
checking SASL CRAM-MD5 support... yes
checking for RAND_poll in -lcrypto... yes
checking openssl/ssl.h usability... yes
checking openssl/ssl.h presence... yes
checking for openssl/ssl.h... yes
checking for SSL_CTX_new in -lssl... yes
checking event2/bufferevent_ssl.h usability... yes
checking event2/bufferevent_ssl.h presence... yes
checking for event2/bufferevent_ssl.h... yes
checking for bufferevent_openssl_get_ssl in -levent_openssl... yes
checking svn_version.h usability... yes
checking svn_version.h presence... yes
checking for svn_version.h... yes
checking for svn_stringbuf_create_ensure in -lsvn_subr-1... yes
checking svn_delta.h usability... yes
checking svn_delta.h presence... yes
checking for svn_delta.h... yes
checking for svn_txdelta in -lsvn_delta-1... yes
checking whether to enable the XFS disk isolator... no
checking zlib.h usability... yes
checking zlib.h presence... yes
checking for zlib.h... yes
checking for deflate, gzread, gzwrite, inflate in -lz... yes
checking C++ standard library for undefined behaviour with selected optimization level...
no
checking for a Python interpreter with version >= 2.6... python
checking for python... /usr/bin/python
checking for python version... 2.7
checking for python platform... linux2
checking for python script directory... ${prefix}/lib/python2.7/site-packages
checking for python extension module directory... ${exec_prefix}/lib64/python2.7/site-packages
checking for python2.7... (cached) /usr/bin/python
checking for a version of Python >= '2.1.0'... yes
checking for a version of Python >= '2.6'... yes
checking for the distutils Python package... yes
checking for Python include path... -I/usr/include/python2.7
checking for Python library path... -L/usr/lib64 -lpython2.7
checking for Python site-packages path... /usr/lib/python2.7/site-packages
checking python extra libraries... -lpthread -ldl  -lutil -lm
checking python extra linking flags... -Xlinker -export-dynamic
checking consistency of all components of python development environment... yes
checking whether we can build usable Python eggs... In file included from /usr/include/limits.h:26:0,
                 from /usr/lib/gcc/x86_64-redhat-linux/4.8.5/include/limits.h:168,
                 from /usr/lib/gcc/x86_64-redhat-linux/4.8.5/include/syslimits.h:7,
                 from /usr/lib/gcc/x86_64-redhat-linux/4.8.5/include/limits.h:34,
                 from /usr/include/python2.7/Python.h:19,
                 from testpyegg.cpp:1:
/usr/include/features.h:330:4: warning: #warning _FORTIFY_SOURCE requires compiling with optimization
(-O) [-Wcpp]
 #  warning _FORTIFY_SOURCE requires compiling with optimization (-O)
    ^
yes
checking for an old installation of the Mesos egg (before 0.20.0)... no
checking that generated files are newer than configure... done
configure: creating ./config.status
config.status: creating Makefile
config.status: creating mesos.pc
config.status: creating src/Makefile
config.status: creating 3rdparty/Makefile
config.status: creating 3rdparty/libprocess/Makefile
config.status: creating 3rdparty/libprocess/include/Makefile
config.status: creating 3rdparty/stout/Makefile
config.status: creating 3rdparty/stout/include/Makefile
config.status: creating 3rdparty/gmock_sources.cc
config.status: creating bin/mesos.sh
config.status: creating bin/mesos-agent.sh
config.status: creating bin/mesos-local.sh
config.status: creating bin/mesos-master.sh
config.status: creating bin/mesos-slave.sh
config.status: creating bin/mesos-tests.sh
config.status: creating bin/mesos-agent-flags.sh
config.status: creating bin/mesos-local-flags.sh
config.status: creating bin/mesos-master-flags.sh
config.status: creating bin/mesos-slave-flags.sh
config.status: creating bin/mesos-tests-flags.sh
config.status: creating bin/gdb-mesos-agent.sh
config.status: creating bin/gdb-mesos-local.sh
config.status: creating bin/gdb-mesos-master.sh
config.status: creating bin/gdb-mesos-slave.sh
config.status: creating bin/gdb-mesos-tests.sh
config.status: creating bin/lldb-mesos-agent.sh
config.status: creating bin/lldb-mesos-local.sh
config.status: creating bin/lldb-mesos-master.sh
config.status: creating bin/lldb-mesos-slave.sh
config.status: creating bin/lldb-mesos-tests.sh
config.status: creating bin/valgrind-mesos-agent.sh
config.status: creating bin/valgrind-mesos-local.sh
config.status: creating bin/valgrind-mesos-master.sh
config.status: creating bin/valgrind-mesos-slave.sh
config.status: creating bin/valgrind-mesos-tests.sh
config.status: creating src/deploy/mesos-daemon.sh
config.status: creating src/deploy/mesos-start-agents.sh
config.status: creating src/deploy/mesos-start-cluster.sh
config.status: creating src/deploy/mesos-start-masters.sh
config.status: creating src/deploy/mesos-start-slaves.sh
config.status: creating src/deploy/mesos-stop-agents.sh
config.status: creating src/deploy/mesos-stop-cluster.sh
config.status: creating src/deploy/mesos-stop-masters.sh
config.status: creating src/deploy/mesos-stop-slaves.sh
config.status: creating include/mesos/version.hpp
config.status: creating src/java/generated/org/apache/mesos/MesosNativeLibrary.java
config.status: creating mpi/mpiexec-mesos
config.status: creating src/examples/java/test-exception-framework
config.status: creating src/examples/java/test-executor
config.status: creating src/examples/java/test-framework
config.status: creating src/examples/java/test-multiple-executors-framework
config.status: creating src/examples/java/test-log
config.status: creating src/examples/java/v1-test-framework
config.status: creating src/java/mesos.pom
config.status: creating src/examples/python/test-executor
config.status: creating src/examples/python/test-framework
config.status: creating src/python/setup.py
config.status: creating src/python/cli/setup.py
config.status: creating src/python/interface/setup.py
config.status: creating src/python/native_common/ext_modules.py
config.status: creating src/python/executor/setup.py
config.status: creating src/python/native/setup.py
config.status: creating src/python/scheduler/setup.py
config.status: linking src/python/native_common/ext_modules.py to src/python/executor/ext_modules.py
config.status: linking src/python/native_common/ext_modules.py to src/python/scheduler/ext_modules.py
config.status: executing depfiles commands
config.status: executing libtool commands
configure: Build option summary:
    CXX:        g++
    CXXFLAGS:   -g1 -O0 -Wno-unused-local-typedefs -std=c++11
    CPPFLAGS:   -isystem /usr/include/subversion-1 -isystem /usr/include/apr-1 -isystem /usr/include/apr-1.0
      
    LDFLAGS:    
    LIBS:       -lz -lsvn_delta-1 -lsvn_subr-1 -levent_openssl -lssl -lcrypto -lsasl2 -levent_pthreads
-levent -lcurl -lapr-1  -lrt

make  dist-gzip am__post_remove_distdir='@:'
make[1]: Entering directory `/mesos'
if test -d "mesos-1.5.0"; then find "mesos-1.5.0" -type d ! -perm -200 -exec chmod u+w {}
';' && rm -rf "mesos-1.5.0" || { sleep 5 && rm -rf "mesos-1.5.0"; }; else
:; fi
test -d "mesos-1.5.0" || mkdir "mesos-1.5.0"
 (cd 3rdparty && make  top_distdir=../mesos-1.5.0 distdir=../mesos-1.5.0/3rdparty
\
     am__remove_distdir=: am__skip_length_check=: am__skip_mode_fix=: distdir)
make[2]: Entering directory `/mesos/3rdparty'
 (cd stout && make  top_distdir=../../mesos-1.5.0 distdir=../../mesos-1.5.0/3rdparty/stout
\
     am__remove_distdir=: am__skip_length_check=: am__skip_mode_fix=: distdir)
make[3]: Entering directory `/mesos/3rdparty/stout'
 (cd include && make  top_distdir=../../../mesos-1.5.0 distdir=../../../mesos-1.5.0/3rdparty/stout/include
\
     am__remove_distdir=: am__skip_length_check=: am__skip_mode_fix=: distdir)
make[4]: Entering directory `/mesos/3rdparty/stout/include'
make[4]: Leaving directory `/mesos/3rdparty/stout/include'
make  \
  top_distdir="../../mesos-1.5.0" distdir="../../mesos-1.5.0/3rdparty/stout" \
  dist-hook
make[4]: Entering directory `/mesos/3rdparty/stout'
cp -r ./3rdparty ../../mesos-1.5.0/3rdparty/stout/
make[4]: Leaving directory `/mesos/3rdparty/stout'
make[3]: Leaving directory `/mesos/3rdparty/stout'
 (cd libprocess && make  top_distdir=../../mesos-1.5.0 distdir=../../mesos-1.5.0/3rdparty/libprocess
\
     am__remove_distdir=: am__skip_length_check=: am__skip_mode_fix=: distdir)
make[3]: Entering directory `/mesos/3rdparty/libprocess'
 (cd include && make  top_distdir=../../../mesos-1.5.0 distdir=../../../mesos-1.5.0/3rdparty/libprocess/include
\
     am__remove_distdir=: am__skip_length_check=: am__skip_mode_fix=: distdir)
make[4]: Entering directory `/mesos/3rdparty/libprocess/include'
make[4]: Leaving directory `/mesos/3rdparty/libprocess/include'
make  \
  top_distdir="../../mesos-1.5.0" distdir="../../mesos-1.5.0/3rdparty/libprocess" \
  dist-hook
make[4]: Entering directory `/mesos/3rdparty/libprocess'
cp -r ./3rdparty ../../mesos-1.5.0/3rdparty/libprocess/
make[4]: Leaving directory `/mesos/3rdparty/libprocess'
make[3]: Leaving directory `/mesos/3rdparty/libprocess'
make[2]: Leaving directory `/mesos/3rdparty'
 (cd src && make  top_distdir=../mesos-1.5.0 distdir=../mesos-1.5.0/src \
     am__remove_distdir=: am__skip_length_check=: am__skip_mode_fix=: distdir)
make[2]: Entering directory `/mesos/src'
../3rdparty/protobuf-3.5.0/src/protoc -I../include -I.  --cpp_out=. resource_provider/storage/volume_profile.proto
make[2]: ../3rdparty/protobuf-3.5.0/src/protoc: Command not found
make[2]: *** [resource_provider/storage/volume_profile.pb.h] Error 127
make[2]: Leaving directory `/mesos/src'
make[1]: *** [distdir] Error 1
make[1]: Leaving directory `/mesos'
make: *** [dist] Error 2
+ docker rmi mesos-1514920061-18941
Untagged: mesos-1514920061-18941:latest
Deleted: sha256:2c2d10f500232853cd427629f509401f622c461391883b2e17fae8bcd6c56ac4
Deleted: sha256:3d946dc4f9b06eb2fa893e92487d191c6b36a015bfbd44d084f0257a744e1a7c
Deleted: sha256:b226c23967a53d86386dda002a3bead4cdb92ac45c5cf66684c92e5eb3e3f293
Deleted: sha256:40e8e58aea4da88299ca207e3d05371e1fce9d52d3ad806b906406d93d4dd015
Deleted: sha256:55d932822187773d4d626732f6b0a4e1ca7368c0f2a68014170a7778deae3e63
Deleted: sha256:f52b58181d355f2d8b59f651617457981f8a640119d9400d2a9b11ae78bb6956
Deleted: sha256:8ba885ebb1225e5ff3d2c670055bac9f88ec3fb9edc0e33d68ce0d7d6c5129c7
Deleted: sha256:b95398b5b85b310b9b6e1af662613d8a4291d9c53bf0225203787871b5795e8e
Deleted: sha256:262e66d44a568c8ad329bb4054962914057be9ecbc50f94da6c3be50758695a8
Deleted: sha256:010e6bcc6c7366fadc36fab8fbf4061f28c3d5d2e7a7f725f2e0ba200726a841
Deleted: sha256:0c78bd4d11de8e47d9ca92060e191b2662202b0136d7a0e9146c236f6fcd6a08
Deleted: sha256:61535907aa90b8dd2eb3c81e964a96a9c09b7ba574dcaeb7250d9616a806e071
Deleted: sha256:a34259e9f61810281a22a8f86ab6de4c1a6c1d7e8d289fc1bc5148e4224f2521
Deleted: sha256:6ac2b3be034030749790510d6fb55f0fbf542871d8fd021ab3cf0c5bdc161b78
Deleted: sha256:91afbb36e27266264bd37c01fde259b50b735d2ae9c7c4601d81249fb050d165
Deleted: sha256:8e20290f09bd2e157e6629cc118cf5d00004b8e6bef35c7adfa04898fecf8bb2
Deleted: sha256:2ea4c9647d3bf6fff5d10843b0b3090355a223b5caccc523b8272f657389fad8
Deleted: sha256:f46e163c650a036f2c59ff2dd92cc6cd5434fb0e8f7d3d263980a4174fb9906b
Deleted: sha256:87bdd4605039e31d20517f5923f3a1a7bcf95fa4bbae00212ca8e4f6cb3fe70d
Deleted: sha256:776614f9ee1e92e013c7c644300c9b56983cdc4d3f71523d78ad17fb75f10b21
Deleted: sha256:999e8b88d2ec5e1beda69ff3927cf261d55069ccf1d7817003f75ad99d0968e1
Deleted: sha256:d8fae452ed7a7da0b639850d076a4c85fe23260d37e2748bdd2f9b8170f594f6
Deleted: sha256:32dc604755f754a036e217611d55fd7aa70ed9ffa924ba130d05bd80e6b79420
Deleted: sha256:11374a3678254b23ae95f9934da9962f4b14b6b357a0e754916942c98c1bd132
Deleted: sha256:eab931dd88d9650086e37247cd1275f0601d64bdd199b62b471c5d8e63c929d8
Deleted: sha256:0be1d9bd082e0f04a910d67b88022680771c66516bfe9b1e1865e4fa960fe299
Deleted: sha256:b366ce3dde05665701f479f1d3b6f8bc8009ce81e476149b40ddb3f7096006bc
Deleted: sha256:0e03b84eaf551d304e3707dd98c459f8f96ca0205b0931dacc253493ee4bae2b
Deleted: sha256:5b6e3c3f726327d7b7e02b07cdfeb8898d576941e39287b98a857b1322f99129
Build step 'Execute shell' marked build as failure
Not sending mail to unregistered user yujie.jay@gmail.com
Not sending mail to unregistered user songzihao1990@gmail.com

Mime
View raw message