mesos-builds mailing list archives

Site index · List index
Message view « Date » · « Thread »
Top « Date » · « Thread »
From Apache Jenkins Server <jenk...@builds.apache.org>
Subject Build failed in Jenkins: Mesos-Buildbot » autotools,gcc,--verbose --disable-libtool-wrappers,GLOG_v=1 MESOS_VERBOSE=1,ubuntu:14.04,(ubuntu)&&(!ubuntu-us1)&&(!ubuntu-eu2)&&(!qnode3)&&(!H23) #4531
Date Sat, 02 Dec 2017 06:31:33 GMT
See <https://builds.apache.org/job/Mesos-Buildbot/BUILDTOOL=autotools,COMPILER=gcc,CONFIGURATION=--verbose%20--disable-libtool-wrappers,ENVIRONMENT=GLOG_v=1%20MESOS_VERBOSE=1,OS=ubuntu%3A14.04,label_exp=(ubuntu)&&(!ubuntu-us1)&&(!ubuntu-eu2)&&(!qnode3)&&(!H23)/4531/display/redirect?page=changes>

Changes:

[bmahler] Changed the semantics of `JSON::protobuf` for deprecated fields [14/20].

[bmahler] Added MESOS-7674 to the 1.3.2 CHANGELOG.

[bmahler] Stripped AllocationInfo from offers to non-MULTI_ROLE schedulers.

[bmahler] Updated the tests to use MULTI_ROLE frameworks by default.

[bmahler] Added MESOS-8237 to the 1.3.2 CHANGELOG.

------------------------------------------
[...truncated 26.79 MB...]
[ RUN      ] Endpoint/SlaveEndpointTest.AuthorizedRequest/2
I1202 06:31:20.178694 30701 containerizer.cpp:221] Using isolation: posix/cpu,posix/mem,filesystem/posix,network/cni
W1202 06:31:20.179314 30701 backend.cpp:76] Failed to create 'aufs' backend: AufsBackend requires
root privileges
W1202 06:31:20.179427 30701 backend.cpp:76] Failed to create 'bind' backend: BindBackend requires
root privileges
I1202 06:31:20.179471 30701 provisioner.cpp:249] Using default backend 'copy'
I1202 06:31:20.183185 30731 slave.cpp:231] Mesos agent started on (740)@172.17.0.3:35305
I1202 06:31:20.183214 30731 slave.cpp:232] Flags at startup: --acls="" --appc_simple_discovery_uri_prefix="http://"
--appc_store_dir="/tmp/mesos/store/appc" --authenticate_http_readonly="true" --authenticate_http_readwrite="true"
--authenticatee="crammd5" --authentication_backoff_factor="1secs" --authorizer="local" --cgroups_cpu_enable_pids_and_tids_count="false"
--cgroups_enable_cfs="false" --cgroups_hierarchy="/sys/fs/cgroup" --cgroups_limit_swap="false"
--cgroups_root="mesos" --container_disk_watch_interval="15secs" --containerizers="mesos" --credential="/tmp/Endpoint_SlaveEndpointTest_AuthorizedRequest_2_mZjYR3/credential"
--default_role="*" --disk_watch_interval="1mins" --docker="docker" --docker_kill_orphans="true"
--docker_registry="https://registry-1.docker.io" --docker_remove_delay="6hrs" --docker_socket="/var/run/docker.sock"
--docker_stop_timeout="0ns" --docker_store_dir="/tmp/mesos/store/docker" --docker_volume_checkpoint_dir="/var/run/mesos/isolators/docker/volume"
--enforce_container_disk_quota="false" --executor_registration_timeout="1mins" --executor_reregistration_timeout="2secs"
--executor_shutdown_grace_period="5secs" --fetcher_cache_dir="/tmp/Endpoint_SlaveEndpointTest_AuthorizedRequest_2_mZjYR3/fetch"
--fetcher_cache_size="2GB" --frameworks_home="" --gc_delay="1weeks" --gc_disk_headroom="0.1"
--hadoop_home="" --help="false" --hostname_lookup="true" --http_command_executor="false" --http_credentials="/tmp/Endpoint_SlaveEndpointTest_AuthorizedRequest_2_mZjYR3/http_credentials"
--http_heartbeat_interval="30secs" --initialize_driver_logging="true" --isolation="posix/cpu,posix/mem"
--launcher="posix" --launcher_dir="/mesos/mesos-1.3.2/_build/src" --logbufsecs="0" --logging_level="INFO"
--max_completed_executors_per_framework="150" --oversubscribed_resources_interval="15secs"
--perf_duration="10secs" --perf_interval="1mins" --port="5051" --qos_correction_interval_min="0ns"
--quiet="false" --recover="reconnect" --recovery_timeout="15mins" --registration_backoff_factor="10ms"
--resources="cpus:2;gpus:0;mem:1024;disk:1024;ports:[31000-32000]" --revocable_cpu_low_priority="true"
--runtime_dir="/tmp/Endpoint_SlaveEndpointTest_AuthorizedRequest_2_mZjYR3" --sandbox_directory="/mnt/mesos/sandbox"
--strict="true" --switch_user="true" --systemd_enable_support="true" --systemd_runtime_directory="/run/systemd/system"
--version="false" --work_dir="/tmp/Endpoint_SlaveEndpointTest_AuthorizedRequest_2_n5dO7e"
I1202 06:31:20.183755 30731 credentials.hpp:86] Loading credential for authentication from
'/tmp/Endpoint_SlaveEndpointTest_AuthorizedRequest_2_mZjYR3/credential'
I1202 06:31:20.183917 30731 slave.cpp:264] Agent using credential for: test-principal
I1202 06:31:20.183943 30731 credentials.hpp:37] Loading credentials for authentication from
'/tmp/Endpoint_SlaveEndpointTest_AuthorizedRequest_2_mZjYR3/http_credentials'
I1202 06:31:20.184206 30731 http.cpp:975] Creating default 'basic' HTTP authenticator for
realm 'mesos-agent-readonly'
I1202 06:31:20.184435 30731 http.cpp:975] Creating default 'basic' HTTP authenticator for
realm 'mesos-agent-readwrite'
I1202 06:31:20.186084 30731 slave.cpp:531] Agent resources: cpus(*):2; mem(*):1024; disk(*):1024;
ports(*):[31000-32000]
I1202 06:31:20.186215 30731 slave.cpp:539] Agent attributes: [  ]
I1202 06:31:20.186233 30731 slave.cpp:544] Agent hostname: eb6882ed8931
I1202 06:31:20.186377 30728 status_update_manager.cpp:177] Pausing sending status updates
I1202 06:31:20.187779 30727 state.cpp:62] Recovering state from '/tmp/Endpoint_SlaveEndpointTest_AuthorizedRequest_2_n5dO7e/meta'
I1202 06:31:20.188048 30730 status_update_manager.cpp:203] Recovering status update manager
I1202 06:31:20.188308 30724 containerizer.cpp:608] Recovering containerizer
I1202 06:31:20.189731 30728 provisioner.cpp:410] Provisioner recovery complete
I1202 06:31:20.190081 30724 slave.cpp:6100] Finished recovery
I1202 06:31:20.190634 30724 slave.cpp:6282] Querying resource estimator for oversubscribable
resources
I1202 06:31:20.190937 30728 slave.cpp:6296] Received oversubscribable resources {} from the
resource estimator
I1202 06:31:20.193301 30729 process.cpp:3741] Handling HTTP event for process 'slave(740)'
with path: '/slave(740)/containers'
I1202 06:31:20.194576 30731 http.cpp:1115] HTTP GET for /slave(740)/containers from 172.17.0.3:51470
I1202 06:31:20.194669 30731 http.cpp:936] Authorizing principal 'test-principal' to GET the
'/containers' endpoint
I1202 06:31:20.197865 30721 slave.cpp:796] Agent terminating
[       OK ] Endpoint/SlaveEndpointTest.AuthorizedRequest/2 (29 ms)
[ RUN      ] Endpoint/SlaveEndpointTest.UnauthorizedRequest/0
I1202 06:31:20.208745 30701 containerizer.cpp:221] Using isolation: posix/cpu,posix/mem,filesystem/posix,network/cni
W1202 06:31:20.209358 30701 backend.cpp:76] Failed to create 'aufs' backend: AufsBackend requires
root privileges
W1202 06:31:20.209465 30701 backend.cpp:76] Failed to create 'bind' backend: BindBackend requires
root privileges
I1202 06:31:20.209502 30701 provisioner.cpp:249] Using default backend 'copy'
I1202 06:31:20.212304 30724 slave.cpp:231] Mesos agent started on (741)@172.17.0.3:35305
I1202 06:31:20.212324 30724 slave.cpp:232] Flags at startup: --acls="" --appc_simple_discovery_uri_prefix="http://"
--appc_store_dir="/tmp/mesos/store/appc" --authenticate_http_readonly="true" --authenticate_http_readwrite="true"
--authenticatee="crammd5" --authentication_backoff_factor="1secs" --authorizer="local" --cgroups_cpu_enable_pids_and_tids_count="false"
--cgroups_enable_cfs="false" --cgroups_hierarchy="/sys/fs/cgroup" --cgroups_limit_swap="false"
--cgroups_root="mesos" --container_disk_watch_interval="15secs" --containerizers="mesos" --credential="/tmp/Endpoint_SlaveEndpointTest_UnauthorizedRequest_0_CKdi7k/credential"
--default_role="*" --disk_watch_interval="1mins" --docker="docker" --docker_kill_orphans="true"
--docker_registry="https://registry-1.docker.io" --docker_remove_delay="6hrs" --docker_socket="/var/run/docker.sock"
--docker_stop_timeout="0ns" --docker_store_dir="/tmp/mesos/store/docker" --docker_volume_checkpoint_dir="/var/run/mesos/isolators/docker/volume"
--enforce_container_disk_quota="false" --executor_registration_timeout="1mins" --executor_reregistration_timeout="2secs"
--executor_shutdown_grace_period="5secs" --fetcher_cache_dir="/tmp/Endpoint_SlaveEndpointTest_UnauthorizedRequest_0_CKdi7k/fetch"
--fetcher_cache_size="2GB" --frameworks_home="" --gc_delay="1weeks" --gc_disk_headroom="0.1"
--hadoop_home="" --help="false" --hostname_lookup="true" --http_command_executor="false" --http_credentials="/tmp/Endpoint_SlaveEndpointTest_UnauthorizedRequest_0_CKdi7k/http_credentials"
--http_heartbeat_interval="30secs" --initialize_driver_logging="true" --isolation="posix/cpu,posix/mem"
--launcher="posix" --launcher_dir="/mesos/mesos-1.3.2/_build/src" --logbufsecs="0" --logging_level="INFO"
--max_completed_executors_per_framework="150" --oversubscribed_resources_interval="15secs"
--perf_duration="10secs" --perf_interval="1mins" --port="5051" --qos_correction_interval_min="0ns"
--quiet="false" --recover="reconnect" --recovery_timeout="15mins" --registration_backoff_factor="10ms"
--resources="cpus:2;gpus:0;mem:1024;disk:1024;ports:[31000-32000]" --revocable_cpu_low_priority="true"
--runtime_dir="/tmp/Endpoint_SlaveEndpointTest_UnauthorizedRequest_0_CKdi7k" --sandbox_directory="/mnt/mesos/sandbox"
--strict="true" --switch_user="true" --systemd_enable_support="true" --systemd_runtime_directory="/run/systemd/system"
--version="false" --work_dir="/tmp/Endpoint_SlaveEndpointTest_UnauthorizedRequest_0_V5Leiw"
I1202 06:31:20.212643 30724 credentials.hpp:86] Loading credential for authentication from
'/tmp/Endpoint_SlaveEndpointTest_UnauthorizedRequest_0_CKdi7k/credential'
I1202 06:31:20.212756 30724 slave.cpp:264] Agent using credential for: test-principal
I1202 06:31:20.212776 30724 credentials.hpp:37] Loading credentials for authentication from
'/tmp/Endpoint_SlaveEndpointTest_UnauthorizedRequest_0_CKdi7k/http_credentials'
I1202 06:31:20.212961 30724 http.cpp:975] Creating default 'basic' HTTP authenticator for
realm 'mesos-agent-readonly'
I1202 06:31:20.213228 30724 http.cpp:975] Creating default 'basic' HTTP authenticator for
realm 'mesos-agent-readwrite'
I1202 06:31:20.214563 30724 slave.cpp:531] Agent resources: cpus(*):2; mem(*):1024; disk(*):1024;
ports(*):[31000-32000]
I1202 06:31:20.214645 30724 slave.cpp:539] Agent attributes: [  ]
I1202 06:31:20.214658 30724 slave.cpp:544] Agent hostname: eb6882ed8931
I1202 06:31:20.214777 30721 status_update_manager.cpp:177] Pausing sending status updates
I1202 06:31:20.216323 30722 state.cpp:62] Recovering state from '/tmp/Endpoint_SlaveEndpointTest_UnauthorizedRequest_0_V5Leiw/meta'
I1202 06:31:20.216642 30724 status_update_manager.cpp:203] Recovering status update manager
I1202 06:31:20.216876 30729 containerizer.cpp:608] Recovering containerizer
I1202 06:31:20.218055 30730 provisioner.cpp:410] Provisioner recovery complete
I1202 06:31:20.218489 30729 slave.cpp:6100] Finished recovery
I1202 06:31:20.219061 30729 slave.cpp:6282] Querying resource estimator for oversubscribable
resources
I1202 06:31:20.219357 30720 slave.cpp:6296] Received oversubscribable resources {} from the
resource estimator
I1202 06:31:20.221313 30734 process.cpp:3741] Handling HTTP event for process 'slave(741)'
with path: '/slave(741)/monitor/statistics'
I1202 06:31:20.222460 30728 http.cpp:1115] HTTP GET for /slave(741)/monitor/statistics from
172.17.0.3:51471
I1202 06:31:20.222553 30728 http.cpp:936] Authorizing principal 'test-principal' to GET the
'/monitor/statistics' endpoint
I1202 06:31:20.225142 30727 slave.cpp:796] Agent terminating
[       OK ] Endpoint/SlaveEndpointTest.UnauthorizedRequest/0 (27 ms)
[ RUN      ] Endpoint/SlaveEndpointTest.UnauthorizedRequest/1
I1202 06:31:20.236145 30701 containerizer.cpp:221] Using isolation: posix/cpu,posix/mem,filesystem/posix,network/cni
W1202 06:31:20.236584 30701 backend.cpp:76] Failed to create 'aufs' backend: AufsBackend requires
root privileges
W1202 06:31:20.236670 30701 backend.cpp:76] Failed to create 'bind' backend: BindBackend requires
root privileges
I1202 06:31:20.236699 30701 provisioner.cpp:249] Using default backend 'copy'
I1202 06:31:20.240144 30722 slave.cpp:231] Mesos agent started on (742)@172.17.0.3:35305
I1202 06:31:20.240173 30722 slave.cpp:232] Flags at startup: --acls="" --appc_simple_discovery_uri_prefix="http://"
--appc_store_dir="/tmp/mesos/store/appc" --authenticate_http_readonly="true" --authenticate_http_readwrite="true"
--authenticatee="crammd5" --authentication_backoff_factor="1secs" --authorizer="local" --cgroups_cpu_enable_pids_and_tids_count="false"
--cgroups_enable_cfs="false" --cgroups_hierarchy="/sys/fs/cgroup" --cgroups_limit_swap="false"
--cgroups_root="mesos" --container_disk_watch_interval="15secs" --containerizers="mesos" --credential="/tmp/Endpoint_SlaveEndpointTest_UnauthorizedRequest_1_eBaTEC/credential"
--default_role="*" --disk_watch_interval="1mins" --docker="docker" --docker_kill_orphans="true"
--docker_registry="https://registry-1.docker.io" --docker_remove_delay="6hrs" --docker_socket="/var/run/docker.sock"
--docker_stop_timeout="0ns" --docker_store_dir="/tmp/mesos/store/docker" --docker_volume_checkpoint_dir="/var/run/mesos/isolators/docker/volume"
--enforce_container_disk_quota="false" --executor_registration_timeout="1mins" --executor_reregistration_timeout="2secs"
--executor_shutdown_grace_period="5secs" --fetcher_cache_dir="/tmp/Endpoint_SlaveEndpointTest_UnauthorizedRequest_1_eBaTEC/fetch"
--fetcher_cache_size="2GB" --frameworks_home="" --gc_delay="1weeks" --gc_disk_headroom="0.1"
--hadoop_home="" --help="false" --hostname_lookup="true" --http_command_executor="false" --http_credentials="/tmp/Endpoint_SlaveEndpointTest_UnauthorizedRequest_1_eBaTEC/http_credentials"
--http_heartbeat_interval="30secs" --initialize_driver_logging="true" --isolation="posix/cpu,posix/mem"
--launcher="posix" --launcher_dir="/mesos/mesos-1.3.2/_build/src" --logbufsecs="0" --logging_level="INFO"
--max_completed_executors_per_framework="150" --oversubscribed_resources_interval="15secs"
--perf_duration="10secs" --perf_interval="1mins" --port="5051" --qos_correction_interval_min="0ns"
--quiet="false" --recover="reconnect" --recovery_timeout="15mins" --registration_backoff_factor="10ms"
--resources="cpus:2;gpus:0;mem:1024;disk:1024;ports:[31000-32000]" --revocable_cpu_low_priority="true"
--runtime_dir="/tmp/Endpoint_SlaveEndpointTest_UnauthorizedRequest_1_eBaTEC" --sandbox_directory="/mnt/mesos/sandbox"
--strict="true" --switch_user="true" --systemd_enable_support="true" --systemd_runtime_directory="/run/systemd/system"
--version="false" --work_dir="/tmp/Endpoint_SlaveEndpointTest_UnauthorizedRequest_1_187gLN"
I1202 06:31:20.240703 30722 credentials.hpp:86] Loading credential for authentication from
'/tmp/Endpoint_SlaveEndpointTest_UnauthorizedRequest_1_eBaTEC/credential'
I1202 06:31:20.240867 30722 slave.cpp:264] Agent using credential for: test-principal
I1202 06:31:20.240891 30722 credentials.hpp:37] Loading credentials for authentication from
'/tmp/Endpoint_SlaveEndpointTest_UnauthorizedRequest_1_eBaTEC/http_credentials'
I1202 06:31:20.241154 30722 http.cpp:975] Creating default 'basic' HTTP authenticator for
realm 'mesos-agent-readonly'
I1202 06:31:20.241302 30722 http.cpp:975] Creating default 'basic' HTTP authenticator for
realm 'mesos-agent-readwrite'
I1202 06:31:20.243194 30722 slave.cpp:531] Agent resources: cpus(*):2; mem(*):1024; disk(*):1024;
ports(*):[31000-32000]
I1202 06:31:20.243300 30722 slave.cpp:539] Agent attributes: [  ]
I1202 06:31:20.243314 30722 slave.cpp:544] Agent hostname: eb6882ed8931
I1202 06:31:20.243463 30723 status_update_manager.cpp:177] Pausing sending status updates
I1202 06:31:20.244829 30734 state.cpp:62] Recovering state from '/tmp/Endpoint_SlaveEndpointTest_UnauthorizedRequest_1_187gLN/meta'
I1202 06:31:20.245270 30733 status_update_manager.cpp:203] Recovering status update manager
I1202 06:31:20.245585 30720 containerizer.cpp:608] Recovering containerizer
I1202 06:31:20.247068 30722 provisioner.cpp:410] Provisioner recovery complete
I1202 06:31:20.247625 30721 slave.cpp:6100] Finished recovery
I1202 06:31:20.248132 30721 slave.cpp:6282] Querying resource estimator for oversubscribable
resources
I1202 06:31:20.248390 30734 slave.cpp:6296] Received oversubscribable resources {} from the
resource estimator
I1202 06:31:20.250936 30730 process.cpp:3741] Handling HTTP event for process 'slave(742)'
with path: '/slave(742)/monitor/statistics.json'
I1202 06:31:20.252614 30723 http.cpp:1115] HTTP GET for /slave(742)/monitor/statistics.json
from 172.17.0.3:51472
I1202 06:31:20.252707 30723 http.cpp:936] Authorizing principal 'test-principal' to GET the
'/monitor/statistics.json' endpoint
I1202 06:31:20.255614 30731 slave.cpp:796] Agent terminating
[       OK ] Endpoint/SlaveEndpointTest.UnauthorizedRequest/1 (35 ms)
[ RUN      ] Endpoint/SlaveEndpointTest.UnauthorizedRequest/2
I1202 06:31:20.272451 30701 containerizer.cpp:221] Using isolation: posix/cpu,posix/mem,filesystem/posix,network/cni
W1202 06:31:20.273087 30701 backend.cpp:76] Failed to create 'aufs' backend: AufsBackend requires
root privileges
W1202 06:31:20.273217 30701 backend.cpp:76] Failed to create 'bind' backend: BindBackend requires
root privileges
I1202 06:31:20.273257 30701 provisioner.cpp:249] Using default backend 'copy'
I1202 06:31:20.277629 30733 slave.cpp:231] Mesos agent started on (743)@172.17.0.3:35305
I1202 06:31:20.277662 30733 slave.cpp:232] Flags at startup: --acls="" --appc_simple_discovery_uri_prefix="http://"
--appc_store_dir="/tmp/mesos/store/appc" --authenticate_http_readonly="true" --authenticate_http_readwrite="true"
--authenticatee="crammd5" --authentication_backoff_factor="1secs" --authorizer="local" --cgroups_cpu_enable_pids_and_tids_count="false"
--cgroups_enable_cfs="false" --cgroups_hierarchy="/sys/fs/cgroup" --cgroups_limit_swap="false"
--cgroups_root="mesos" --container_disk_watch_interval="15secs" --containerizers="mesos" --credential="/tmp/Endpoint_SlaveEndpointTest_UnauthorizedRequest_2_AYBsyU/credential"
--default_role="*" --disk_watch_interval="1mins" --docker="docker" --docker_kill_orphans="true"
--docker_registry="https://registry-1.docker.io" --docker_remove_delay="6hrs" --docker_socket="/var/run/docker.sock"
--docker_stop_timeout="0ns" --docker_store_dir="/tmp/mesos/store/docker" --docker_volume_checkpoint_dir="/var/run/mesos/isolators/docker/volume"
--enforce_container_disk_quota="false" --executor_registration_timeout="1mins" --executor_reregistration_timeout="2secs"
--executor_shutdown_grace_period="5secs" --fetcher_cache_dir="/tmp/Endpoint_SlaveEndpointTest_UnauthorizedRequest_2_AYBsyU/fetch"
--fetcher_cache_size="2GB" --frameworks_home="" --gc_delay="1weeks" --gc_disk_headroom="0.1"
--hadoop_home="" --help="false" --hostname_lookup="true" --http_command_executor="false" --http_credentials="/tmp/Endpoint_SlaveEndpointTest_UnauthorizedRequest_2_AYBsyU/http_credentials"
--http_heartbeat_interval="30secs" --initialize_driver_logging="true" --isolation="posix/cpu,posix/mem"
--launcher="posix" --launcher_dir="/mesos/mesos-1.3.2/_build/src" --logbufsecs="0" --logging_level="INFO"
--max_completed_executors_per_framework="150" --oversubscribed_resources_interval="15secs"
--perf_duration="10secs" --perf_interval="1mins" --port="5051" --qos_correction_interval_min="0ns"
--quiet="false" --recover="reconnect" --recovery_timeout="15mins" --registration_backoff_factor="10ms"
--resources="cpus:2;gpus:0;mem:1024;disk:1024;ports:[31000-32000]" --revocable_cpu_low_priority="true"
--runtime_dir="/tmp/Endpoint_SlaveEndpointTest_UnauthorizedRequest_2_AYBsyU" --sandbox_directory="/mnt/mesos/sandbox"
--strict="true" --switch_user="true" --systemd_enable_support="true" --systemd_runtime_directory="/run/systemd/system"
--version="false" --work_dir="/tmp/Endpoint_SlaveEndpointTest_UnauthorizedRequest_2_5CG5y5"
I1202 06:31:20.278235 30733 credentials.hpp:86] Loading credential for authentication from
'/tmp/Endpoint_SlaveEndpointTest_UnauthorizedRequest_2_AYBsyU/credential'
I1202 06:31:20.278456 30733 slave.cpp:264] Agent using credential for: test-principal
I1202 06:31:20.278498 30733 credentials.hpp:37] Loading credentials for authentication from
'/tmp/Endpoint_SlaveEndpointTest_UnauthorizedRequest_2_AYBsyU/http_credentials'
I1202 06:31:20.278834 30733 http.cpp:975] Creating default 'basic' HTTP authenticator for
realm 'mesos-agent-readonly'
I1202 06:31:20.279021 30733 http.cpp:975] Creating default 'basic' HTTP authenticator for
realm 'mesos-agent-readwrite'
I1202 06:31:20.281005 30733 slave.cpp:531] Agent resources: cpus(*):2; mem(*):1024; disk(*):1024;
ports(*):[31000-32000]
I1202 06:31:20.281116 30733 slave.cpp:539] Agent attributes: [  ]
I1202 06:31:20.281143 30733 slave.cpp:544] Agent hostname: eb6882ed8931
I1202 06:31:20.281334 30731 status_update_manager.cpp:177] Pausing sending status updates
I1202 06:31:20.283107 30725 state.cpp:62] Recovering state from '/tmp/Endpoint_SlaveEndpointTest_UnauthorizedRequest_2_5CG5y5/meta'
I1202 06:31:20.283569 30735 status_update_manager.cpp:203] Recovering status update manager
I1202 06:31:20.283892 30734 containerizer.cpp:608] Recovering containerizer
I1202 06:31:20.285584 30724 provisioner.cpp:410] Provisioner recovery complete
I1202 06:31:20.286026 30735 slave.cpp:6100] Finished recovery
I1202 06:31:20.286622 30735 slave.cpp:6282] Querying resource estimator for oversubscribable
resources
I1202 06:31:20.287019 30720 slave.cpp:6296] Received oversubscribable resources {} from the
resource estimator
I1202 06:31:20.290498 30724 process.cpp:3741] Handling HTTP event for process 'slave(743)'
with path: '/slave(743)/containers'
I1202 06:31:20.291999 30728 http.cpp:1115] HTTP GET for /slave(743)/containers from 172.17.0.3:51473
I1202 06:31:20.292089 30728 http.cpp:936] Authorizing principal 'test-principal' to GET the
'/containers' endpoint
I1202 06:31:20.295326 30725 slave.cpp:796] Agent terminating
[       OK ] Endpoint/SlaveEndpointTest.UnauthorizedRequest/2 (33 ms)
[ RUN      ] Endpoint/SlaveEndpointTest.NoAuthorizer/0
I1202 06:31:20.305301 30701 containerizer.cpp:221] Using isolation: posix/cpu,posix/mem,filesystem/posix,network/cni
W1202 06:31:20.305817 30701 backend.cpp:76] Failed to create 'aufs' backend: AufsBackend requires
root privileges
W1202 06:31:20.305925 30701 backend.cpp:76] Failed to create 'bind' backend: BindBackend requires
root privileges
I1202 06:31:20.305963 30701 provisioner.cpp:249] Using default backend 'copy'
I1202 06:31:20.307479 30701 cluster.cpp:448] Creating default 'local' authorizer
I1202 06:31:20.308933 30729 slave.cpp:231] Mesos agent started on (744)@172.17.0.3:35305
I1202 06:31:20.308953 30729 slave.cpp:232] Flags at startup: --acls="" --appc_simple_discovery_uri_prefix="http://"
--appc_store_dir="/tmp/mesos/store/appc" --authenticate_http_readonly="true" --authenticate_http_readwrite="true"
--authenticatee="crammd5" --authentication_backoff_factor="1secs" --authorizer="local" --cgroups_cpu_enable_pids_and_tids_count="false"
--cgroups_enable_cfs="false" --cgroups_hierarchy="/sys/fs/cgroup" --cgroups_limit_swap="false"
--cgroups_root="mesos" --container_disk_watch_interval="15secs" --containerizers="mesos" --credential="/tmp/Endpoint_SlaveEndpointTest_NoAuthorizer_0_UxmhOc/credential"
--default_role="*" --disk_watch_interval="1mins" --docker="docker" --docker_kill_orphans="true"
--docker_registry="https://registry-1.docker.io" --docker_remove_delay="6hrs" --docker_socket="/var/run/docker.sock"
--docker_stop_timeout="0ns" --docker_store_dir="/tmp/mesos/store/docker" --docker_volume_checkpoint_dir="/var/run/mesos/isolators/docker/volume"
--enforce_container_disk_quota="false" --executor_registration_timeout="1mins" --executor_reregistration_timeout="2secs"
--executor_shutdown_grace_period="5secs" --fetcher_cache_dir="/tmp/Endpoint_SlaveEndpointTest_NoAuthorizer_0_UxmhOc/fetch"
--fetcher_cache_size="2GB" --frameworks_home="" --gc_delay="1weeks" --gc_disk_headroom="0.1"
--hadoop_home="" --help="false" --hostname_lookup="true" --http_command_executor="false" --http_credentials="/tmp/Endpoint_SlaveEndpointTest_NoAuthorizer_0_UxmhOc/http_credentials"
--http_heartbeat_interval="30secs" --initialize_driver_logging="true" --isolation="posix/cpu,posix/mem"
--launcher="posix" --launcher_dir="/mesos/mesos-1.3.2/_build/src" --logbufsecs="0" --logging_level="INFO"
--max_completed_executors_per_framework="150" --oversubscribed_resources_interval="15secs"
--perf_duration="10secs" --perf_interval="1mins" --port="5051" --qos_correction_interval_min="0ns"
--quiet="false" --recover="reconnect" --recovery_timeout="15mins" --registration_backoff_factor="10ms"
--resources="cpus:2;gpus:0;mem:1024;disk:1024;ports:[31000-32000]" --revocable_cpu_low_priority="true"
--runtime_dir="/tmp/Endpoint_SlaveEndpointTest_NoAuthorizer_0_UxmhOc" --sandbox_directory="/mnt/mesos/sandbox"
--strict="true" --switch_user="true" --systemd_enable_support="true" --systemd_runtime_directory="/run/systemd/system"
--version="false" --work_dir="/tmp/Endpoint_SlaveEndpointTest_NoAuthorizer_0_F4NAJn"
I1202 06:31:20.309294 30729 credentials.hpp:86] Loading credential for authentication from
'/tmp/Endpoint_SlaveEndpointTest_NoAuthorizer_0_UxmhOc/credential'
I1202 06:31:20.309432 30729 slave.cpp:264] Agent using credential for: test-principal
I1202 06:31:20.309451 30729 credentials.hpp:37] Loading credentials for authentication from
'/tmp/Endpoint_SlaveEndpointTest_NoAuthorizer_0_UxmhOc/http_credentials'
I1202 06:31:20.309651 30729 http.cpp:975] Creating default 'basic' HTTP authenticator for
realm 'mesos-agent-readonly'
I1202 06:31:20.309778 30729 http.cpp:975] Creating default 'basic' HTTP authenticator for
realm 'mesos-agent-readwrite'
I1202 06:31:20.310956 30729 slave.cpp:531] Agent resources: cpus(*):2; mem(*):1024; disk(*):1024;
ports(*):[31000-32000]
I1202 06:31:20.311031 30729 slave.cpp:539] Agent attributes: [  ]
I1202 06:31:20.311043 30729 slave.cpp:544] Agent hostname: eb6882ed8931
I1202 06:31:20.311218 30732 status_update_manager.cpp:177] Pausing sending status updates
I1202 06:31:20.312486 30728 state.cpp:62] Recovering state from '/tmp/Endpoint_SlaveEndpointTest_NoAuthorizer_0_F4NAJn/meta'
I1202 06:31:20.312986 30722 status_update_manager.cpp:203] Recovering status update manager
I1202 06:31:20.313274 30735 containerizer.cpp:608] Recovering containerizer
I1202 06:31:20.314893 30720 provisioner.cpp:410] Provisioner recovery complete
I1202 06:31:20.315398 30732 slave.cpp:6100] Finished recovery
I1202 06:31:20.315971 30732 slave.cpp:6282] Querying resource estimator for oversubscribable
resources
I1202 06:31:20.316323 30726 slave.cpp:6296] Received oversubscribable resources {} from the
resource estimator
I1202 06:31:20.318907 30727 process.cpp:3741] Handling HTTP event for process 'slave(744)'
with path: '/slave(744)/monitor/statistics'
I1202 06:31:20.320435 30721 http.cpp:1115] HTTP GET for /slave(744)/monitor/statistics from
172.17.0.3:51474
I1202 06:31:20.320544 30721 http.cpp:936] Authorizing principal 'test-principal' to GET the
'/monitor/statistics' endpoint
I1202 06:31:20.324693 30732 slave.cpp:796] Agent terminating
[       OK ] Endpoint/SlaveEndpointTest.NoAuthorizer/0 (30 ms)
[ RUN      ] Endpoint/SlaveEndpointTest.NoAuthorizer/1
I1202 06:31:20.335563 30701 containerizer.cpp:221] Using isolation: posix/cpu,posix/mem,filesystem/posix,network/cni
W1202 06:31:20.336168 30701 backend.cpp:76] Failed to create 'aufs' backend: AufsBackend requires
root privileges
W1202 06:31:20.336277 30701 backend.cpp:76] Failed to create 'bind' backend: BindBackend requires
root privileges
I1202 06:31:20.336318 30701 provisioner.cpp:249] Using default backend 'copy'
I1202 06:31:20.338438 30701 cluster.cpp:448] Creating default 'local' authorizer
I1202 06:31:20.340399 30721 slave.cpp:231] Mesos agent started on (745)@172.17.0.3:35305
I1202 06:31:20.340427 30721 slave.cpp:232] Flags at startup: --acls="" --appc_simple_discovery_uri_prefix="http://"
--appc_store_dir="/tmp/mesos/store/appc" --authenticate_http_readonly="true" --authenticate_http_readwrite="true"
--authenticatee="crammd5" --authentication_backoff_factor="1secs" --authorizer="local" --cgroups_cpu_enable_pids_and_tids_count="false"
--cgroups_enable_cfs="false" --cgroups_hierarchy="/sys/fs/cgroup" --cgroups_limit_swap="false"
--cgroups_root="mesos" --container_disk_watch_interval="15secs" --containerizers="mesos" --credential="/tmp/Endpoint_SlaveEndpointTest_NoAuthorizer_1_ERPynv/credential"
--default_role="*" --disk_watch_interval="1mins" --docker="docker" --docker_kill_orphans="true"
--docker_registry="https://registry-1.docker.io" --docker_remove_delay="6hrs" --docker_socket="/var/run/docker.sock"
--docker_stop_timeout="0ns" --docker_store_dir="/tmp/mesos/store/docker" --docker_volume_checkpoint_dir="/var/run/mesos/isolators/docker/volume"
--enforce_container_disk_quota="false" --executor_registration_timeout="1mins" --executor_reregistration_timeout="2secs"
--executor_shutdown_grace_period="5secs" --fetcher_cache_dir="/tmp/Endpoint_SlaveEndpointTest_NoAuthorizer_1_ERPynv/fetch"
--fetcher_cache_size="2GB" --frameworks_home="" --gc_delay="1weeks" --gc_disk_headroom="0.1"
--hadoop_home="" --help="false" --hostname_lookup="true" --http_command_executor="false" --http_credentials="/tmp/Endpoint_SlaveEndpointTest_NoAuthorizer_1_ERPynv/http_credentials"
--http_heartbeat_interval="30secs" --initialize_driver_logging="true" --isolation="posix/cpu,posix/mem"
--launcher="posix" --launcher_dir="/mesos/mesos-1.3.2/_build/src" --logbufsecs="0" --logging_level="INFO"
--max_completed_executors_per_framework="150" --oversubscribed_resources_interval="15secs"
--perf_duration="10secs" --perf_interval="1mins" --port="5051" --qos_correction_interval_min="0ns"
--quiet="false" --recover="reconnect" --recovery_timeout="15mins" --registration_backoff_factor="10ms"
--resources="cpus:2;gpus:0;mem:1024;disk:1024;ports:[31000-32000]" --revocable_cpu_low_priority="true"
--runtime_dir="/tmp/Endpoint_SlaveEndpointTest_NoAuthorizer_1_ERPynv" --sandbox_directory="/mnt/mesos/sandbox"
--strict="true" --switch_user="true" --systemd_enable_support="true" --systemd_runtime_directory="/run/systemd/system"
--version="false" --work_dir="/tmp/Endpoint_SlaveEndpointTest_NoAuthorizer_1_vRoYdG"
I1202 06:31:20.340997 30721 credentials.hpp:86] Loading credential for authentication from
'/tmp/Endpoint_SlaveEndpointTest_NoAuthorizer_1_ERPynv/credential'
I1202 06:31:20.341182 30721 slave.cpp:264] Agent using credential for: test-principal
I1202 06:31:20.341207 30721 credentials.hpp:37] Loading credentials for authentication from
'/tmp/Endpoint_SlaveEndpointTest_NoAuthorizer_1_ERPynv/http_credentials'
I1202 06:31:20.341490 30721 http.cpp:975] Creating default 'basic' HTTP authenticator for
realm 'mesos-agent-readonly'
I1202 06:31:20.341655 30721 http.cpp:975] Creating default 'basic' HTTP authenticator for
realm 'mesos-agent-readwrite'
I1202 06:31:20.343250 30721 slave.cpp:531] Agent resources: cpus(*):2; mem(*):1024; disk(*):1024;
ports(*):[31000-32000]
I1202 06:31:20.343356 30721 slave.cpp:539] Agent attributes: [  ]
I1202 06:31:20.343372 30721 slave.cpp:544] Agent hostname: eb6882ed8931
I1202 06:31:20.343617 30724 status_update_manager.cpp:177] Pausing sending status updates
I1202 06:31:20.345103 30729 state.cpp:62] Recovering state from '/tmp/Endpoint_SlaveEndpointTest_NoAuthorizer_1_vRoYdG/meta'
I1202 06:31:20.345648 30734 status_update_manager.cpp:203] Recovering status update manager
I1202 06:31:20.346036 30720 containerizer.cpp:608] Recovering containerizer
I1202 06:31:20.347662 30727 provisioner.cpp:410] Provisioner recovery complete
I1202 06:31:20.348151 30721 slave.cpp:6100] Finished recovery
I1202 06:31:20.348700 30721 slave.cpp:6282] Querying resource estimator for oversubscribable
resources
I1202 06:31:20.349299 30722 slave.cpp:6296] Received oversubscribable resources {} from the
resource estimator
I1202 06:31:20.351835 30729 process.cpp:3741] Handling HTTP event for process 'slave(745)'
with path: '/slave(745)/monitor/statistics.json'
I1202 06:31:20.353204 30734 http.cpp:1115] HTTP GET for /slave(745)/monitor/statistics.json
from 172.17.0.3:51475
I1202 06:31:20.353293 30734 http.cpp:936] Authorizing principal 'test-principal' to GET the
'/monitor/statistics.json' endpoint
I1202 06:31:20.356568 30728 slave.cpp:796] Agent terminating
[       OK ] Endpoint/SlaveEndpointTest.NoAuthorizer/1 (30 ms)
[ RUN      ] Endpoint/SlaveEndpointTest.NoAuthorizer/2
I1202 06:31:20.365963 30701 containerizer.cpp:221] Using isolation: posix/cpu,posix/mem,filesystem/posix,network/cni
W1202 06:31:20.366525 30701 backend.cpp:76] Failed to create 'aufs' backend: AufsBackend requires
root privileges
W1202 06:31:20.366610 30701 backend.cpp:76] Failed to create 'bind' backend: BindBackend requires
root privileges
I1202 06:31:20.366636 30701 provisioner.cpp:249] Using default backend 'copy'
I1202 06:31:20.368584 30701 cluster.cpp:448] Creating default 'local' authorizer
I1202 06:31:20.370633 30720 slave.cpp:231] Mesos agent started on (746)@172.17.0.3:35305
I1202 06:31:20.370661 30720 slave.cpp:232] Flags at startup: --acls="" --appc_simple_discovery_uri_prefix="http://"
--appc_store_dir="/tmp/mesos/store/appc" --authenticate_http_readonly="true" --authenticate_http_readwrite="true"
--authenticatee="crammd5" --authentication_backoff_factor="1secs" --authorizer="local" --cgroups_cpu_enable_pids_and_tids_count="false"
--cgroups_enable_cfs="false" --cgroups_hierarchy="/sys/fs/cgroup" --cgroups_limit_swap="false"
--cgroups_root="mesos" --container_disk_watch_interval="15secs" --containerizers="mesos" --credential="/tmp/Endpoint_SlaveEndpointTest_NoAuthorizer_2_AqPbhO/credential"
--default_role="*" --disk_watch_interval="1mins" --docker="docker" --docker_kill_orphans="true"
--docker_registry="https://registry-1.docker.io" --docker_remove_delay="6hrs" --docker_socket="/var/run/docker.sock"
--docker_stop_timeout="0ns" --docker_store_dir="/tmp/mesos/store/docker" --docker_volume_checkpoint_dir="/var/run/mesos/isolators/docker/volume"
--enforce_container_disk_quota="false" --executor_registration_timeout="1mins" --executor_reregistration_timeout="2secs"
--executor_shutdown_grace_period="5secs" --fetcher_cache_dir="/tmp/Endpoint_SlaveEndpointTest_NoAuthorizer_2_AqPbhO/fetch"
--fetcher_cache_size="2GB" --frameworks_home="" --gc_delay="1weeks" --gc_disk_headroom="0.1"
--hadoop_home="" --help="false" --hostname_lookup="true" --http_command_executor="false" --http_credentials="/tmp/Endpoint_SlaveEndpointTest_NoAuthorizer_2_AqPbhO/http_credentials"
--http_heartbeat_interval="30secs" --initialize_driver_logging="true" --isolation="posix/cpu,posix/mem"
--launcher="posix" --launcher_dir="/mesos/mesos-1.3.2/_build/src" --logbufsecs="0" --logging_level="INFO"
--max_completed_executors_per_framework="150" --oversubscribed_resources_interval="15secs"
--perf_duration="10secs" --perf_interval="1mins" --port="5051" --qos_correction_interval_min="0ns"
--quiet="false" --recover="reconnect" --recovery_timeout="15mins" --registration_backoff_factor="10ms"
--resources="cpus:2;gpus:0;mem:1024;disk:1024;ports:[31000-32000]" --revocable_cpu_low_priority="true"
--runtime_dir="/tmp/Endpoint_SlaveEndpointTest_NoAuthorizer_2_AqPbhO" --sandbox_directory="/mnt/mesos/sandbox"
--strict="true" --switch_user="true" --systemd_enable_support="true" --systemd_runtime_directory="/run/systemd/system"
--version="false" --work_dir="/tmp/Endpoint_SlaveEndpointTest_NoAuthorizer_2_hsRC2Y"
I1202 06:31:20.371191 30720 credentials.hpp:86] Loading credential for authentication from
'/tmp/Endpoint_SlaveEndpointTest_NoAuthorizer_2_AqPbhO/credential'
I1202 06:31:20.371412 30720 slave.cpp:264] Agent using credential for: test-principal
I1202 06:31:20.371449 30720 credentials.hpp:37] Loading credentials for authentication from
'/tmp/Endpoint_SlaveEndpointTest_NoAuthorizer_2_AqPbhO/http_credentials'
I1202 06:31:20.371773 30720 http.cpp:975] Creating default 'basic' HTTP authenticator for
realm 'mesos-agent-readonly'
I1202 06:31:20.371930 30720 http.cpp:975] Creating default 'basic' HTTP authenticator for
realm 'mesos-agent-readwrite'
I1202 06:31:20.373548 30720 slave.cpp:531] Agent resources: cpus(*):2; mem(*):1024; disk(*):1024;
ports(*):[31000-32000]
I1202 06:31:20.373626 30720 slave.cpp:539] Agent attributes: [  ]
I1202 06:31:20.373636 30720 slave.cpp:544] Agent hostname: eb6882ed8931
I1202 06:31:20.373836 30721 status_update_manager.cpp:177] Pausing sending status updates
I1202 06:31:20.374735 30732 state.cpp:62] Recovering state from '/tmp/Endpoint_SlaveEndpointTest_NoAuthorizer_2_hsRC2Y/meta'
I1202 06:31:20.375430 30735 status_update_manager.cpp:203] Recovering status update manager
I1202 06:31:20.375682 30722 containerizer.cpp:608] Recovering containerizer
I1202 06:31:20.376924 30726 provisioner.cpp:410] Provisioner recovery complete
I1202 06:31:20.377306 30729 slave.cpp:6100] Finished recovery
I1202 06:31:20.377729 30729 slave.cpp:6282] Querying resource estimator for oversubscribable
resources
I1202 06:31:20.377990 30721 slave.cpp:6296] Received oversubscribable resources {} from the
resource estimator
I1202 06:31:20.379958 30723 process.cpp:3741] Handling HTTP event for process 'slave(746)'
with path: '/slave(746)/containers'
I1202 06:31:20.381127 30729 http.cpp:1115] HTTP GET for /slave(746)/containers from 172.17.0.3:51476
I1202 06:31:20.381208 30729 http.cpp:936] Authorizing principal 'test-principal' to GET the
'/containers' endpoint
I1202 06:31:20.384562 30725 slave.cpp:796] Agent terminating
[       OK ] Endpoint/SlaveEndpointTest.NoAuthorizer/2 (30 ms)
[----------] 9 tests from Endpoint/SlaveEndpointTest (289 ms total)

[----------] Global test environment tear-down
[==========] 1570 tests from 175 test cases ran. (457503 ms total)
[  PASSED  ] 1569 tests.
[  FAILED  ] 1 test, listed below:
[  FAILED  ] RegisterSlaveValidationTest.DropInvalidReregistration

 1 FAILED TEST
  YOU HAVE 22 DISABLED TESTS

E1202 06:31:20.447672 30736 process.cpp:956] Failed to accept socket: future discarded
make[4]: *** [check-local] Error 1
make[4]: Leaving directory `/mesos/mesos-1.3.2/_build/src'
make[3]: *** [check-am] Error 2
make[3]: Leaving directory `/mesos/mesos-1.3.2/_build/src'
make[2]: *** [check] Error 2
make[2]: Leaving directory `/mesos/mesos-1.3.2/_build/src'
make[1]: *** [check-recursive] Error 1
make[1]: Leaving directory `/mesos/mesos-1.3.2/_build'
make: *** [distcheck] Error 1
+ docker rmi mesos-1512193230-27448
Untagged: mesos-1512193230-27448:latest
Deleted: sha256:2b6bdbcc19910c231e10687a143aac2cf5f62b9e36adf690f131e4973f6888a7
Deleted: sha256:a06898695cb2e765e279708938d3b4b6e2a3a2188f4c786d31ae75b098a6ffbe
Deleted: sha256:9a2832bb2e2251bf07d6ffccd6d87273271df4497e3b14583004ce58b60dee16
Deleted: sha256:c990dd15280d0ef740df48220c653be0f1b7480582523c533e46ecf1c12cfeaa
Deleted: sha256:6854bd0f027dde5e15fd2a03642d64da2f52251c4efe1636eea15c82a63ea48d
Deleted: sha256:f5c2527923805e564522b9036de8802b1df3e893d3cb176a5f49f7a7d11bc91c
Deleted: sha256:7027cbf31514f27d09b4c755ff8b38c393870ef9dd536b9a022aa03ef59ed8ff
Deleted: sha256:938316dd47f2c46ee89109affc04edb07b5e45ceb47a26d7e943ec3384f08501
Deleted: sha256:e5d939271562c022f10006f93ba0c5d0a936455fa04101b4d3873a39f8b95f0c
Deleted: sha256:22dacbebbecc3fdada6a31f442b6955f16eae7e34068abd615e2efc5e7819bfd
Deleted: sha256:8a446c284543e8ccbed70eeee15d27ae163e4a2584daef8efa067100447f71b2
Deleted: sha256:5aa071f8667292441e8b505db77344da2a760a24d2b8f5a7d840d3cc5475ef43
Deleted: sha256:1f229241b1f83335a20bf6f9d68f3ddca2a4c45671baff084d2b87e3cb61b0ff
Deleted: sha256:893819f02c63391ebdadfb0b3fc684d56879b07e03d06e86acab5025bceec39e
Deleted: sha256:6b00e5ff2a92acfb152395893f6fd6df537f4620fdab9df5aa453a5c697fc119
Deleted: sha256:b8eca95066041df6f8e71ad638009021293b2bdf1afa2e1a6b51c1ecdf8d7131
Deleted: sha256:199e7b4e6bdf21eada99b7d977393bcdb5219633ce9d7fb3fc37c6814b5a16b1
Deleted: sha256:93aacdce2674110fe6c474c564bf83dd35f0adc99d1ebd52af50029005418523
Deleted: sha256:c47ca9177c57bd7810f30fc24e96dfbf56dc6eb24a5edde8ad8b328f6b6276e6
Deleted: sha256:950c81799433d43a37a06af94881a2727e415a011463ba8c57135a65c78c9efc
Deleted: sha256:28e88e44459c0756de10bb0a4d87a209cb893e28bbb4c3527f2922c07138ba89
Deleted: sha256:618b389ec828ceb2d95659a6f8e340818c3b6a8099ab89d73d67f49fe3efca46
Deleted: sha256:d8b4a9f2c938d1896bd74b159be7903d3918cb932f8a564069b555f62b65e781
Deleted: sha256:74a4ae270e477f16f64d46abeca45fa834aba93d8bcb17febcfb13ef6df22068
Build step 'Execute shell' marked build as failure
Not sending mail to unregistered user yujie.jay@gmail.com
Not sending mail to unregistered user xujyan@apple.com


Mime
View raw message