mesos-builds mailing list archives

Site index · List index
Message view « Date » · « Thread »
Top « Date » · « Thread »
From Apache Jenkins Server <jenk...@builds.apache.org>
Subject Build failed in Jenkins: Mesos-Reviewbot #20920
Date Sun, 31 Dec 2017 11:52:35 GMT
See <https://builds.apache.org/job/Mesos-Reviewbot/20920/display/redirect>

------------------------------------------
[...truncated 211.49 KB...]
checking whether -lc should be explicitly linked in... no
checking dynamic linker characteristics... GNU/Linux ld.so
checking how to hardcode library paths into programs... immediate
checking whether stripping libraries is possible... yes
checking if libtool supports shared libraries... yes
checking whether to build shared libraries... yes
checking whether to build static libraries... no
checking how to run the C++ preprocessor... g++ -E
checking for ld used by g++... /usr/bin/ld -m elf_x86_64
checking if the linker (/usr/bin/ld -m elf_x86_64) is GNU ld... yes
checking whether the g++ linker (/usr/bin/ld -m elf_x86_64) supports shared libraries... yes
checking for g++ option to produce PIC... -fPIC -DPIC
checking if g++ PIC flag -fPIC -DPIC works... yes
checking if g++ static flag -static works... yes
checking if g++ supports -c -o file.o... yes
checking if g++ supports -c -o file.o... (cached) yes
checking whether the g++ linker (/usr/bin/ld -m elf_x86_64) supports shared libraries... yes
checking dynamic linker characteristics... (cached) GNU/Linux ld.so
checking how to hardcode library paths into programs... immediate
configure: creating ./config.lt
config.lt: creating libtool
configure: Setting up CXXFLAGS for g++ version >= 4.8
checking whether C++ compiler accepts -fstack-protector-strong... no
checking whether g++ supports C++11 features by default... no
checking whether g++ supports C++11 features with -std=c++11... yes
checking if compiler needs -Werror to reject unknown flags... no
checking for the pthreads library -lpthreads... no
checking whether pthreads work without any flags... no
checking whether pthreads work with -Kthread... no
checking whether pthreads work with -kthread... no
checking for the pthreads library -llthread... no
checking whether pthreads work with -pthread... yes
checking for joinable pthread attribute... PTHREAD_CREATE_JOINABLE
checking if more special flags are required for pthreads... no
checking for PTHREAD_PRIO_INHERIT... yes
configure: Setting up build environment for x86_64 linux-gnu
checking for backtrace in -lunwind... no
checking for main in -lgflags... no
checking for patch... patch
checking fts.h usability... yes
checking fts.h presence... yes
checking for fts.h... yes
checking for library containing fts_close... none required
checking apr_pools.h usability... yes
checking apr_pools.h presence... yes
checking for apr_pools.h... yes
checking for apr_initialize in -lapr-1... yes
checking for curl_global_init in -lcurl... yes
checking for javac... /usr/bin/javac
checking for java... /usr/bin/java
checking value of Java system property 'java.home'... /usr/lib/jvm/java-7-openjdk-amd64/jre
configure: using JAVA_HOME=/usr/lib/jvm/java-7-openjdk-amd64
checking whether or not we can build with JNI... yes
checking for mvn... /usr/bin/mvn
checking for sasl_done in -lsasl2... yes
checking SASL CRAM-MD5 support... yes
checking for RAND_poll in -lcrypto... yes
checking openssl/ssl.h usability... yes
checking openssl/ssl.h presence... yes
checking for openssl/ssl.h... yes
checking for SSL_CTX_new in -lssl... yes
checking svn_version.h usability... yes
checking svn_version.h presence... yes
checking for svn_version.h... yes
checking for svn_stringbuf_create_ensure in -lsvn_subr-1... yes
checking svn_delta.h usability... yes
checking svn_delta.h presence... yes
checking for svn_delta.h... yes
checking for svn_txdelta in -lsvn_delta-1... yes
checking whether to enable the XFS disk isolator... no
checking zlib.h usability... yes
checking zlib.h presence... yes
checking for zlib.h... yes
checking for deflate, gzread, gzwrite, inflate in -lz... yes
checking C++ standard library for undefined behaviour with selected optimization level...
no
checking for a Python interpreter with version >= 2.6... python
checking for python... /usr/bin/python
checking for python version... 2.7
checking for python platform... linux2
checking for python script directory... ${prefix}/lib/python2.7/site-packages
checking for python extension module directory... ${exec_prefix}/lib/python2.7/site-packages
checking for python2.7... (cached) /usr/bin/python
checking for a version of Python >= '2.1.0'... yes
checking for a version of Python >= '2.6'... yes
checking for the distutils Python package... yes
checking for Python include path... -I/usr/include/python2.7
checking for Python library path... -L/usr/lib -lpython2.7
checking for Python site-packages path... /usr/lib/python2.7/dist-packages
checking python extra libraries... -lpthread -ldl  -lutil -lm
checking python extra linking flags... -Xlinker -export-dynamic -Wl,-O1 -Wl,-Bsymbolic-functions
checking consistency of all components of python development environment... yes
checking whether we can build usable Python eggs... cc1plus: warning: command line option
'-Wstrict-prototypes' is valid for C/ObjC but not for C++ [enabled by default]
yes
checking for an old installation of the Mesos egg (before 0.20.0)... no
checking that generated files are newer than configure... done
configure: creating ./config.status
config.status: creating Makefile
config.status: creating mesos.pc
config.status: creating src/Makefile
config.status: creating 3rdparty/Makefile
config.status: creating 3rdparty/libprocess/Makefile
config.status: creating 3rdparty/libprocess/include/Makefile
config.status: creating 3rdparty/stout/Makefile
config.status: creating 3rdparty/stout/include/Makefile
config.status: creating 3rdparty/gmock_sources.cc
config.status: creating bin/mesos.sh
config.status: creating bin/mesos-agent.sh
config.status: creating bin/mesos-local.sh
config.status: creating bin/mesos-master.sh
config.status: creating bin/mesos-slave.sh
config.status: creating bin/mesos-tests.sh
config.status: creating bin/mesos-agent-flags.sh
config.status: creating bin/mesos-local-flags.sh
config.status: creating bin/mesos-master-flags.sh
config.status: creating bin/mesos-slave-flags.sh
config.status: creating bin/mesos-tests-flags.sh
config.status: creating bin/gdb-mesos-agent.sh
config.status: creating bin/gdb-mesos-local.sh
config.status: creating bin/gdb-mesos-master.sh
config.status: creating bin/gdb-mesos-slave.sh
config.status: creating bin/gdb-mesos-tests.sh
config.status: creating bin/lldb-mesos-agent.sh
config.status: creating bin/lldb-mesos-local.sh
config.status: creating bin/lldb-mesos-master.sh
config.status: creating bin/lldb-mesos-slave.sh
config.status: creating bin/lldb-mesos-tests.sh
config.status: creating bin/valgrind-mesos-agent.sh
config.status: creating bin/valgrind-mesos-local.sh
config.status: creating bin/valgrind-mesos-master.sh
config.status: creating bin/valgrind-mesos-slave.sh
config.status: creating bin/valgrind-mesos-tests.sh
config.status: creating src/deploy/mesos-daemon.sh
config.status: creating src/deploy/mesos-start-agents.sh
config.status: creating src/deploy/mesos-start-cluster.sh
config.status: creating src/deploy/mesos-start-masters.sh
config.status: creating src/deploy/mesos-start-slaves.sh
config.status: creating src/deploy/mesos-stop-agents.sh
config.status: creating src/deploy/mesos-stop-cluster.sh
config.status: creating src/deploy/mesos-stop-masters.sh
config.status: creating src/deploy/mesos-stop-slaves.sh
config.status: creating include/mesos/version.hpp
config.status: creating src/java/generated/org/apache/mesos/MesosNativeLibrary.java
config.status: creating mpi/mpiexec-mesos
config.status: creating src/examples/java/test-exception-framework
config.status: creating src/examples/java/test-executor
config.status: creating src/examples/java/test-framework
config.status: creating src/examples/java/test-multiple-executors-framework
config.status: creating src/examples/java/test-log
config.status: creating src/examples/java/v1-test-framework
config.status: creating src/java/mesos.pom
config.status: creating src/examples/python/test-executor
config.status: creating src/examples/python/test-framework
config.status: creating src/python/setup.py
config.status: creating src/python/cli/setup.py
config.status: creating src/python/interface/setup.py
config.status: creating src/python/native_common/ext_modules.py
config.status: creating src/python/executor/setup.py
config.status: creating src/python/native/setup.py
config.status: creating src/python/scheduler/setup.py
config.status: linking src/python/native_common/ext_modules.py to src/python/executor/ext_modules.py
config.status: linking src/python/native_common/ext_modules.py to src/python/scheduler/ext_modules.py
config.status: executing depfiles commands
config.status: executing libtool commands
configure: Build option summary:
    CXX:        g++
    CXXFLAGS:   -g1 -O0 -Wno-unused-local-typedefs -std=c++11
    CPPFLAGS:   -isystem /usr/include/subversion-1 -isystem /usr/include/apr-1 -isystem /usr/include/apr-1.0
      
    LDFLAGS:    
    LIBS:       -lz -lsvn_delta-1 -lsvn_subr-1 -lsasl2 -lcurl -lapr-1  -lrt

make  dist-gzip am__post_remove_distdir='@:'
make[1]: Entering directory `/mesos'
if test -d "mesos-1.5.0"; then find "mesos-1.5.0" -type d ! -perm -200 -exec chmod u+w {}
';' && rm -rf "mesos-1.5.0" || { sleep 5 && rm -rf "mesos-1.5.0"; }; else
:; fi
test -d "mesos-1.5.0" || mkdir "mesos-1.5.0"
 (cd 3rdparty && make  top_distdir=../mesos-1.5.0 distdir=../mesos-1.5.0/3rdparty
\
     am__remove_distdir=: am__skip_length_check=: am__skip_mode_fix=: distdir)
make[2]: Entering directory `/mesos/3rdparty'
 (cd stout && make  top_distdir=../../mesos-1.5.0 distdir=../../mesos-1.5.0/3rdparty/stout
\
     am__remove_distdir=: am__skip_length_check=: am__skip_mode_fix=: distdir)
make[3]: Entering directory `/mesos/3rdparty/stout'
 (cd include && make  top_distdir=../../../mesos-1.5.0 distdir=../../../mesos-1.5.0/3rdparty/stout/include
\
     am__remove_distdir=: am__skip_length_check=: am__skip_mode_fix=: distdir)
make[4]: Entering directory `/mesos/3rdparty/stout/include'
make[4]: Leaving directory `/mesos/3rdparty/stout/include'
make  \
	  top_distdir="../../mesos-1.5.0" distdir="../../mesos-1.5.0/3rdparty/stout" \
	  dist-hook
make[4]: Entering directory `/mesos/3rdparty/stout'
cp -r ./3rdparty ../../mesos-1.5.0/3rdparty/stout/
make[4]: Leaving directory `/mesos/3rdparty/stout'
make[3]: Leaving directory `/mesos/3rdparty/stout'
 (cd libprocess && make  top_distdir=../../mesos-1.5.0 distdir=../../mesos-1.5.0/3rdparty/libprocess
\
     am__remove_distdir=: am__skip_length_check=: am__skip_mode_fix=: distdir)
make[3]: Entering directory `/mesos/3rdparty/libprocess'
 (cd include && make  top_distdir=../../../mesos-1.5.0 distdir=../../../mesos-1.5.0/3rdparty/libprocess/include
\
     am__remove_distdir=: am__skip_length_check=: am__skip_mode_fix=: distdir)
make[4]: Entering directory `/mesos/3rdparty/libprocess/include'
make[4]: Leaving directory `/mesos/3rdparty/libprocess/include'
make  \
	  top_distdir="../../mesos-1.5.0" distdir="../../mesos-1.5.0/3rdparty/libprocess" \
	  dist-hook
make[4]: Entering directory `/mesos/3rdparty/libprocess'
cp -r ./3rdparty ../../mesos-1.5.0/3rdparty/libprocess/
make[4]: Leaving directory `/mesos/3rdparty/libprocess'
make[3]: Leaving directory `/mesos/3rdparty/libprocess'
make[2]: Leaving directory `/mesos/3rdparty'
 (cd src && make  top_distdir=../mesos-1.5.0 distdir=../mesos-1.5.0/src \
     am__remove_distdir=: am__skip_length_check=: am__skip_mode_fix=: distdir)
make[2]: Entering directory `/mesos/src'
../3rdparty/protobuf-3.5.0/src/protoc -I../include -I.  --cpp_out=. resource_provider/storage/volume_profile.proto
/bin/bash: ../3rdparty/protobuf-3.5.0/src/protoc: No such file or directory
make[2]: *** [resource_provider/storage/volume_profile.pb.h] Error 127
make[2]: Leaving directory `/mesos/src'
make[1]: *** [distdir] Error 1
make[1]: Leaving directory `/mesos'
make: *** [dist] Error 2
+ docker rmi mesos-1514720543-1773
Untagged: mesos-1514720543-1773:latest
Deleted: sha256:5ee6f2c9c0e08b89169eb303bb2071daa843464a448d296e8d45bb1264d9a92b
Deleted: sha256:47a53b591bb8498fd535afd226d313219690e78ebc317682c1e6735ef3c2305d
Deleted: sha256:e1b3c63c3a847562bc4e07b3e89d7621627f6ef2ed0754ab27b4ab391b88b7e8
Deleted: sha256:792bbf8765255d74a6e208911f56dd42fe66d8ac454e75b28999292f65bd3a4e
Deleted: sha256:b60fb337ed2f79840ff6760536ca732ad369705b3de2bc8a63fdc69cda839841
Deleted: sha256:735d3220425357fe8db58fd6e8c4d8d8b10ff5b4eabad3fb758c7f5d16b2e89b
Deleted: sha256:ded969c59354f43f7e87835c0155293ee568580d732523450e982ad72ab7f76c
Deleted: sha256:1ae928015c39c89d9a3a894105b22fc8163f077e3453c767b7da3df2238e9b42
Deleted: sha256:6a93274bb4194f7bc237808836cc29a5ad110db9a1868ecfc3c06ba6b4bc7156
Deleted: sha256:076a569229dea00fa04372560478de87b7c9e34e09e835a1afe78782975c6c28
Deleted: sha256:dcb32f459868092cf844752b7acf89b863d02c6daf1039f5724a1b6ffc8f8c88
Deleted: sha256:e3593b58b3213ccdbb8971d75a70dc55c384f88914ef279da6fb7878f1c05902
Deleted: sha256:c0235d1300a9d95682ce8426170d0285d19c171462dfda30736b131e3c6403bc
Deleted: sha256:a96802b2294948e9ece8369bafa8a163e84b570e80df482cbe43ed8a3e995986
Deleted: sha256:0e6e5ed942cf4047373f79bd6ba5c8d53929dc282de3dbeded3cf6a35c84f425
Deleted: sha256:ad0d67d0e065342d575be82e38b93873f79dbb6ac2efaf0830e4d4b130102646
Deleted: sha256:d7c4173768ed07d5706a2b03cd59f7f8a1964158e26624921d47d3dff116b051
Deleted: sha256:3c0d3b0777b9d60bcd4b468a77f123a57d1f0eff30e23dcea34be06c52d3c660
Deleted: sha256:11c556f64a7e445f52b4336976d072b9a44a2a6b04e3b6dee6502d1a33f7b0ea
Deleted: sha256:1a174fc719a825475aa35aafb2603e0dd0c4596db386a9a11423dd0a5278a94c
Deleted: sha256:cc365dab2ace93b0cf14cd276c8babd458c2d97512e6d6f6d2b35a28414b7685
Deleted: sha256:64847528dc0aa69ee9af88e8e5d3c32609b6e9226625af5d54f7f71f47df7af4
Deleted: sha256:c23458f70835681ef2d5a8fd1bf1a98f50d3b9d1d45444b2a3fec905be5e94d8
Deleted: sha256:e5b7d65c3c52238fda5296fca702d83a4fd22746e2e39ab9928035495b37120d
Deleted: sha256:71faccd75e8a38d139616522e0e61be0b44054326c52acefeb38c0318d856999
Deleted: sha256:4f59cd0fc8e6b50a002d07d7d68a426849d88084eedee198f36b9775c4560f19
Deleted: sha256:f913a5993d1f31661b76227b91e62831884de97d5328fe0af7a876858278d2eb
Deleted: sha256:031198f6ce08963e56c740ffb0c76ecb8faed87beb0e9cb4caff47710a2c8432
Deleted: sha256:91bb7bbc84aec3ce6a8d8a9d7790229e70784b5d8336ec397f5d65ace03553a7
Deleted: sha256:8f4b6a8a7bb83bb062685ec23b07484b8572d9b8c4d92f7c39afe2a8f75da975
Build step 'Execute shell' marked build as failure

Mime
View raw message