mesos-builds mailing list archives

Site index · List index
Message view « Date » · « Thread »
Top « Date » · « Thread »
From Apache Jenkins Server <jenk...@builds.apache.org>
Subject Build failed in Jenkins: Mesos-Buildbot » autotools,gcc,--verbose --disable-libtool-wrappers,GLOG_v=1 MESOS_VERBOSE=1,centos:7,(ubuntu)&&(!ubuntu-us1)&&(!ubuntu-eu2)&&(!qnode3)&&(!H23) #4658
Date Fri, 22 Dec 2017 15:02:36 GMT
See <https://builds.apache.org/job/Mesos-Buildbot/BUILDTOOL=autotools,COMPILER=gcc,CONFIGURATION=--verbose%20--disable-libtool-wrappers,ENVIRONMENT=GLOG_v=1%20MESOS_VERBOSE=1,OS=centos%3A7,label_exp=(ubuntu)&&(!ubuntu-us1)&&(!ubuntu-eu2)&&(!qnode3)&&(!H23)/4658/display/redirect?page=changes>

Changes:

[alexr] Promoted log level to warning for disconnected events in exec.cpp.

[alexr] Ensured command executor always honors shutdown request.

[alexr] Ensured executor adapter propagates error and shutdown messages.

[alexr] Terminated driver-based executors if kill arrives before launch task.

[alexr] Fixed 1.4.x CHANGELOG.

[alexr] Added MESOS-8297 to the 1.4.2 CHANGELOG.

------------------------------------------
[...truncated 30.87 MB...]
I1222 15:02:03.930641  6645 slave.cpp:573] Agent attributes: [  ]
I1222 15:02:03.930675  6645 slave.cpp:582] Agent hostname: 9fef5df5369d
I1222 15:02:03.930975  6628 status_update_manager.cpp:177] Pausing sending status updates
I1222 15:02:03.934767  6630 state.cpp:64] Recovering state from '/tmp/Endpoint_SlaveEndpointTest_AuthorizedRequest_2_7Fianx/meta'
I1222 15:02:03.935271  6639 status_update_manager.cpp:203] Recovering status update manager
I1222 15:02:03.935601  6635 containerizer.cpp:609] Recovering containerizer
I1222 15:02:03.937667  6643 provisioner.cpp:416] Provisioner recovery complete
I1222 15:02:03.938199  6631 slave.cpp:6288] Finished recovery
I1222 15:02:03.938733  6631 slave.cpp:6470] Querying resource estimator for oversubscribable
resources
I1222 15:02:03.939141  6629 slave.cpp:6484] Received oversubscribable resources {} from the
resource estimator
I1222 15:02:03.944156  6636 process.cpp:3938] Handling HTTP event for process 'slave(796)'
with path: '/slave(796)/containers'
I1222 15:02:03.946108  6642 http.cpp:1185] HTTP GET for /slave(796)/containers from 172.17.0.3:60608
I1222 15:02:03.946228  6642 http.cpp:976] Authorizing principal 'test-principal' to GET the
'/containers' endpoint
I1222 15:02:03.951526  6606 slave.cpp:843] Agent terminating
[       OK ] Endpoint/SlaveEndpointTest.AuthorizedRequest/2 (53 ms)
[ RUN      ] Endpoint/SlaveEndpointTest.UnauthorizedRequest/0
I1222 15:02:03.968755  6606 containerizer.cpp:246] Using isolation: posix/cpu,posix/mem,filesystem/posix,network/cni,environment_secret
W1222 15:02:03.969497  6606 backend.cpp:76] Failed to create 'aufs' backend: AufsBackend requires
root privileges
W1222 15:02:03.969661  6606 backend.cpp:76] Failed to create 'bind' backend: BindBackend requires
root privileges
I1222 15:02:03.969710  6606 provisioner.cpp:255] Using default backend 'copy'
I1222 15:02:03.974782  6639 slave.cpp:250] Mesos agent started on (797)@172.17.0.3:46323
I1222 15:02:03.974823  6639 slave.cpp:251] Flags at startup: --acls="" --appc_simple_discovery_uri_prefix="http://"
--appc_store_dir="/tmp/Endpoint_SlaveEndpointTest_UnauthorizedRequest_0_Kiqse7/store/appc"
--authenticate_http_readonly="true" --authenticate_http_readwrite="true" --authenticatee="crammd5"
--authentication_backoff_factor="1secs" --authorizer="local" --cgroups_cpu_enable_pids_and_tids_count="false"
--cgroups_enable_cfs="false" --cgroups_hierarchy="/sys/fs/cgroup" --cgroups_limit_swap="false"
--cgroups_root="mesos" --container_disk_watch_interval="15secs" --containerizers="mesos" --credential="/tmp/Endpoint_SlaveEndpointTest_UnauthorizedRequest_0_Kiqse7/credential"
--default_role="*" --disallow_sharing_agent_pid_namespace="false" --disk_watch_interval="1mins"
--docker="docker" --docker_kill_orphans="true" --docker_registry="https://registry-1.docker.io"
--docker_remove_delay="6hrs" --docker_socket="/var/run/docker.sock" --docker_stop_timeout="0ns"
--docker_store_dir="/tmp/Endpoint_SlaveEndpointTest_UnauthorizedRequest_0_Kiqse7/store/docker"
--docker_volume_checkpoint_dir="/var/run/mesos/isolators/docker/volume" --enforce_container_disk_quota="false"
--executor_registration_timeout="1mins" --executor_reregistration_timeout="2secs" --executor_shutdown_grace_period="5secs"
--fetcher_cache_dir="/tmp/Endpoint_SlaveEndpointTest_UnauthorizedRequest_0_Kiqse7/fetch" --fetcher_cache_size="2GB"
--frameworks_home="" --gc_delay="1weeks" --gc_disk_headroom="0.1" --hadoop_home="" --help="false"
--hostname_lookup="true" --http_command_executor="false" --http_credentials="/tmp/Endpoint_SlaveEndpointTest_UnauthorizedRequest_0_Kiqse7/http_credentials"
--http_heartbeat_interval="30secs" --initialize_driver_logging="true" --isolation="posix/cpu,posix/mem"
--launcher="posix" --launcher_dir="/mesos/mesos-1.4.2/_build/src" --logbufsecs="0" --logging_level="INFO"
--max_completed_executors_per_framework="150" --oversubscribed_resources_interval="15secs"
--perf_duration="10secs" --perf_interval="1mins" --port="5051" --qos_correction_interval_min="0ns"
--quiet="false" --recover="reconnect" --recovery_timeout="15mins" --registration_backoff_factor="10ms"
--resources="cpus:2;gpus:0;mem:1024;disk:1024;ports:[31000-32000]" --revocable_cpu_low_priority="true"
--runtime_dir="/tmp/Endpoint_SlaveEndpointTest_UnauthorizedRequest_0_Kiqse7" --sandbox_directory="/mnt/mesos/sandbox"
--strict="true" --switch_user="true" --systemd_enable_support="true" --systemd_runtime_directory="/run/systemd/system"
--version="false" --work_dir="/tmp/Endpoint_SlaveEndpointTest_UnauthorizedRequest_0_wJYDCN"
I1222 15:02:03.975368  6639 credentials.hpp:86] Loading credential for authentication from
'/tmp/Endpoint_SlaveEndpointTest_UnauthorizedRequest_0_Kiqse7/credential'
I1222 15:02:03.975594  6639 slave.cpp:283] Agent using credential for: test-principal
I1222 15:02:03.975627  6639 credentials.hpp:37] Loading credentials for authentication from
'/tmp/Endpoint_SlaveEndpointTest_UnauthorizedRequest_0_Kiqse7/http_credentials'
I1222 15:02:03.975963  6639 http.cpp:1045] Creating default 'basic' HTTP authenticator for
realm 'mesos-agent-readonly'
I1222 15:02:03.976191  6639 http.cpp:1045] Creating default 'basic' HTTP authenticator for
realm 'mesos-agent-readwrite'
I1222 15:02:03.978060  6639 slave.cpp:565] Agent resources: [{"name":"cpus","scalar":{"value":2.0},"type":"SCALAR"},{"name":"mem","scalar":{"value":1024.0},"type":"SCALAR"},{"name":"disk","scalar":{"value":1024.0},"type":"SCALAR"},{"name":"ports","ranges":{"range":[{"begin":31000,"end":32000}]},"type":"RANGES"}]
I1222 15:02:03.978368  6639 slave.cpp:573] Agent attributes: [  ]
I1222 15:02:03.978387  6639 slave.cpp:582] Agent hostname: 9fef5df5369d
I1222 15:02:03.978652  6633 status_update_manager.cpp:177] Pausing sending status updates
I1222 15:02:03.980633  6630 state.cpp:64] Recovering state from '/tmp/Endpoint_SlaveEndpointTest_UnauthorizedRequest_0_wJYDCN/meta'
I1222 15:02:03.981089  6648 status_update_manager.cpp:203] Recovering status update manager
I1222 15:02:03.981348  6631 containerizer.cpp:609] Recovering containerizer
I1222 15:02:03.983507  6635 provisioner.cpp:416] Provisioner recovery complete
I1222 15:02:03.984174  6633 slave.cpp:6288] Finished recovery
I1222 15:02:03.984939  6633 slave.cpp:6470] Querying resource estimator for oversubscribable
resources
I1222 15:02:03.985395  6641 slave.cpp:6484] Received oversubscribable resources {} from the
resource estimator
I1222 15:02:03.989493  6640 process.cpp:3938] Handling HTTP event for process 'slave(797)'
with path: '/slave(797)/monitor/statistics'
I1222 15:02:03.991698  6634 http.cpp:1185] HTTP GET for /slave(797)/monitor/statistics from
172.17.0.3:60610
I1222 15:02:03.991823  6634 http.cpp:976] Authorizing principal 'test-principal' to GET the
'/monitor/statistics' endpoint
I1222 15:02:03.995812  6606 slave.cpp:843] Agent terminating
[       OK ] Endpoint/SlaveEndpointTest.UnauthorizedRequest/0 (42 ms)
[ RUN      ] Endpoint/SlaveEndpointTest.UnauthorizedRequest/1
I1222 15:02:04.011600  6606 containerizer.cpp:246] Using isolation: posix/cpu,posix/mem,filesystem/posix,network/cni,environment_secret
W1222 15:02:04.012348  6606 backend.cpp:76] Failed to create 'aufs' backend: AufsBackend requires
root privileges
W1222 15:02:04.012552  6606 backend.cpp:76] Failed to create 'bind' backend: BindBackend requires
root privileges
I1222 15:02:04.012601  6606 provisioner.cpp:255] Using default backend 'copy'
I1222 15:02:04.017711  6626 slave.cpp:250] Mesos agent started on (798)@172.17.0.3:46323
I1222 15:02:04.017755  6626 slave.cpp:251] Flags at startup: --acls="" --appc_simple_discovery_uri_prefix="http://"
--appc_store_dir="/tmp/Endpoint_SlaveEndpointTest_UnauthorizedRequest_1_f1ri0n/store/appc"
--authenticate_http_readonly="true" --authenticate_http_readwrite="true" --authenticatee="crammd5"
--authentication_backoff_factor="1secs" --authorizer="local" --cgroups_cpu_enable_pids_and_tids_count="false"
--cgroups_enable_cfs="false" --cgroups_hierarchy="/sys/fs/cgroup" --cgroups_limit_swap="false"
--cgroups_root="mesos" --container_disk_watch_interval="15secs" --containerizers="mesos" --credential="/tmp/Endpoint_SlaveEndpointTest_UnauthorizedRequest_1_f1ri0n/credential"
--default_role="*" --disallow_sharing_agent_pid_namespace="false" --disk_watch_interval="1mins"
--docker="docker" --docker_kill_orphans="true" --docker_registry="https://registry-1.docker.io"
--docker_remove_delay="6hrs" --docker_socket="/var/run/docker.sock" --docker_stop_timeout="0ns"
--docker_store_dir="/tmp/Endpoint_SlaveEndpointTest_UnauthorizedRequest_1_f1ri0n/store/docker"
--docker_volume_checkpoint_dir="/var/run/mesos/isolators/docker/volume" --enforce_container_disk_quota="false"
--executor_registration_timeout="1mins" --executor_reregistration_timeout="2secs" --executor_shutdown_grace_period="5secs"
--fetcher_cache_dir="/tmp/Endpoint_SlaveEndpointTest_UnauthorizedRequest_1_f1ri0n/fetch" --fetcher_cache_size="2GB"
--frameworks_home="" --gc_delay="1weeks" --gc_disk_headroom="0.1" --hadoop_home="" --help="false"
--hostname_lookup="true" --http_command_executor="false" --http_credentials="/tmp/Endpoint_SlaveEndpointTest_UnauthorizedRequest_1_f1ri0n/http_credentials"
--http_heartbeat_interval="30secs" --initialize_driver_logging="true" --isolation="posix/cpu,posix/mem"
--launcher="posix" --launcher_dir="/mesos/mesos-1.4.2/_build/src" --logbufsecs="0" --logging_level="INFO"
--max_completed_executors_per_framework="150" --oversubscribed_resources_interval="15secs"
--perf_duration="10secs" --perf_interval="1mins" --port="5051" --qos_correction_interval_min="0ns"
--quiet="false" --recover="reconnect" --recovery_timeout="15mins" --registration_backoff_factor="10ms"
--resources="cpus:2;gpus:0;mem:1024;disk:1024;ports:[31000-32000]" --revocable_cpu_low_priority="true"
--runtime_dir="/tmp/Endpoint_SlaveEndpointTest_UnauthorizedRequest_1_f1ri0n" --sandbox_directory="/mnt/mesos/sandbox"
--strict="true" --switch_user="true" --systemd_enable_support="true" --systemd_runtime_directory="/run/systemd/system"
--version="false" --work_dir="/tmp/Endpoint_SlaveEndpointTest_UnauthorizedRequest_1_dADpi4"
I1222 15:02:04.018463  6626 credentials.hpp:86] Loading credential for authentication from
'/tmp/Endpoint_SlaveEndpointTest_UnauthorizedRequest_1_f1ri0n/credential'
I1222 15:02:04.018740  6626 slave.cpp:283] Agent using credential for: test-principal
I1222 15:02:04.018780  6626 credentials.hpp:37] Loading credentials for authentication from
'/tmp/Endpoint_SlaveEndpointTest_UnauthorizedRequest_1_f1ri0n/http_credentials'
I1222 15:02:04.019172  6626 http.cpp:1045] Creating default 'basic' HTTP authenticator for
realm 'mesos-agent-readonly'
I1222 15:02:04.019438  6626 http.cpp:1045] Creating default 'basic' HTTP authenticator for
realm 'mesos-agent-readwrite'
I1222 15:02:04.021682  6626 slave.cpp:565] Agent resources: [{"name":"cpus","scalar":{"value":2.0},"type":"SCALAR"},{"name":"mem","scalar":{"value":1024.0},"type":"SCALAR"},{"name":"disk","scalar":{"value":1024.0},"type":"SCALAR"},{"name":"ports","ranges":{"range":[{"begin":31000,"end":32000}]},"type":"RANGES"}]
I1222 15:02:04.022061  6626 slave.cpp:573] Agent attributes: [  ]
I1222 15:02:04.022083  6626 slave.cpp:582] Agent hostname: 9fef5df5369d
I1222 15:02:04.022312  6637 status_update_manager.cpp:177] Pausing sending status updates
I1222 15:02:04.024699  6632 state.cpp:64] Recovering state from '/tmp/Endpoint_SlaveEndpointTest_UnauthorizedRequest_1_dADpi4/meta'
I1222 15:02:04.025122  6632 status_update_manager.cpp:203] Recovering status update manager
I1222 15:02:04.025403  6631 containerizer.cpp:609] Recovering containerizer
I1222 15:02:04.027308  6642 provisioner.cpp:416] Provisioner recovery complete
I1222 15:02:04.027834  6625 slave.cpp:6288] Finished recovery
I1222 15:02:04.028393  6625 slave.cpp:6470] Querying resource estimator for oversubscribable
resources
I1222 15:02:04.028784  6640 slave.cpp:6484] Received oversubscribable resources {} from the
resource estimator
I1222 15:02:04.032515  6639 process.cpp:3938] Handling HTTP event for process 'slave(798)'
with path: '/slave(798)/monitor/statistics.json'
I1222 15:02:04.034348  6633 http.cpp:1185] HTTP GET for /slave(798)/monitor/statistics.json
from 172.17.0.3:60612
I1222 15:02:04.034447  6633 http.cpp:976] Authorizing principal 'test-principal' to GET the
'/monitor/statistics.json' endpoint
I1222 15:02:04.037513  6606 slave.cpp:843] Agent terminating
[       OK ] Endpoint/SlaveEndpointTest.UnauthorizedRequest/1 (41 ms)
[ RUN      ] Endpoint/SlaveEndpointTest.UnauthorizedRequest/2
I1222 15:02:04.052574  6606 containerizer.cpp:246] Using isolation: posix/cpu,posix/mem,filesystem/posix,network/cni,environment_secret
W1222 15:02:04.053426  6606 backend.cpp:76] Failed to create 'aufs' backend: AufsBackend requires
root privileges
W1222 15:02:04.053608  6606 backend.cpp:76] Failed to create 'bind' backend: BindBackend requires
root privileges
I1222 15:02:04.053665  6606 provisioner.cpp:255] Using default backend 'copy'
I1222 15:02:04.059268  6647 slave.cpp:250] Mesos agent started on (799)@172.17.0.3:46323
I1222 15:02:04.059309  6647 slave.cpp:251] Flags at startup: --acls="" --appc_simple_discovery_uri_prefix="http://"
--appc_store_dir="/tmp/Endpoint_SlaveEndpointTest_UnauthorizedRequest_2_UQGY9E/store/appc"
--authenticate_http_readonly="true" --authenticate_http_readwrite="true" --authenticatee="crammd5"
--authentication_backoff_factor="1secs" --authorizer="local" --cgroups_cpu_enable_pids_and_tids_count="false"
--cgroups_enable_cfs="false" --cgroups_hierarchy="/sys/fs/cgroup" --cgroups_limit_swap="false"
--cgroups_root="mesos" --container_disk_watch_interval="15secs" --containerizers="mesos" --credential="/tmp/Endpoint_SlaveEndpointTest_UnauthorizedRequest_2_UQGY9E/credential"
--default_role="*" --disallow_sharing_agent_pid_namespace="false" --disk_watch_interval="1mins"
--docker="docker" --docker_kill_orphans="true" --docker_registry="https://registry-1.docker.io"
--docker_remove_delay="6hrs" --docker_socket="/var/run/docker.sock" --docker_stop_timeout="0ns"
--docker_store_dir="/tmp/Endpoint_SlaveEndpointTest_UnauthorizedRequest_2_UQGY9E/store/docker"
--docker_volume_checkpoint_dir="/var/run/mesos/isolators/docker/volume" --enforce_container_disk_quota="false"
--executor_registration_timeout="1mins" --executor_reregistration_timeout="2secs" --executor_shutdown_grace_period="5secs"
--fetcher_cache_dir="/tmp/Endpoint_SlaveEndpointTest_UnauthorizedRequest_2_UQGY9E/fetch" --fetcher_cache_size="2GB"
--frameworks_home="" --gc_delay="1weeks" --gc_disk_headroom="0.1" --hadoop_home="" --help="false"
--hostname_lookup="true" --http_command_executor="false" --http_credentials="/tmp/Endpoint_SlaveEndpointTest_UnauthorizedRequest_2_UQGY9E/http_credentials"
--http_heartbeat_interval="30secs" --initialize_driver_logging="true" --isolation="posix/cpu,posix/mem"
--launcher="posix" --launcher_dir="/mesos/mesos-1.4.2/_build/src" --logbufsecs="0" --logging_level="INFO"
--max_completed_executors_per_framework="150" --oversubscribed_resources_interval="15secs"
--perf_duration="10secs" --perf_interval="1mins" --port="5051" --qos_correction_interval_min="0ns"
--quiet="false" --recover="reconnect" --recovery_timeout="15mins" --registration_backoff_factor="10ms"
--resources="cpus:2;gpus:0;mem:1024;disk:1024;ports:[31000-32000]" --revocable_cpu_low_priority="true"
--runtime_dir="/tmp/Endpoint_SlaveEndpointTest_UnauthorizedRequest_2_UQGY9E" --sandbox_directory="/mnt/mesos/sandbox"
--strict="true" --switch_user="true" --systemd_enable_support="true" --systemd_runtime_directory="/run/systemd/system"
--version="false" --work_dir="/tmp/Endpoint_SlaveEndpointTest_UnauthorizedRequest_2_D1Qdml"
I1222 15:02:04.059875  6647 credentials.hpp:86] Loading credential for authentication from
'/tmp/Endpoint_SlaveEndpointTest_UnauthorizedRequest_2_UQGY9E/credential'
I1222 15:02:04.060108  6647 slave.cpp:283] Agent using credential for: test-principal
I1222 15:02:04.060149  6647 credentials.hpp:37] Loading credentials for authentication from
'/tmp/Endpoint_SlaveEndpointTest_UnauthorizedRequest_2_UQGY9E/http_credentials'
I1222 15:02:04.060555  6647 http.cpp:1045] Creating default 'basic' HTTP authenticator for
realm 'mesos-agent-readonly'
I1222 15:02:04.060824  6647 http.cpp:1045] Creating default 'basic' HTTP authenticator for
realm 'mesos-agent-readwrite'
I1222 15:02:04.063200  6647 slave.cpp:565] Agent resources: [{"name":"cpus","scalar":{"value":2.0},"type":"SCALAR"},{"name":"mem","scalar":{"value":1024.0},"type":"SCALAR"},{"name":"disk","scalar":{"value":1024.0},"type":"SCALAR"},{"name":"ports","ranges":{"range":[{"begin":31000,"end":32000}]},"type":"RANGES"}]
I1222 15:02:04.063597  6647 slave.cpp:573] Agent attributes: [  ]
I1222 15:02:04.063621  6647 slave.cpp:582] Agent hostname: 9fef5df5369d
I1222 15:02:04.063894  6644 status_update_manager.cpp:177] Pausing sending status updates
I1222 15:02:04.066545  6643 state.cpp:64] Recovering state from '/tmp/Endpoint_SlaveEndpointTest_UnauthorizedRequest_2_D1Qdml/meta'
I1222 15:02:04.067054  6633 status_update_manager.cpp:203] Recovering status update manager
I1222 15:02:04.067409  6626 containerizer.cpp:609] Recovering containerizer
I1222 15:02:04.069731  6646 provisioner.cpp:416] Provisioner recovery complete
I1222 15:02:04.070456  6639 slave.cpp:6288] Finished recovery
I1222 15:02:04.071149  6639 slave.cpp:6470] Querying resource estimator for oversubscribable
resources
I1222 15:02:04.071552  6648 slave.cpp:6484] Received oversubscribable resources {} from the
resource estimator
I1222 15:02:04.075536  6638 process.cpp:3938] Handling HTTP event for process 'slave(799)'
with path: '/slave(799)/containers'
I1222 15:02:04.077602  6629 http.cpp:1185] HTTP GET for /slave(799)/containers from 172.17.0.3:60614
I1222 15:02:04.077739  6629 http.cpp:976] Authorizing principal 'test-principal' to GET the
'/containers' endpoint
I1222 15:02:04.081346  6640 slave.cpp:843] Agent terminating
[       OK ] Endpoint/SlaveEndpointTest.UnauthorizedRequest/2 (45 ms)
[ RUN      ] Endpoint/SlaveEndpointTest.NoAuthorizer/0
I1222 15:02:04.100554  6606 containerizer.cpp:246] Using isolation: posix/cpu,posix/mem,filesystem/posix,network/cni,environment_secret
W1222 15:02:04.101366  6606 backend.cpp:76] Failed to create 'aufs' backend: AufsBackend requires
root privileges
W1222 15:02:04.101547  6606 backend.cpp:76] Failed to create 'bind' backend: BindBackend requires
root privileges
I1222 15:02:04.101600  6606 provisioner.cpp:255] Using default backend 'copy'
I1222 15:02:04.104532  6606 cluster.cpp:448] Creating default 'local' authorizer
I1222 15:02:04.107656  6647 slave.cpp:250] Mesos agent started on (800)@172.17.0.3:46323
I1222 15:02:04.107702  6647 slave.cpp:251] Flags at startup: --acls="" --appc_simple_discovery_uri_prefix="http://"
--appc_store_dir="/tmp/Endpoint_SlaveEndpointTest_NoAuthorizer_0_tNsuJW/store/appc" --authenticate_http_readonly="true"
--authenticate_http_readwrite="true" --authenticatee="crammd5" --authentication_backoff_factor="1secs"
--authorizer="local" --cgroups_cpu_enable_pids_and_tids_count="false" --cgroups_enable_cfs="false"
--cgroups_hierarchy="/sys/fs/cgroup" --cgroups_limit_swap="false" --cgroups_root="mesos" --container_disk_watch_interval="15secs"
--containerizers="mesos" --credential="/tmp/Endpoint_SlaveEndpointTest_NoAuthorizer_0_tNsuJW/credential"
--default_role="*" --disallow_sharing_agent_pid_namespace="false" --disk_watch_interval="1mins"
--docker="docker" --docker_kill_orphans="true" --docker_registry="https://registry-1.docker.io"
--docker_remove_delay="6hrs" --docker_socket="/var/run/docker.sock" --docker_stop_timeout="0ns"
--docker_store_dir="/tmp/Endpoint_SlaveEndpointTest_NoAuthorizer_0_tNsuJW/store/docker" --docker_volume_checkpoint_dir="/var/run/mesos/isolators/docker/volume"
--enforce_container_disk_quota="false" --executor_registration_timeout="1mins" --executor_reregistration_timeout="2secs"
--executor_shutdown_grace_period="5secs" --fetcher_cache_dir="/tmp/Endpoint_SlaveEndpointTest_NoAuthorizer_0_tNsuJW/fetch"
--fetcher_cache_size="2GB" --frameworks_home="" --gc_delay="1weeks" --gc_disk_headroom="0.1"
--hadoop_home="" --help="false" --hostname_lookup="true" --http_command_executor="false" --http_credentials="/tmp/Endpoint_SlaveEndpointTest_NoAuthorizer_0_tNsuJW/http_credentials"
--http_heartbeat_interval="30secs" --initialize_driver_logging="true" --isolation="posix/cpu,posix/mem"
--launcher="posix" --launcher_dir="/mesos/mesos-1.4.2/_build/src" --logbufsecs="0" --logging_level="INFO"
--max_completed_executors_per_framework="150" --oversubscribed_resources_interval="15secs"
--perf_duration="10secs" --perf_interval="1mins" --port="5051" --qos_correction_interval_min="0ns"
--quiet="false" --recover="reconnect" --recovery_timeout="15mins" --registration_backoff_factor="10ms"
--resources="cpus:2;gpus:0;mem:1024;disk:1024;ports:[31000-32000]" --revocable_cpu_low_priority="true"
--runtime_dir="/tmp/Endpoint_SlaveEndpointTest_NoAuthorizer_0_tNsuJW" --sandbox_directory="/mnt/mesos/sandbox"
--strict="true" --switch_user="true" --systemd_enable_support="true" --systemd_runtime_directory="/run/systemd/system"
--version="false" --work_dir="/tmp/Endpoint_SlaveEndpointTest_NoAuthorizer_0_bUD6OC"
I1222 15:02:04.108283  6647 credentials.hpp:86] Loading credential for authentication from
'/tmp/Endpoint_SlaveEndpointTest_NoAuthorizer_0_tNsuJW/credential'
I1222 15:02:04.108559  6647 slave.cpp:283] Agent using credential for: test-principal
I1222 15:02:04.108597  6647 credentials.hpp:37] Loading credentials for authentication from
'/tmp/Endpoint_SlaveEndpointTest_NoAuthorizer_0_tNsuJW/http_credentials'
I1222 15:02:04.108932  6647 http.cpp:1045] Creating default 'basic' HTTP authenticator for
realm 'mesos-agent-readonly'
I1222 15:02:04.109151  6647 http.cpp:1045] Creating default 'basic' HTTP authenticator for
realm 'mesos-agent-readwrite'
I1222 15:02:04.111083  6647 slave.cpp:565] Agent resources: [{"name":"cpus","scalar":{"value":2.0},"type":"SCALAR"},{"name":"mem","scalar":{"value":1024.0},"type":"SCALAR"},{"name":"disk","scalar":{"value":1024.0},"type":"SCALAR"},{"name":"ports","ranges":{"range":[{"begin":31000,"end":32000}]},"type":"RANGES"}]
I1222 15:02:04.111421  6647 slave.cpp:573] Agent attributes: [  ]
I1222 15:02:04.111441  6647 slave.cpp:582] Agent hostname: 9fef5df5369d
I1222 15:02:04.111688  6636 status_update_manager.cpp:177] Pausing sending status updates
I1222 15:02:04.113806  6626 state.cpp:64] Recovering state from '/tmp/Endpoint_SlaveEndpointTest_NoAuthorizer_0_bUD6OC/meta'
I1222 15:02:04.114240  6640 status_update_manager.cpp:203] Recovering status update manager
I1222 15:02:04.114580  6638 containerizer.cpp:609] Recovering containerizer
I1222 15:02:04.116693  6641 provisioner.cpp:416] Provisioner recovery complete
I1222 15:02:04.117270  6637 slave.cpp:6288] Finished recovery
I1222 15:02:04.117841  6637 slave.cpp:6470] Querying resource estimator for oversubscribable
resources
I1222 15:02:04.118171  6645 slave.cpp:6484] Received oversubscribable resources {} from the
resource estimator
I1222 15:02:04.121584  6644 process.cpp:3938] Handling HTTP event for process 'slave(800)'
with path: '/slave(800)/monitor/statistics'
I1222 15:02:04.123486  6627 http.cpp:1185] HTTP GET for /slave(800)/monitor/statistics from
172.17.0.3:60616
I1222 15:02:04.123594  6627 http.cpp:976] Authorizing principal 'test-principal' to GET the
'/monitor/statistics' endpoint
I1222 15:02:04.128554  6633 slave.cpp:843] Agent terminating
[       OK ] Endpoint/SlaveEndpointTest.NoAuthorizer/0 (44 ms)
[ RUN      ] Endpoint/SlaveEndpointTest.NoAuthorizer/1
I1222 15:02:04.142850  6606 containerizer.cpp:246] Using isolation: posix/cpu,posix/mem,filesystem/posix,network/cni,environment_secret
W1222 15:02:04.143489  6606 backend.cpp:76] Failed to create 'aufs' backend: AufsBackend requires
root privileges
W1222 15:02:04.143625  6606 backend.cpp:76] Failed to create 'bind' backend: BindBackend requires
root privileges
I1222 15:02:04.143667  6606 provisioner.cpp:255] Using default backend 'copy'
I1222 15:02:04.145931  6606 cluster.cpp:448] Creating default 'local' authorizer
I1222 15:02:04.148351  6645 slave.cpp:250] Mesos agent started on (801)@172.17.0.3:46323
I1222 15:02:04.148383  6645 slave.cpp:251] Flags at startup: --acls="" --appc_simple_discovery_uri_prefix="http://"
--appc_store_dir="/tmp/Endpoint_SlaveEndpointTest_NoAuthorizer_1_yCNoIe/store/appc" --authenticate_http_readonly="true"
--authenticate_http_readwrite="true" --authenticatee="crammd5" --authentication_backoff_factor="1secs"
--authorizer="local" --cgroups_cpu_enable_pids_and_tids_count="false" --cgroups_enable_cfs="false"
--cgroups_hierarchy="/sys/fs/cgroup" --cgroups_limit_swap="false" --cgroups_root="mesos" --container_disk_watch_interval="15secs"
--containerizers="mesos" --credential="/tmp/Endpoint_SlaveEndpointTest_NoAuthorizer_1_yCNoIe/credential"
--default_role="*" --disallow_sharing_agent_pid_namespace="false" --disk_watch_interval="1mins"
--docker="docker" --docker_kill_orphans="true" --docker_registry="https://registry-1.docker.io"
--docker_remove_delay="6hrs" --docker_socket="/var/run/docker.sock" --docker_stop_timeout="0ns"
--docker_store_dir="/tmp/Endpoint_SlaveEndpointTest_NoAuthorizer_1_yCNoIe/store/docker" --docker_volume_checkpoint_dir="/var/run/mesos/isolators/docker/volume"
--enforce_container_disk_quota="false" --executor_registration_timeout="1mins" --executor_reregistration_timeout="2secs"
--executor_shutdown_grace_period="5secs" --fetcher_cache_dir="/tmp/Endpoint_SlaveEndpointTest_NoAuthorizer_1_yCNoIe/fetch"
--fetcher_cache_size="2GB" --frameworks_home="" --gc_delay="1weeks" --gc_disk_headroom="0.1"
--hadoop_home="" --help="false" --hostname_lookup="true" --http_command_executor="false" --http_credentials="/tmp/Endpoint_SlaveEndpointTest_NoAuthorizer_1_yCNoIe/http_credentials"
--http_heartbeat_interval="30secs" --initialize_driver_logging="true" --isolation="posix/cpu,posix/mem"
--launcher="posix" --launcher_dir="/mesos/mesos-1.4.2/_build/src" --logbufsecs="0" --logging_level="INFO"
--max_completed_executors_per_framework="150" --oversubscribed_resources_interval="15secs"
--perf_duration="10secs" --perf_interval="1mins" --port="5051" --qos_correction_interval_min="0ns"
--quiet="false" --recover="reconnect" --recovery_timeout="15mins" --registration_backoff_factor="10ms"
--resources="cpus:2;gpus:0;mem:1024;disk:1024;ports:[31000-32000]" --revocable_cpu_low_priority="true"
--runtime_dir="/tmp/Endpoint_SlaveEndpointTest_NoAuthorizer_1_yCNoIe" --sandbox_directory="/mnt/mesos/sandbox"
--strict="true" --switch_user="true" --systemd_enable_support="true" --systemd_runtime_directory="/run/systemd/system"
--version="false" --work_dir="/tmp/Endpoint_SlaveEndpointTest_NoAuthorizer_1_DtUOHU"
I1222 15:02:04.148867  6645 credentials.hpp:86] Loading credential for authentication from
'/tmp/Endpoint_SlaveEndpointTest_NoAuthorizer_1_yCNoIe/credential'
I1222 15:02:04.149047  6645 slave.cpp:283] Agent using credential for: test-principal
I1222 15:02:04.149075  6645 credentials.hpp:37] Loading credentials for authentication from
'/tmp/Endpoint_SlaveEndpointTest_NoAuthorizer_1_yCNoIe/http_credentials'
I1222 15:02:04.149343  6645 http.cpp:1045] Creating default 'basic' HTTP authenticator for
realm 'mesos-agent-readonly'
I1222 15:02:04.149521  6645 http.cpp:1045] Creating default 'basic' HTTP authenticator for
realm 'mesos-agent-readwrite'
I1222 15:02:04.151062  6645 slave.cpp:565] Agent resources: [{"name":"cpus","scalar":{"value":2.0},"type":"SCALAR"},{"name":"mem","scalar":{"value":1024.0},"type":"SCALAR"},{"name":"disk","scalar":{"value":1024.0},"type":"SCALAR"},{"name":"ports","ranges":{"range":[{"begin":31000,"end":32000}]},"type":"RANGES"}]
I1222 15:02:04.151332  6645 slave.cpp:573] Agent attributes: [  ]
I1222 15:02:04.151347  6645 slave.cpp:582] Agent hostname: 9fef5df5369d
I1222 15:02:04.151520  6640 status_update_manager.cpp:177] Pausing sending status updates
I1222 15:02:04.153065  6648 state.cpp:64] Recovering state from '/tmp/Endpoint_SlaveEndpointTest_NoAuthorizer_1_DtUOHU/meta'
I1222 15:02:04.153540  6625 status_update_manager.cpp:203] Recovering status update manager
I1222 15:02:04.153849  6632 containerizer.cpp:609] Recovering containerizer
I1222 15:02:04.155483  6634 provisioner.cpp:416] Provisioner recovery complete
I1222 15:02:04.155871  6635 slave.cpp:6288] Finished recovery
I1222 15:02:04.156358  6635 slave.cpp:6470] Querying resource estimator for oversubscribable
resources
I1222 15:02:04.156810  6641 slave.cpp:6484] Received oversubscribable resources {} from the
resource estimator
I1222 15:02:04.160157  6632 process.cpp:3938] Handling HTTP event for process 'slave(801)'
with path: '/slave(801)/monitor/statistics.json'
I1222 15:02:04.161872  6628 http.cpp:1185] HTTP GET for /slave(801)/monitor/statistics.json
from 172.17.0.3:60618
I1222 15:02:04.161962  6628 http.cpp:976] Authorizing principal 'test-principal' to GET the
'/monitor/statistics.json' endpoint
I1222 15:02:04.166034  6606 slave.cpp:843] Agent terminating
[       OK ] Endpoint/SlaveEndpointTest.NoAuthorizer/1 (36 ms)
[ RUN      ] Endpoint/SlaveEndpointTest.NoAuthorizer/2
I1222 15:02:04.179177  6606 containerizer.cpp:246] Using isolation: posix/cpu,posix/mem,filesystem/posix,network/cni,environment_secret
W1222 15:02:04.179715  6606 backend.cpp:76] Failed to create 'aufs' backend: AufsBackend requires
root privileges
W1222 15:02:04.179841  6606 backend.cpp:76] Failed to create 'bind' backend: BindBackend requires
root privileges
I1222 15:02:04.179877  6606 provisioner.cpp:255] Using default backend 'copy'
I1222 15:02:04.181807  6606 cluster.cpp:448] Creating default 'local' authorizer
I1222 15:02:04.184032  6639 slave.cpp:250] Mesos agent started on (802)@172.17.0.3:46323
I1222 15:02:04.184061  6639 slave.cpp:251] Flags at startup: --acls="" --appc_simple_discovery_uri_prefix="http://"
--appc_store_dir="/tmp/Endpoint_SlaveEndpointTest_NoAuthorizer_2_i9Fx2w/store/appc" --authenticate_http_readonly="true"
--authenticate_http_readwrite="true" --authenticatee="crammd5" --authentication_backoff_factor="1secs"
--authorizer="local" --cgroups_cpu_enable_pids_and_tids_count="false" --cgroups_enable_cfs="false"
--cgroups_hierarchy="/sys/fs/cgroup" --cgroups_limit_swap="false" --cgroups_root="mesos" --container_disk_watch_interval="15secs"
--containerizers="mesos" --credential="/tmp/Endpoint_SlaveEndpointTest_NoAuthorizer_2_i9Fx2w/credential"
--default_role="*" --disallow_sharing_agent_pid_namespace="false" --disk_watch_interval="1mins"
--docker="docker" --docker_kill_orphans="true" --docker_registry="https://registry-1.docker.io"
--docker_remove_delay="6hrs" --docker_socket="/var/run/docker.sock" --docker_stop_timeout="0ns"
--docker_store_dir="/tmp/Endpoint_SlaveEndpointTest_NoAuthorizer_2_i9Fx2w/store/docker" --docker_volume_checkpoint_dir="/var/run/mesos/isolators/docker/volume"
--enforce_container_disk_quota="false" --executor_registration_timeout="1mins" --executor_reregistration_timeout="2secs"
--executor_shutdown_grace_period="5secs" --fetcher_cache_dir="/tmp/Endpoint_SlaveEndpointTest_NoAuthorizer_2_i9Fx2w/fetch"
--fetcher_cache_size="2GB" --frameworks_home="" --gc_delay="1weeks" --gc_disk_headroom="0.1"
--hadoop_home="" --help="false" --hostname_lookup="true" --http_command_executor="false" --http_credentials="/tmp/Endpoint_SlaveEndpointTest_NoAuthorizer_2_i9Fx2w/http_credentials"
--http_heartbeat_interval="30secs" --initialize_driver_logging="true" --isolation="posix/cpu,posix/mem"
--launcher="posix" --launcher_dir="/mesos/mesos-1.4.2/_build/src" --logbufsecs="0" --logging_level="INFO"
--max_completed_executors_per_framework="150" --oversubscribed_resources_interval="15secs"
--perf_duration="10secs" --perf_interval="1mins" --port="5051" --qos_correction_interval_min="0ns"
--quiet="false" --recover="reconnect" --recovery_timeout="15mins" --registration_backoff_factor="10ms"
--resources="cpus:2;gpus:0;mem:1024;disk:1024;ports:[31000-32000]" --revocable_cpu_low_priority="true"
--runtime_dir="/tmp/Endpoint_SlaveEndpointTest_NoAuthorizer_2_i9Fx2w" --sandbox_directory="/mnt/mesos/sandbox"
--strict="true" --switch_user="true" --systemd_enable_support="true" --systemd_runtime_directory="/run/systemd/system"
--version="false" --work_dir="/tmp/Endpoint_SlaveEndpointTest_NoAuthorizer_2_LvtJWc"
I1222 15:02:04.184516  6639 credentials.hpp:86] Loading credential for authentication from
'/tmp/Endpoint_SlaveEndpointTest_NoAuthorizer_2_i9Fx2w/credential'
I1222 15:02:04.184670  6639 slave.cpp:283] Agent using credential for: test-principal
I1222 15:02:04.184695  6639 credentials.hpp:37] Loading credentials for authentication from
'/tmp/Endpoint_SlaveEndpointTest_NoAuthorizer_2_i9Fx2w/http_credentials'
I1222 15:02:04.184928  6639 http.cpp:1045] Creating default 'basic' HTTP authenticator for
realm 'mesos-agent-readonly'
I1222 15:02:04.185086  6639 http.cpp:1045] Creating default 'basic' HTTP authenticator for
realm 'mesos-agent-readwrite'
I1222 15:02:04.186439  6639 slave.cpp:565] Agent resources: [{"name":"cpus","scalar":{"value":2.0},"type":"SCALAR"},{"name":"mem","scalar":{"value":1024.0},"type":"SCALAR"},{"name":"disk","scalar":{"value":1024.0},"type":"SCALAR"},{"name":"ports","ranges":{"range":[{"begin":31000,"end":32000}]},"type":"RANGES"}]
I1222 15:02:04.186671  6639 slave.cpp:573] Agent attributes: [  ]
I1222 15:02:04.186684  6639 slave.cpp:582] Agent hostname: 9fef5df5369d
I1222 15:02:04.186830  6647 status_update_manager.cpp:177] Pausing sending status updates
I1222 15:02:04.188172  6645 state.cpp:64] Recovering state from '/tmp/Endpoint_SlaveEndpointTest_NoAuthorizer_2_LvtJWc/meta'
I1222 15:02:04.188462  6627 status_update_manager.cpp:203] Recovering status update manager
I1222 15:02:04.188688  6631 containerizer.cpp:609] Recovering containerizer
I1222 15:02:04.190197  6629 provisioner.cpp:416] Provisioner recovery complete
I1222 15:02:04.190500  6647 slave.cpp:6288] Finished recovery
I1222 15:02:04.190924  6647 slave.cpp:6470] Querying resource estimator for oversubscribable
resources
I1222 15:02:04.191143  6644 slave.cpp:6484] Received oversubscribable resources {} from the
resource estimator
I1222 15:02:04.194097  6633 process.cpp:3938] Handling HTTP event for process 'slave(802)'
with path: '/slave(802)/containers'
I1222 15:02:04.196022  6646 http.cpp:1185] HTTP GET for /slave(802)/containers from 172.17.0.3:60620
I1222 15:02:04.196139  6646 http.cpp:976] Authorizing principal 'test-principal' to GET the
'/containers' endpoint
I1222 15:02:04.200089  6606 slave.cpp:843] Agent terminating
[       OK ] Endpoint/SlaveEndpointTest.NoAuthorizer/2 (32 ms)
[----------] 9 tests from Endpoint/SlaveEndpointTest (387 ms total)

[----------] 2 tests from ContainerizerType/DefaultContainerDNSFlagTest
[ RUN      ] ContainerizerType/DefaultContainerDNSFlagTest.ValidateFlag/0
[       OK ] ContainerizerType/DefaultContainerDNSFlagTest.ValidateFlag/0 (16 ms)
[ RUN      ] ContainerizerType/DefaultContainerDNSFlagTest.ValidateFlag/1
[       OK ] ContainerizerType/DefaultContainerDNSFlagTest.ValidateFlag/1 (15 ms)
[----------] 2 tests from ContainerizerType/DefaultContainerDNSFlagTest (31 ms total)

[----------] Global test environment tear-down
[==========] 1653 tests from 182 test cases ran. (765046 ms total)
[  PASSED  ] 1652 tests.
[  FAILED  ] 1 test, listed below:
[  FAILED  ] CommandExecutorCheckTest.CommandCheckDeliveredAndReconciled

 1 FAILED TEST
  YOU HAVE 20 DISABLED TESTS

I1222 15:02:04.331763  6649 process.cpp:1068] Failed to accept socket: future discarded
make[4]: *** [check-local] Error 1
make[4]: Leaving directory `/mesos/mesos-1.4.2/_build/src'
make[3]: *** [check-am] Error 2
make[3]: Leaving directory `/mesos/mesos-1.4.2/_build/src'
make[2]: *** [check] Error 2
make[2]: Leaving directory `/mesos/mesos-1.4.2/_build/src'
make[1]: *** [check-recursive] Error 1
make[1]: Leaving directory `/mesos/mesos-1.4.2/_build'
make: *** [distcheck] Error 1
+ docker rmi mesos-1513951580-16713
Untagged: mesos-1513951580-16713:latest
Deleted: sha256:289d19a7e839e7116908723274e8aa34ddc56ba8713ea057e167629422b911a4
Deleted: sha256:2a066c2ef7495b2e9494310c12932a1bb695ef4034b8c4fb22fddc0249a477bc
Deleted: sha256:ab2551134c4d3ba2cc77296f5e4862a405e645a25d6e2cc03789928bbfa4065a
Deleted: sha256:a9642682ffbde1611086ef51e7a0297eee7b20a196578ca388a26a0754ad52fd
Deleted: sha256:b27d3b0bc99a399258beebd09ca50c4c6a08a0be43084ecdfae6a45fa4f1930e
Deleted: sha256:ac7e8c90513bc7099e3330ecad414197bb8324ea94b3e5fe51502af4bd35365a
Deleted: sha256:81888973a55ac73d8509442166088072644d6ed471a3516582ad3d3eeeed9e14
Deleted: sha256:08d9269130e21b0203a7805a60ef362c59672af7172ffad3aec79e0b7818653d
Deleted: sha256:9a5aac8168de17940fe4767aae77bc1d26bb5050d7baed9076d3d54eac4170da
Deleted: sha256:bcba5bccd13c4f268a0d546b8420641fa83307b3f20786ebd73f98d32bdd9942
Deleted: sha256:83262228b0f8eb7eb0119080dea6511d19ea8137b539282f3c1fd477cee59d0f
Deleted: sha256:f112b48486050d7f48019b8df40b45280165a627e64acaae8cabe3287d9f1d64
Deleted: sha256:0b44dc0a82717c75989bed6dfcfbb2ee2c9934bb867c5de54d8750e6f8e0a8f3
Deleted: sha256:053fe4965eca71746daf5638f8b8aaa2dd9995c792cdd66af72881951b4fca88
Deleted: sha256:ee883fb91d1e480495fd362fd03708fe8e8bea70c13f0f6d4074527dd2475de6
Deleted: sha256:4d0977072276ee6aab88d758c22845f196cf9e32909c2946031b523b2793addd
Deleted: sha256:cee7feb68bc73e3134683bfee520a8a4beb9b270573abca2f069937ba5c42ed6
Deleted: sha256:d678e46af25badaf48a2355e9c90a085372cd8ff0f9a0894a8ed70832d956f95
Deleted: sha256:df4fd0adcf566d5f881e61e7b48b5de5a06984047f2f5e748cb011732141c40d
Deleted: sha256:50773f78d68ef25633c6dfd33e7c9984cd8f9a4cb0429b5b309017cd465a49b1
Deleted: sha256:b4aad89e54704db34a39ac5a1aac37d750a030b6a447a23fe563ef5aed5f780c
Deleted: sha256:ffdd9ce5eb8ad138068f1b20ac524b3d7f968ff34d3e9b1c74ccbe2948d386a9
Deleted: sha256:ef9851c61061985d0e163e045a9b47545ff4a92932bf3ef10574ba0a79c69cea
Deleted: sha256:c18188a58785d1d5dfabd7f5cd5a4b8d10099e32cac21c4ab2f88a9a6bc36d59
Deleted: sha256:861dde646b8a921d0907758e4f9f5ea897cdef20eb36287aa9e9ebde04f727fb
Build step 'Execute shell' marked build as failure
Not sending mail to unregistered user yujie.jay@gmail.com
Not sending mail to unregistered user benjamin.hindman@gmail.com
Not sending mail to unregistered user xujyan@apple.com
Not sending mail to unregistered user songzihao1990@gmail.com
Not sending mail to unregistered user gregorywmann@gmail.com
Not sending mail to unregistered user zhq527725@gmail.com
Not sending mail to unregistered user toenshoff@me.com


Mime
View raw message