mesos-builds mailing list archives

Site index · List index
Message view « Date » · « Thread »
Top « Date » · « Thread »
From Apache Jenkins Server <jenk...@builds.apache.org>
Subject Build failed in Jenkins: Mesos-Buildbot » autotools,clang,--verbose --disable-libtool-wrappers,GLOG_v=1 MESOS_VERBOSE=1,ubuntu:14.04,(ubuntu)&&(!ubuntu-us1)&&(!ubuntu-eu2)&&(!qnode3)&&(!H23) #4625
Date Tue, 19 Dec 2017 18:58:22 GMT
See <https://builds.apache.org/job/Mesos-Buildbot/BUILDTOOL=autotools,COMPILER=clang,CONFIGURATION=--verbose%20--disable-libtool-wrappers,ENVIRONMENT=GLOG_v=1%20MESOS_VERBOSE=1,OS=ubuntu%3A14.04,label_exp=(ubuntu)&&(!ubuntu-us1)&&(!ubuntu-eu2)&&(!qnode3)&&(!H23)/4625/display/redirect?page=changes>

Changes:

[alexr] Improved logs displayed after a slave failed recovery.

------------------------------------------
[...truncated 224.68 KB...]
checking how to hardcode library paths into programs... immediate
checking whether stripping libraries is possible... yes
checking if libtool supports shared libraries... yes
checking whether to build shared libraries... yes
checking whether to build static libraries... no
checking how to run the C++ preprocessor... clang++-3.5 -E
checking for ld used by clang++-3.5... /usr/bin/ld -m elf_x86_64
checking if the linker (/usr/bin/ld -m elf_x86_64) is GNU ld... yes
checking whether the clang++-3.5 linker (/usr/bin/ld -m elf_x86_64) supports shared libraries...
yes
checking for clang++-3.5 option to produce PIC... -fPIC -DPIC
checking if clang++-3.5 PIC flag -fPIC -DPIC works... yes
checking if clang++-3.5 static flag -static works... yes
checking if clang++-3.5 supports -c -o file.o... yes
checking if clang++-3.5 supports -c -o file.o... (cached) yes
checking whether the clang++-3.5 linker (/usr/bin/ld -m elf_x86_64) supports shared libraries...
yes
checking dynamic linker characteristics... (cached) GNU/Linux ld.so
checking how to hardcode library paths into programs... immediate
configure: creating ./config.lt
config.lt: creating libtool
checking whether C++ compiler accepts -fstack-protector-strong... yes
checking whether clang++-3.5 supports C++11 features by default... no
checking whether clang++-3.5 supports C++11 features with -std=c++11... yes
checking if compiler needs -Werror to reject unknown flags... yes
checking for the pthreads library -lpthreads... no
checking whether pthreads work without any flags... no
checking whether pthreads work with -Kthread... no
checking whether pthreads work with -kthread... no
checking for the pthreads library -llthread... no
checking whether pthreads work with -pthread... yes
checking for joinable pthread attribute... PTHREAD_CREATE_JOINABLE
checking if more special flags are required for pthreads... no
checking for PTHREAD_PRIO_INHERIT... yes
configure: Setting up build environment for x86_64 linux-gnu
checking for backtrace in -lunwind... no
checking for main in -lgflags... no
checking for patch... patch
checking fts.h usability... yes
checking fts.h presence... yes
checking for fts.h... yes
checking for library containing fts_close... none required
checking apr_pools.h usability... yes
checking apr_pools.h presence... yes
checking for apr_pools.h... yes
checking for apr_initialize in -lapr-1... yes
checking for curl_global_init in -lcurl... yes
checking for javac... /usr/bin/javac
checking for java... /usr/bin/java
checking value of Java system property 'java.home'... /usr/lib/jvm/java-7-openjdk-amd64/jre
configure: using JAVA_HOME=/usr/lib/jvm/java-7-openjdk-amd64
checking whether or not we can build with JNI... yes
checking for mvn... /usr/bin/mvn
checking for sasl_done in -lsasl2... yes
checking SASL CRAM-MD5 support... yes
checking for RAND_poll in -lcrypto... yes
checking openssl/ssl.h usability... yes
checking openssl/ssl.h presence... yes
checking for openssl/ssl.h... yes
checking for SSL_CTX_new in -lssl... yes
checking svn_version.h usability... yes
checking svn_version.h presence... yes
checking for svn_version.h... yes
checking for svn_stringbuf_create_ensure in -lsvn_subr-1... yes
checking svn_delta.h usability... yes
checking svn_delta.h presence... yes
checking for svn_delta.h... yes
checking for svn_txdelta in -lsvn_delta-1... yes
checking whether to enable the XFS disk isolator... no
checking zlib.h usability... yes
checking zlib.h presence... yes
checking for zlib.h... yes
checking for deflate, gzread, gzwrite, inflate in -lz... yes
checking C++ standard library for undefined behaviour with selected optimization level...
no
checking for a Python interpreter with version >= 2.6... python
checking for python... /usr/bin/python
checking for python version... 2.7
checking for python platform... linux2
checking for python script directory... ${prefix}/lib/python2.7/site-packages
checking for python extension module directory... ${exec_prefix}/lib/python2.7/site-packages
checking for python2.7... (cached) /usr/bin/python
checking for a version of Python >= '2.1.0'... yes
checking for a version of Python >= '2.6'... yes
checking for the distutils Python package... yes
checking for Python include path... -I/usr/include/python2.7
checking for Python library path... -L/usr/lib -lpython2.7
checking for Python site-packages path... /usr/lib/python2.7/dist-packages
checking python extra libraries... -lpthread -ldl  -lutil -lm
checking python extra linking flags... -Xlinker -export-dynamic -Wl,-O1 -Wl,-Bsymbolic-functions
checking consistency of all components of python development environment... yes
checking whether we can build usable Python eggs... yes
checking for an old installation of the Mesos egg (before 0.20.0)... no
checking that generated files are newer than configure... done
configure: creating ./config.status
config.status: creating Makefile
config.status: creating mesos.pc
config.status: creating src/Makefile
config.status: creating 3rdparty/Makefile
config.status: creating 3rdparty/libprocess/Makefile
config.status: creating 3rdparty/libprocess/include/Makefile
config.status: creating 3rdparty/stout/Makefile
config.status: creating 3rdparty/stout/include/Makefile
config.status: creating 3rdparty/gmock_sources.cc
config.status: creating bin/mesos.sh
config.status: creating bin/mesos-agent.sh
config.status: creating bin/mesos-local.sh
config.status: creating bin/mesos-master.sh
config.status: creating bin/mesos-slave.sh
config.status: creating bin/mesos-tests.sh
config.status: creating bin/mesos-agent-flags.sh
config.status: creating bin/mesos-local-flags.sh
config.status: creating bin/mesos-master-flags.sh
config.status: creating bin/mesos-slave-flags.sh
config.status: creating bin/mesos-tests-flags.sh
config.status: creating bin/gdb-mesos-agent.sh
config.status: creating bin/gdb-mesos-local.sh
config.status: creating bin/gdb-mesos-master.sh
config.status: creating bin/gdb-mesos-slave.sh
config.status: creating bin/gdb-mesos-tests.sh
config.status: creating bin/lldb-mesos-agent.sh
config.status: creating bin/lldb-mesos-local.sh
config.status: creating bin/lldb-mesos-master.sh
config.status: creating bin/lldb-mesos-slave.sh
config.status: creating bin/lldb-mesos-tests.sh
config.status: creating bin/valgrind-mesos-agent.sh
config.status: creating bin/valgrind-mesos-local.sh
config.status: creating bin/valgrind-mesos-master.sh
config.status: creating bin/valgrind-mesos-slave.sh
config.status: creating bin/valgrind-mesos-tests.sh
config.status: creating src/deploy/mesos-daemon.sh
config.status: creating src/deploy/mesos-start-agents.sh
config.status: creating src/deploy/mesos-start-cluster.sh
config.status: creating src/deploy/mesos-start-masters.sh
config.status: creating src/deploy/mesos-start-slaves.sh
config.status: creating src/deploy/mesos-stop-agents.sh
config.status: creating src/deploy/mesos-stop-cluster.sh
config.status: creating src/deploy/mesos-stop-masters.sh
config.status: creating src/deploy/mesos-stop-slaves.sh
config.status: creating include/mesos/version.hpp
config.status: creating src/java/generated/org/apache/mesos/MesosNativeLibrary.java
config.status: creating mpi/mpiexec-mesos
config.status: creating src/examples/java/test-exception-framework
config.status: creating src/examples/java/test-executor
config.status: creating src/examples/java/test-framework
config.status: creating src/examples/java/test-multiple-executors-framework
config.status: creating src/examples/java/test-log
config.status: creating src/examples/java/v1-test-framework
config.status: creating src/java/mesos.pom
config.status: creating src/examples/python/test-executor
config.status: creating src/examples/python/test-framework
config.status: creating src/python/setup.py
config.status: creating src/python/cli/setup.py
config.status: creating src/python/interface/setup.py
config.status: creating src/python/native_common/ext_modules.py
config.status: creating src/python/executor/setup.py
config.status: creating src/python/native/setup.py
config.status: creating src/python/scheduler/setup.py
config.status: linking src/python/native_common/ext_modules.py to src/python/executor/ext_modules.py
config.status: linking src/python/native_common/ext_modules.py to src/python/scheduler/ext_modules.py
config.status: executing depfiles commands
config.status: executing libtool commands
configure: Build option summary:
    CXX:        clang++-3.5
    CXXFLAGS:   -g1 -O0 -std=c++11
    CPPFLAGS:   -isystem /usr/include/subversion-1 -isystem /usr/include/apr-1 -isystem /usr/include/apr-1.0
      
    LDFLAGS:    
    LIBS:       -lz -lsvn_delta-1 -lsvn_subr-1 -lsasl2 -lcurl -lapr-1  -lrt

make  dist-gzip am__post_remove_distdir='@:'
make[1]: Entering directory `/mesos'
if test -d "mesos-1.5.0"; then find "mesos-1.5.0" -type d ! -perm -200 -exec chmod u+w {}
';' && rm -rf "mesos-1.5.0" || { sleep 5 && rm -rf "mesos-1.5.0"; }; else
:; fi
test -d "mesos-1.5.0" || mkdir "mesos-1.5.0"
 (cd 3rdparty && make  top_distdir=../mesos-1.5.0 distdir=../mesos-1.5.0/3rdparty
\
     am__remove_distdir=: am__skip_length_check=: am__skip_mode_fix=: distdir)
make[2]: Entering directory `/mesos/3rdparty'
 (cd stout && make  top_distdir=../../mesos-1.5.0 distdir=../../mesos-1.5.0/3rdparty/stout
\
     am__remove_distdir=: am__skip_length_check=: am__skip_mode_fix=: distdir)
make[3]: Entering directory `/mesos/3rdparty/stout'
 (cd include && make  top_distdir=../../../mesos-1.5.0 distdir=../../../mesos-1.5.0/3rdparty/stout/include
\
     am__remove_distdir=: am__skip_length_check=: am__skip_mode_fix=: distdir)
make[4]: Entering directory `/mesos/3rdparty/stout/include'
make[4]: Leaving directory `/mesos/3rdparty/stout/include'
make  \
	  top_distdir="../../mesos-1.5.0" distdir="../../mesos-1.5.0/3rdparty/stout" \
	  dist-hook
make[4]: Entering directory `/mesos/3rdparty/stout'
cp -r ./3rdparty ../../mesos-1.5.0/3rdparty/stout/
make[4]: Leaving directory `/mesos/3rdparty/stout'
make[3]: Leaving directory `/mesos/3rdparty/stout'
 (cd libprocess && make  top_distdir=../../mesos-1.5.0 distdir=../../mesos-1.5.0/3rdparty/libprocess
\
     am__remove_distdir=: am__skip_length_check=: am__skip_mode_fix=: distdir)
make[3]: Entering directory `/mesos/3rdparty/libprocess'
 (cd include && make  top_distdir=../../../mesos-1.5.0 distdir=../../../mesos-1.5.0/3rdparty/libprocess/include
\
     am__remove_distdir=: am__skip_length_check=: am__skip_mode_fix=: distdir)
make[4]: Entering directory `/mesos/3rdparty/libprocess/include'
make[4]: Leaving directory `/mesos/3rdparty/libprocess/include'
make  \
	  top_distdir="../../mesos-1.5.0" distdir="../../mesos-1.5.0/3rdparty/libprocess" \
	  dist-hook
make[4]: Entering directory `/mesos/3rdparty/libprocess'
cp -r ./3rdparty ../../mesos-1.5.0/3rdparty/libprocess/
make[4]: Leaving directory `/mesos/3rdparty/libprocess'
make[3]: Leaving directory `/mesos/3rdparty/libprocess'
make[2]: Leaving directory `/mesos/3rdparty'
 (cd src && make  top_distdir=../mesos-1.5.0 distdir=../mesos-1.5.0/src \
     am__remove_distdir=: am__skip_length_check=: am__skip_mode_fix=: distdir)
make[2]: Entering directory `/mesos/src'
../3rdparty/protobuf-3.5.0/src/protoc -I../include -I.  --cpp_out=. csi/uri_volume_profile.proto
/bin/bash: ../3rdparty/protobuf-3.5.0/src/protoc: No such file or directory
make[2]: *** [csi/uri_volume_profile.pb.cc] Error 127
make[2]: Leaving directory `/mesos/src'
make[1]: *** [distdir] Error 1
make[1]: Leaving directory `/mesos'
make: *** [dist] Error 2
+ docker rmi mesos-1513709163-9665
Untagged: mesos-1513709163-9665:latest
Deleted: sha256:f260020ef622890c2e40432d5a7c04d1500fc4bccf3365b514cc934953848155
Deleted: sha256:24c4d375787064dd2a6604fd0814043be6554d18518ddb102d13d24d043b3940
Deleted: sha256:fb733e742dd76ecbab419f376f704d4a46ca1051905ccd78894bc04c5b615567
Deleted: sha256:2dbdeea6b4b9cfa7a4d021c66f7b228ab3928952f687f9e59d9e162c62a9dd22
Deleted: sha256:6736972a1b1ca7c9d0f16ec0c4c6a3245c276beea353c267f0083943a09c983b
Deleted: sha256:44f1b560d624122eb6792936579e4e606ef75b15592ce7a08cd62048b35e66c7
Deleted: sha256:ff9749879645d401faaeb73bf6f7f1afe2d4811d96e13a36a8ec7b3974281c1e
Deleted: sha256:1ddaf630684e536dd0bb42b02112d7ceaf247ae60c115f39ac93a407679f13a4
Deleted: sha256:f8ebfa67c2eec9e09cfe74dc4dfd9a9d9cd75da8bffe20ea2c586d29e05dcdde
Deleted: sha256:217cd5c638094e8197052c45ff90110669508efe5d58fab878bd1da33fb28362
Deleted: sha256:a355e0fc188100e346bcdb9f2c7045d8f0eb133a76d3e7bd929f0e7b3857ff8e
Deleted: sha256:4af1cf1c39a778370dcb7b0f0a173fb12a63ad673e31423a72c1b9de6e7fc906
Deleted: sha256:db69012c145eb9d9278e4c632f3a21e40c535c1f2be6a53aaabeecb3e4708ae6
Deleted: sha256:8926f9f47c7ad4706fb0c7678c2684175d31478ecdeb2812ed9698d6294bdc42
Deleted: sha256:99e6f42e3fedd61465f02b1c7d2833ddfdf0784055a079117aa5d863dbcf27e0
Deleted: sha256:f7b84902ae9b6531a8774942adb23429a9049470ea26c6feaca9c9e4cdabdfe4
Deleted: sha256:2737f2bf653fedc6c41ac718fbfa751c3ee8d276ed24313a96d051fa4e94c7f1
Deleted: sha256:bfaf4ed2ca76980120c1a9abb524f301a7adeca25a5fd57d6eb29f66fa94310d
Deleted: sha256:d7de3d6767621d863b9018e5fc8aeb52286bdb811939121f7de8e442641e6484
Deleted: sha256:0a856e0466fbf7c30a44be56b72a563cb075831ec1d243de18a1ed5a90ef07fe
Deleted: sha256:0ede9505e07ccb0a4a713d64fd447379392dfd62950dbbcec45810381382b46c
Deleted: sha256:b8d68ceae9aa85edbc352863faed2e4b641e1fef6bee49b60a4d3805d5292013
Deleted: sha256:fa10f664f67948940b7ae79c7991c9322bb861dad4dfe2a2a9d65e07d41a495e
Deleted: sha256:296086c6d000ac6c845a61f1c678d341ad631f0ff4aa2dec5706741d7354f0d6
Deleted: sha256:e928cbd3a6579ce606ceda0b3e3687599dbc1d74036001318fcded09a3a2f63e
Deleted: sha256:d607eddac9d56debbb7b8845016507141e105f7db56b00a57dedaec2f4fa365e
Deleted: sha256:1790d61587e5c018885b43984a82ebb5c8835fe8ac34db33c12682e7e9e39e77
Deleted: sha256:8e066fd7c4da3214779df503a8077018d0ebdc32cc06b15e68b9e971595604be
Deleted: sha256:6dd1d5e9357dbfb21cf1733f8ef6dc0b1eb489a64bd61657d243d37effad559d
Deleted: sha256:dd401c62ba40febf60f0b42f138f67c4d046604f6e7b9b584ef9106a2b56c60a
Build step 'Execute shell' marked build as failure
Not sending mail to unregistered user songzihao1990@gmail.com
Not sending mail to unregistered user xujyan@apple.com
Not sending mail to unregistered user gregorywmann@gmail.com
Not sending mail to unregistered user yujie.jay@gmail.com

Mime
View raw message