mesos-builds mailing list archives

Site index · List index
Message view « Date » · « Thread »
Top « Date » · « Thread »
From Apache Jenkins Server <jenk...@builds.apache.org>
Subject Build failed in Jenkins: Mesos-Reviewbot #20755
Date Tue, 19 Dec 2017 21:57:59 GMT
See <https://builds.apache.org/job/Mesos-Reviewbot/20755/display/redirect>

------------------------------------------
[...truncated 222.66 KB...]
checking whether -lc should be explicitly linked in... no
checking dynamic linker characteristics... GNU/Linux ld.so
checking how to hardcode library paths into programs... immediate
checking whether stripping libraries is possible... yes
checking if libtool supports shared libraries... yes
checking whether to build shared libraries... yes
checking whether to build static libraries... no
checking how to run the C++ preprocessor... g++ -E
checking for ld used by g++... /usr/bin/ld -m elf_x86_64
checking if the linker (/usr/bin/ld -m elf_x86_64) is GNU ld... yes
checking whether the g++ linker (/usr/bin/ld -m elf_x86_64) supports shared libraries... yes
checking for g++ option to produce PIC... -fPIC -DPIC
checking if g++ PIC flag -fPIC -DPIC works... yes
checking if g++ static flag -static works... yes
checking if g++ supports -c -o file.o... yes
checking if g++ supports -c -o file.o... (cached) yes
checking whether the g++ linker (/usr/bin/ld -m elf_x86_64) supports shared libraries... yes
checking dynamic linker characteristics... (cached) GNU/Linux ld.so
checking how to hardcode library paths into programs... immediate
configure: creating ./config.lt
config.lt: creating libtool
configure: Setting up CXXFLAGS for g++ version >= 4.8
checking whether C++ compiler accepts -fstack-protector-strong... no
checking whether g++ supports C++11 features by default... no
checking whether g++ supports C++11 features with -std=c++11... yes
checking if compiler needs -Werror to reject unknown flags... no
checking for the pthreads library -lpthreads... no
checking whether pthreads work without any flags... no
checking whether pthreads work with -Kthread... no
checking whether pthreads work with -kthread... no
checking for the pthreads library -llthread... no
checking whether pthreads work with -pthread... yes
checking for joinable pthread attribute... PTHREAD_CREATE_JOINABLE
checking if more special flags are required for pthreads... no
checking for PTHREAD_PRIO_INHERIT... yes
configure: Setting up build environment for x86_64 linux-gnu
checking for backtrace in -lunwind... no
checking for main in -lgflags... no
checking for patch... patch
checking fts.h usability... yes
checking fts.h presence... yes
checking for fts.h... yes
checking for library containing fts_close... none required
checking apr_pools.h usability... yes
checking apr_pools.h presence... yes
checking for apr_pools.h... yes
checking for apr_initialize in -lapr-1... yes
checking for curl_global_init in -lcurl... yes
checking for javac... /usr/bin/javac
checking for java... /usr/bin/java
checking value of Java system property 'java.home'... /usr/lib/jvm/java-7-openjdk-amd64/jre
configure: using JAVA_HOME=/usr/lib/jvm/java-7-openjdk-amd64
checking whether or not we can build with JNI... yes
checking for mvn... /usr/bin/mvn
checking for sasl_done in -lsasl2... yes
checking SASL CRAM-MD5 support... yes
checking for RAND_poll in -lcrypto... yes
checking openssl/ssl.h usability... yes
checking openssl/ssl.h presence... yes
checking for openssl/ssl.h... yes
checking for SSL_CTX_new in -lssl... yes
checking svn_version.h usability... yes
checking svn_version.h presence... yes
checking for svn_version.h... yes
checking for svn_stringbuf_create_ensure in -lsvn_subr-1... yes
checking svn_delta.h usability... yes
checking svn_delta.h presence... yes
checking for svn_delta.h... yes
checking for svn_txdelta in -lsvn_delta-1... yes
checking whether to enable the XFS disk isolator... no
checking zlib.h usability... yes
checking zlib.h presence... yes
checking for zlib.h... yes
checking for deflate, gzread, gzwrite, inflate in -lz... yes
checking C++ standard library for undefined behaviour with selected optimization level...
no
checking for a Python interpreter with version >= 2.6... python
checking for python... /usr/bin/python
checking for python version... 2.7
checking for python platform... linux2
checking for python script directory... ${prefix}/lib/python2.7/site-packages
checking for python extension module directory... ${exec_prefix}/lib/python2.7/site-packages
checking for python2.7... (cached) /usr/bin/python
checking for a version of Python >= '2.1.0'... yes
checking for a version of Python >= '2.6'... yes
checking for the distutils Python package... yes
checking for Python include path... -I/usr/include/python2.7
checking for Python library path... -L/usr/lib -lpython2.7
checking for Python site-packages path... /usr/lib/python2.7/dist-packages
checking python extra libraries... -lpthread -ldl  -lutil -lm
checking python extra linking flags... -Xlinker -export-dynamic -Wl,-O1 -Wl,-Bsymbolic-functions
checking consistency of all components of python development environment... yes
checking whether we can build usable Python eggs... cc1plus: warning: command line option
'-Wstrict-prototypes' is valid for C/ObjC but not for C++ [enabled by default]
yes
checking for an old installation of the Mesos egg (before 0.20.0)... no
checking that generated files are newer than configure... done
configure: creating ./config.status
config.status: creating Makefile
config.status: creating mesos.pc
config.status: creating src/Makefile
config.status: creating 3rdparty/Makefile
config.status: creating 3rdparty/libprocess/Makefile
config.status: creating 3rdparty/libprocess/include/Makefile
config.status: creating 3rdparty/stout/Makefile
config.status: creating 3rdparty/stout/include/Makefile
config.status: creating 3rdparty/gmock_sources.cc
config.status: creating bin/mesos.sh
config.status: creating bin/mesos-agent.sh
config.status: creating bin/mesos-local.sh
config.status: creating bin/mesos-master.sh
config.status: creating bin/mesos-slave.sh
config.status: creating bin/mesos-tests.sh
config.status: creating bin/mesos-agent-flags.sh
config.status: creating bin/mesos-local-flags.sh
config.status: creating bin/mesos-master-flags.sh
config.status: creating bin/mesos-slave-flags.sh
config.status: creating bin/mesos-tests-flags.sh
config.status: creating bin/gdb-mesos-agent.sh
config.status: creating bin/gdb-mesos-local.sh
config.status: creating bin/gdb-mesos-master.sh
config.status: creating bin/gdb-mesos-slave.sh
config.status: creating bin/gdb-mesos-tests.sh
config.status: creating bin/lldb-mesos-agent.sh
config.status: creating bin/lldb-mesos-local.sh
config.status: creating bin/lldb-mesos-master.sh
config.status: creating bin/lldb-mesos-slave.sh
config.status: creating bin/lldb-mesos-tests.sh
config.status: creating bin/valgrind-mesos-agent.sh
config.status: creating bin/valgrind-mesos-local.sh
config.status: creating bin/valgrind-mesos-master.sh
config.status: creating bin/valgrind-mesos-slave.sh
config.status: creating bin/valgrind-mesos-tests.sh
config.status: creating src/deploy/mesos-daemon.sh
config.status: creating src/deploy/mesos-start-agents.sh
config.status: creating src/deploy/mesos-start-cluster.sh
config.status: creating src/deploy/mesos-start-masters.sh
config.status: creating src/deploy/mesos-start-slaves.sh
config.status: creating src/deploy/mesos-stop-agents.sh
config.status: creating src/deploy/mesos-stop-cluster.sh
config.status: creating src/deploy/mesos-stop-masters.sh
config.status: creating src/deploy/mesos-stop-slaves.sh
config.status: creating include/mesos/version.hpp
config.status: creating src/java/generated/org/apache/mesos/MesosNativeLibrary.java
config.status: creating mpi/mpiexec-mesos
config.status: creating src/examples/java/test-exception-framework
config.status: creating src/examples/java/test-executor
config.status: creating src/examples/java/test-framework
config.status: creating src/examples/java/test-multiple-executors-framework
config.status: creating src/examples/java/test-log
config.status: creating src/examples/java/v1-test-framework
config.status: creating src/java/mesos.pom
config.status: creating src/examples/python/test-executor
config.status: creating src/examples/python/test-framework
config.status: creating src/python/setup.py
config.status: creating src/python/cli/setup.py
config.status: creating src/python/interface/setup.py
config.status: creating src/python/native_common/ext_modules.py
config.status: creating src/python/executor/setup.py
config.status: creating src/python/native/setup.py
config.status: creating src/python/scheduler/setup.py
config.status: linking src/python/native_common/ext_modules.py to src/python/executor/ext_modules.py
config.status: linking src/python/native_common/ext_modules.py to src/python/scheduler/ext_modules.py
config.status: executing depfiles commands
config.status: executing libtool commands
configure: Build option summary:
    CXX:        g++
    CXXFLAGS:   -g1 -O0 -Wno-unused-local-typedefs -std=c++11
    CPPFLAGS:   -isystem /usr/include/subversion-1 -isystem /usr/include/apr-1 -isystem /usr/include/apr-1.0
      
    LDFLAGS:    
    LIBS:       -lz -lsvn_delta-1 -lsvn_subr-1 -lsasl2 -lcurl -lapr-1  -lrt

make  dist-gzip am__post_remove_distdir='@:'
make[1]: Entering directory `/mesos'
if test -d "mesos-1.5.0"; then find "mesos-1.5.0" -type d ! -perm -200 -exec chmod u+w {}
';' && rm -rf "mesos-1.5.0" || { sleep 5 && rm -rf "mesos-1.5.0"; }; else
:; fi
test -d "mesos-1.5.0" || mkdir "mesos-1.5.0"
 (cd 3rdparty && make  top_distdir=../mesos-1.5.0 distdir=../mesos-1.5.0/3rdparty
\
     am__remove_distdir=: am__skip_length_check=: am__skip_mode_fix=: distdir)
make[2]: Entering directory `/mesos/3rdparty'
 (cd stout && make  top_distdir=../../mesos-1.5.0 distdir=../../mesos-1.5.0/3rdparty/stout
\
     am__remove_distdir=: am__skip_length_check=: am__skip_mode_fix=: distdir)
make[3]: Entering directory `/mesos/3rdparty/stout'
 (cd include && make  top_distdir=../../../mesos-1.5.0 distdir=../../../mesos-1.5.0/3rdparty/stout/include
\
     am__remove_distdir=: am__skip_length_check=: am__skip_mode_fix=: distdir)
make[4]: Entering directory `/mesos/3rdparty/stout/include'
make[4]: Leaving directory `/mesos/3rdparty/stout/include'
make  \
	  top_distdir="../../mesos-1.5.0" distdir="../../mesos-1.5.0/3rdparty/stout" \
	  dist-hook
make[4]: Entering directory `/mesos/3rdparty/stout'
cp -r ./3rdparty ../../mesos-1.5.0/3rdparty/stout/
make[4]: Leaving directory `/mesos/3rdparty/stout'
make[3]: Leaving directory `/mesos/3rdparty/stout'
 (cd libprocess && make  top_distdir=../../mesos-1.5.0 distdir=../../mesos-1.5.0/3rdparty/libprocess
\
     am__remove_distdir=: am__skip_length_check=: am__skip_mode_fix=: distdir)
make[3]: Entering directory `/mesos/3rdparty/libprocess'
 (cd include && make  top_distdir=../../../mesos-1.5.0 distdir=../../../mesos-1.5.0/3rdparty/libprocess/include
\
     am__remove_distdir=: am__skip_length_check=: am__skip_mode_fix=: distdir)
make[4]: Entering directory `/mesos/3rdparty/libprocess/include'
make[4]: Leaving directory `/mesos/3rdparty/libprocess/include'
make  \
	  top_distdir="../../mesos-1.5.0" distdir="../../mesos-1.5.0/3rdparty/libprocess" \
	  dist-hook
make[4]: Entering directory `/mesos/3rdparty/libprocess'
cp -r ./3rdparty ../../mesos-1.5.0/3rdparty/libprocess/
make[4]: Leaving directory `/mesos/3rdparty/libprocess'
make[3]: Leaving directory `/mesos/3rdparty/libprocess'
make[2]: Leaving directory `/mesos/3rdparty'
 (cd src && make  top_distdir=../mesos-1.5.0 distdir=../mesos-1.5.0/src \
     am__remove_distdir=: am__skip_length_check=: am__skip_mode_fix=: distdir)
make[2]: Entering directory `/mesos/src'
../3rdparty/protobuf-3.5.0/src/protoc -I../include -I.  --cpp_out=. csi/uri_volume_profile.proto
/bin/bash: ../3rdparty/protobuf-3.5.0/src/protoc: No such file or directory
make[2]: *** [csi/uri_volume_profile.pb.cc] Error 127
make[2]: Leaving directory `/mesos/src'
make[1]: *** [distdir] Error 1
make[1]: Leaving directory `/mesos'
make: *** [dist] Error 2
+ docker rmi mesos-1513720346-25001
Untagged: mesos-1513720346-25001:latest
Deleted: sha256:497a50c5ede4eeb3b1144da33f2618c074b35e3a1222ed2eed7651194bbef1e1
Deleted: sha256:d2b84ddde875e813b1bbc5228e6506ba5abe2064ddca99918e8af167de3d91a7
Deleted: sha256:21fa669bd6d34293876ff057dcd5b2a6a7d7bc4426e32c36291b825dba497b70
Deleted: sha256:999800c7e2a324160a68ccc2b2d2a3ded12d4ddf4e037915f07faab4e1a92eb6
Deleted: sha256:ff21affc5363946714613523b78f1aeda16811a7951abf122febfa8946e6894e
Deleted: sha256:d09a126ed6d16f3de38072febdd0d96e4a874c2daadafe828285d1da04c4178b
Deleted: sha256:074cdafef50cd88f29560b09cf6c4f3a672ebe814d5652eff00b80ee54836bb7
Deleted: sha256:0038e15383152e01494584e3ba7ebf9adb22e981adf78ad87bdb48f9f7c5f7bc
Deleted: sha256:327612be2f21e8325cbb791ea24064dac6510af047d47921095f60eae048013d
Deleted: sha256:4494300d51c3cf8eaf32a6ab6d842a200907ee7d917b597faabfc56d1d614b7b
Deleted: sha256:2cd9ff015971caf03e69dc26eb645f55b25c549303ec271cde919911cb5b7020
Deleted: sha256:41e7a748c8cd94bf43b41d77c743ca10ca19893a141aec43d8c8ec47753bbe8a
Deleted: sha256:908e61e0fd409d5afc348a33ea7841872c96ec9a2753620acb6b5074ef077bf8
Deleted: sha256:2d829b941cfa4f2621658f835e46e78307b0a82c8b34881b84f483e5375c1bf6
Deleted: sha256:0347bc00a48778038051ef216d3c9bf6c8d295b8c122506158b2f0444c6f6ccb
Deleted: sha256:35135c126a645668e520fdc2274af4b66aafe4e6323be91e3480e393a55ef506
Deleted: sha256:798837b0a7f761d3a41c1b1bd61670a8e70db19b5045aefe92a4c637b8fcaa14
Deleted: sha256:7f4ad5c18e23e75abfbd246544bc40ec8f231c4ea5068b456e9b732d0ece0379
Deleted: sha256:36a3d99e65a0aeeb9c061d673a3cd429c22c5b9b948afa376c58745f72438464
Deleted: sha256:e9f117acc174ed85ea10481ef257867adbf7ea4685eee85afed3cd9cd0c04683
Deleted: sha256:bbe8f8f9349130ec80fd48381e874ad5d38f6c1c9cb46977b7cb7c27cd6ec9ed
Deleted: sha256:d250018761219cb16d209353d346037f15209a975bb5fca0771e1442253bc7eb
Deleted: sha256:ea9fedb3c208c289fae81086eb3020b636cc22dff01f34e69985f4f1be553e5f
Deleted: sha256:f34c0884b062a69dd9dc20322e8f81c1b98b1c697c7f60e462929e59d13a8b29
Deleted: sha256:8faa0fdf8b003ff29d62a0e076c93a3bbff4a85bade725a0934f0e80c3fb91fa
Deleted: sha256:0648c5ce5318f43b3d1fcc32c10f6b4fcc7cee23064f2ef49b4c0bea7d9d76a8
Deleted: sha256:b6de8c793ebacffdd350dfc94e7affecd8369c11f74fd84b05ccac416ac44291
Deleted: sha256:e5e01922dc56a8809bd0f384e49ff9d46426712f5ddd8fd68e2c048a3885e93a
Deleted: sha256:a82401a03382dc357830e355704ac97c3e27f31dbfe9ff4b7bfb4ffec3af5beb
Deleted: sha256:bd3da4fce5dce6352f3469589e8994eec5957e1ed31e95ea11e7424e7415910e
Build step 'Execute shell' marked build as failure

Mime
View raw message