mesos-builds mailing list archives

Site index · List index
Message view « Date » · « Thread »
Top « Date » · « Thread »
From Apache Jenkins Server <jenk...@builds.apache.org>
Subject Build failed in Jenkins: Mesos-Buildbot » autotools,clang,--verbose --disable-libtool-wrappers --enable-libevent --enable-ssl,GLOG_v=1 MESOS_VERBOSE=1,ubuntu:14.04,(ubuntu)&&(!ubuntu-us1)&&(!ubuntu-eu2)&&(!qnode3)&&(!H23) #4677
Date Sat, 30 Dec 2017 07:13:26 GMT
See <https://builds.apache.org/job/Mesos-Buildbot/BUILDTOOL=autotools,COMPILER=clang,CONFIGURATION=--verbose%20--disable-libtool-wrappers%20--enable-libevent%20--enable-ssl,ENVIRONMENT=GLOG_v=1%20MESOS_VERBOSE=1,OS=ubuntu%3A14.04,label_exp=(ubuntu)&&(!ubuntu-us1)&&(!ubuntu-eu2)&&(!qnode3)&&(!H23)/4677/display/redirect?page=changes>

Changes:

[jpeach] Renamed fetcher test to trigger the UNZIP filter.

------------------------------------------
[...truncated 212.79 KB...]
checking if clang++-3.5 PIC flag -fPIC -DPIC works... yes
checking if clang++-3.5 static flag -static works... yes
checking if clang++-3.5 supports -c -o file.o... yes
checking if clang++-3.5 supports -c -o file.o... (cached) yes
checking whether the clang++-3.5 linker (/usr/bin/ld -m elf_x86_64) supports shared libraries...
yes
checking dynamic linker characteristics... (cached) GNU/Linux ld.so
checking how to hardcode library paths into programs... immediate
configure: creating ./config.lt
config.lt: creating libtool
checking whether C++ compiler accepts -fstack-protector-strong... yes
checking whether clang++-3.5 supports C++11 features by default... no
checking whether clang++-3.5 supports C++11 features with -std=c++11... yes
checking if compiler needs -Werror to reject unknown flags... yes
checking for the pthreads library -lpthreads... no
checking whether pthreads work without any flags... no
checking whether pthreads work with -Kthread... no
checking whether pthreads work with -kthread... no
checking for the pthreads library -llthread... no
checking whether pthreads work with -pthread... yes
checking for joinable pthread attribute... PTHREAD_CREATE_JOINABLE
checking if more special flags are required for pthreads... no
checking for PTHREAD_PRIO_INHERIT... yes
configure: Setting up build environment for x86_64 linux-gnu
checking for backtrace in -lunwind... no
checking for main in -lgflags... no
checking for patch... patch
checking fts.h usability... yes
checking fts.h presence... yes
checking for fts.h... yes
checking for library containing fts_close... none required
checking apr_pools.h usability... yes
checking apr_pools.h presence... yes
checking for apr_pools.h... yes
checking for apr_initialize in -lapr-1... yes
checking for curl_global_init in -lcurl... yes
checking for javac... /usr/bin/javac
checking for java... /usr/bin/java
checking value of Java system property 'java.home'... /usr/lib/jvm/java-7-openjdk-amd64/jre
configure: using JAVA_HOME=/usr/lib/jvm/java-7-openjdk-amd64
checking whether or not we can build with JNI... yes
checking for mvn... /usr/bin/mvn
checking event2/event.h usability... yes
checking event2/event.h presence... yes
checking for event2/event.h... yes
checking for event_base_new in -levent... yes
checking event2/thread.h usability... yes
checking event2/thread.h presence... yes
checking for event2/thread.h... yes
checking for evthread_use_pthreads in -levent_pthreads... yes
checking for sasl_done in -lsasl2... yes
checking SASL CRAM-MD5 support... yes
checking for RAND_poll in -lcrypto... yes
checking openssl/ssl.h usability... yes
checking openssl/ssl.h presence... yes
checking for openssl/ssl.h... yes
checking for SSL_CTX_new in -lssl... yes
checking event2/bufferevent_ssl.h usability... yes
checking event2/bufferevent_ssl.h presence... yes
checking for event2/bufferevent_ssl.h... yes
checking for bufferevent_openssl_get_ssl in -levent_openssl... yes
checking svn_version.h usability... yes
checking svn_version.h presence... yes
checking for svn_version.h... yes
checking for svn_stringbuf_create_ensure in -lsvn_subr-1... yes
checking svn_delta.h usability... yes
checking svn_delta.h presence... yes
checking for svn_delta.h... yes
checking for svn_txdelta in -lsvn_delta-1... yes
checking whether to enable the XFS disk isolator... no
checking zlib.h usability... yes
checking zlib.h presence... yes
checking for zlib.h... yes
checking for deflate, gzread, gzwrite, inflate in -lz... yes
checking C++ standard library for undefined behaviour with selected optimization level...
no
checking for a Python interpreter with version >= 2.6... python
checking for python... /usr/bin/python
checking for python version... 2.7
checking for python platform... linux2
checking for python script directory... ${prefix}/lib/python2.7/site-packages
checking for python extension module directory... ${exec_prefix}/lib/python2.7/site-packages
checking for python2.7... (cached) /usr/bin/python
checking for a version of Python >= '2.1.0'... yes
checking for a version of Python >= '2.6'... yes
checking for the distutils Python package... yes
checking for Python include path... -I/usr/include/python2.7
checking for Python library path... -L/usr/lib -lpython2.7
checking for Python site-packages path... /usr/lib/python2.7/dist-packages
checking python extra libraries... -lpthread -ldl  -lutil -lm
checking python extra linking flags... -Xlinker -export-dynamic -Wl,-O1 -Wl,-Bsymbolic-functions
checking consistency of all components of python development environment... yes
checking whether we can build usable Python eggs... yes
checking for an old installation of the Mesos egg (before 0.20.0)... no
checking that generated files are newer than configure... done
configure: creating ./config.status
config.status: creating Makefile
config.status: creating mesos.pc
config.status: creating src/Makefile
config.status: creating 3rdparty/Makefile
config.status: creating 3rdparty/libprocess/Makefile
config.status: creating 3rdparty/libprocess/include/Makefile
config.status: creating 3rdparty/stout/Makefile
config.status: creating 3rdparty/stout/include/Makefile
config.status: creating 3rdparty/gmock_sources.cc
config.status: creating bin/mesos.sh
config.status: creating bin/mesos-agent.sh
config.status: creating bin/mesos-local.sh
config.status: creating bin/mesos-master.sh
config.status: creating bin/mesos-slave.sh
config.status: creating bin/mesos-tests.sh
config.status: creating bin/mesos-agent-flags.sh
config.status: creating bin/mesos-local-flags.sh
config.status: creating bin/mesos-master-flags.sh
config.status: creating bin/mesos-slave-flags.sh
config.status: creating bin/mesos-tests-flags.sh
config.status: creating bin/gdb-mesos-agent.sh
config.status: creating bin/gdb-mesos-local.sh
config.status: creating bin/gdb-mesos-master.sh
config.status: creating bin/gdb-mesos-slave.sh
config.status: creating bin/gdb-mesos-tests.sh
config.status: creating bin/lldb-mesos-agent.sh
config.status: creating bin/lldb-mesos-local.sh
config.status: creating bin/lldb-mesos-master.sh
config.status: creating bin/lldb-mesos-slave.sh
config.status: creating bin/lldb-mesos-tests.sh
config.status: creating bin/valgrind-mesos-agent.sh
config.status: creating bin/valgrind-mesos-local.sh
config.status: creating bin/valgrind-mesos-master.sh
config.status: creating bin/valgrind-mesos-slave.sh
config.status: creating bin/valgrind-mesos-tests.sh
config.status: creating src/deploy/mesos-daemon.sh
config.status: creating src/deploy/mesos-start-agents.sh
config.status: creating src/deploy/mesos-start-cluster.sh
config.status: creating src/deploy/mesos-start-masters.sh
config.status: creating src/deploy/mesos-start-slaves.sh
config.status: creating src/deploy/mesos-stop-agents.sh
config.status: creating src/deploy/mesos-stop-cluster.sh
config.status: creating src/deploy/mesos-stop-masters.sh
config.status: creating src/deploy/mesos-stop-slaves.sh
config.status: creating include/mesos/version.hpp
config.status: creating src/java/generated/org/apache/mesos/MesosNativeLibrary.java
config.status: creating mpi/mpiexec-mesos
config.status: creating src/examples/java/test-exception-framework
config.status: creating src/examples/java/test-executor
config.status: creating src/examples/java/test-framework
config.status: creating src/examples/java/test-multiple-executors-framework
config.status: creating src/examples/java/test-log
config.status: creating src/examples/java/v1-test-framework
config.status: creating src/java/mesos.pom
config.status: creating src/examples/python/test-executor
config.status: creating src/examples/python/test-framework
config.status: creating src/python/setup.py
config.status: creating src/python/cli/setup.py
config.status: creating src/python/interface/setup.py
config.status: creating src/python/native_common/ext_modules.py
config.status: creating src/python/executor/setup.py
config.status: creating src/python/native/setup.py
config.status: creating src/python/scheduler/setup.py
config.status: linking src/python/native_common/ext_modules.py to src/python/executor/ext_modules.py
config.status: linking src/python/native_common/ext_modules.py to src/python/scheduler/ext_modules.py
config.status: executing depfiles commands
config.status: executing libtool commands
configure: Build option summary:
    CXX:        clang++-3.5
    CXXFLAGS:   -g1 -O0 -std=c++11
    CPPFLAGS:   -isystem /usr/include/subversion-1 -isystem /usr/include/apr-1 -isystem /usr/include/apr-1.0
      
    LDFLAGS:    
    LIBS:       -lz -lsvn_delta-1 -lsvn_subr-1 -levent_openssl -lssl -lcrypto -lsasl2 -levent_pthreads
-levent -lcurl -lapr-1  -lrt

make  dist-gzip am__post_remove_distdir='@:'
make[1]: Entering directory `/mesos'
if test -d "mesos-1.5.0"; then find "mesos-1.5.0" -type d ! -perm -200 -exec chmod u+w {}
';' && rm -rf "mesos-1.5.0" || { sleep 5 && rm -rf "mesos-1.5.0"; }; else
:; fi
test -d "mesos-1.5.0" || mkdir "mesos-1.5.0"
 (cd 3rdparty && make  top_distdir=../mesos-1.5.0 distdir=../mesos-1.5.0/3rdparty
\
     am__remove_distdir=: am__skip_length_check=: am__skip_mode_fix=: distdir)
make[2]: Entering directory `/mesos/3rdparty'
 (cd stout && make  top_distdir=../../mesos-1.5.0 distdir=../../mesos-1.5.0/3rdparty/stout
\
     am__remove_distdir=: am__skip_length_check=: am__skip_mode_fix=: distdir)
make[3]: Entering directory `/mesos/3rdparty/stout'
 (cd include && make  top_distdir=../../../mesos-1.5.0 distdir=../../../mesos-1.5.0/3rdparty/stout/include
\
     am__remove_distdir=: am__skip_length_check=: am__skip_mode_fix=: distdir)
make[4]: Entering directory `/mesos/3rdparty/stout/include'
make[4]: Leaving directory `/mesos/3rdparty/stout/include'
make  \
	  top_distdir="../../mesos-1.5.0" distdir="../../mesos-1.5.0/3rdparty/stout" \
	  dist-hook
make[4]: Entering directory `/mesos/3rdparty/stout'
cp -r ./3rdparty ../../mesos-1.5.0/3rdparty/stout/
make[4]: Leaving directory `/mesos/3rdparty/stout'
make[3]: Leaving directory `/mesos/3rdparty/stout'
 (cd libprocess && make  top_distdir=../../mesos-1.5.0 distdir=../../mesos-1.5.0/3rdparty/libprocess
\
     am__remove_distdir=: am__skip_length_check=: am__skip_mode_fix=: distdir)
make[3]: Entering directory `/mesos/3rdparty/libprocess'
 (cd include && make  top_distdir=../../../mesos-1.5.0 distdir=../../../mesos-1.5.0/3rdparty/libprocess/include
\
     am__remove_distdir=: am__skip_length_check=: am__skip_mode_fix=: distdir)
make[4]: Entering directory `/mesos/3rdparty/libprocess/include'
make[4]: Leaving directory `/mesos/3rdparty/libprocess/include'
make  \
	  top_distdir="../../mesos-1.5.0" distdir="../../mesos-1.5.0/3rdparty/libprocess" \
	  dist-hook
make[4]: Entering directory `/mesos/3rdparty/libprocess'
cp -r ./3rdparty ../../mesos-1.5.0/3rdparty/libprocess/
make[4]: Leaving directory `/mesos/3rdparty/libprocess'
make[3]: Leaving directory `/mesos/3rdparty/libprocess'
make[2]: Leaving directory `/mesos/3rdparty'
 (cd src && make  top_distdir=../mesos-1.5.0 distdir=../mesos-1.5.0/src \
     am__remove_distdir=: am__skip_length_check=: am__skip_mode_fix=: distdir)
make[2]: Entering directory `/mesos/src'
../3rdparty/protobuf-3.5.0/src/protoc -I../include -I.  --cpp_out=. resource_provider/storage/volume_profile.proto
/bin/bash: ../3rdparty/protobuf-3.5.0/src/protoc: No such file or directory
make[2]: *** [resource_provider/storage/volume_profile.pb.h] Error 127
make[2]: Leaving directory `/mesos/src'
make[1]: *** [distdir] Error 1
make[1]: Leaving directory `/mesos'
make: *** [dist] Error 2
+ docker rmi mesos-1514617284-6613
Untagged: mesos-1514617284-6613:latest
Deleted: sha256:70c01a1073000bfcfbbd074904423676269d5900110efa656feaffeb8c536ef3
Deleted: sha256:cb82e3bc7c70fb55009b583b0e5ecaa9d8ae4a3e87dc492fab6f88a1e93ca62e
Deleted: sha256:a540d96d0bd8cc623a703598494bda8747dd5261b687916c1eaef4ae61a8a107
Deleted: sha256:6bf1fc2a5da98d4a1b583b2430e0b3f4d3642bb00c9af2f8a2e5843c21d99e9d
Deleted: sha256:2c91261c997e01d3c59320215b3a3398d34561dfb2b28b4aec1043a0c4c6ef2a
Deleted: sha256:a9a5ac6fab94a9c50f48417908cc7d5545baab15507d10bb56f4d637e68ccad8
Deleted: sha256:266d353b8b22a1efdaaa9f3247ed9e149536bb4465277f8fc7c92df35e60e76d
Deleted: sha256:13a3df2526f2ed060c9082d7b93e520556de077b1d5eac0e0de75522cad2ce0a
Deleted: sha256:5a8b6efc85769886600ecd94da60c9bafb2657ea3b59cc04045ac8fa00c3cdd2
Deleted: sha256:6c06415f16cfa35edd157a9ff91bc1da6f56e881918e034ce939cebf2398134d
Deleted: sha256:1011c68809f3ad844d38cd21fee1b00b87c8c610225c5b10f3df9558568a4f3f
Deleted: sha256:bfdbe3fb68e73c7e54b4049f9ce103a7e325d645041b615d2cc59eae3ab5fa57
Deleted: sha256:593437fa8397607bd064ca46c6c4965ed2913a6f9e35be23d8bdfc7c262953c0
Deleted: sha256:3a216e36c5ea7160eb52a0d0cca883786814d239714108532e774895bc2dd641
Deleted: sha256:47076bab80549d2e24ac4c113fa4385946ff1bbd62c0a1ef720370fe14e3cfe8
Deleted: sha256:c7b94b1592565b877abc4a3e9f8148a73e9985ccf26175b5f6589177a16b239a
Deleted: sha256:57d9f54ce9b63a0e3b78a6e320e4a9258368ddab505e41ca25c12f9a36bab793
Deleted: sha256:7dd0605bfc74ed48036dd604a25428b7805ac44a545643cdf4fe22a565a75c94
Deleted: sha256:3290c27664163744df4e4c210f1629833458bf2394d676b7c79b06d8dec46432
Deleted: sha256:999bd2bb8792465c8fe048033f234ddf89e7941c0573b2a39157f3657c63e193
Deleted: sha256:128b257e6ad6e7abe3b1fe3f8047fde07e5ce89af8ea3c159d62a83fe200fd57
Deleted: sha256:9145106456de7791649945bddd408ca4877c33bfd03390ec54926ec8d0bfbc22
Deleted: sha256:a81c64d0ec15301d2d9ef81ab4565f6629528258d0780c35bcd21689a811c8e8
Deleted: sha256:2e8e4bce2a0027e501c13a3f8b37019303e25a1b34d4d1465d57e5363a33706d
Deleted: sha256:6ab2d158897ba89411df5b3524ab9091b1c1fd070f63cd4c7b25437e5194e3d8
Deleted: sha256:b1f7170e82c546829d1d24cbd31c6bbcc648d6909431fe84948c62e93bbac528
Deleted: sha256:ab53a483febfee6c175735c7d5991993b3822d14c6bd0ed9cf7df687e345faa9
Deleted: sha256:f7df8b5c56ebe4bafd3346ae4a5cb85544e6a4325625f297d9d93d300525b65f
Deleted: sha256:47cd05a8d6fe8ce3e7328f1e2ab505d5573c21b27fa7775f41c795fab8ab66d0
Deleted: sha256:3fb35243a8db5421c6bc87f11b065e76dd44ac916f9d2222001e8065347d05aa
Build step 'Execute shell' marked build as failure
Not sending mail to unregistered user yujie.jay@gmail.com
Not sending mail to unregistered user songzihao1990@gmail.com

Mime
View raw message