mesos-builds mailing list archives

Site index · List index
Message view « Date » · « Thread »
Top « Date » · « Thread »
From Apache Jenkins Server <jenk...@builds.apache.org>
Subject Build failed in Jenkins: Mesos-Buildbot » autotools,gcc,--verbose --disable-libtool-wrappers --enable-libevent --enable-ssl,GLOG_v=1 MESOS_VERBOSE=1,ubuntu:14.04,(ubuntu)&&(!ubuntu-us1)&&(!ubuntu-eu2)&&(!qnode3)&&(!H23) #4668
Date Sat, 23 Dec 2017 03:26:19 GMT
See <https://builds.apache.org/job/Mesos-Buildbot/BUILDTOOL=autotools,COMPILER=gcc,CONFIGURATION=--verbose%20--disable-libtool-wrappers%20--enable-libevent%20--enable-ssl,ENVIRONMENT=GLOG_v=1%20MESOS_VERBOSE=1,OS=ubuntu%3A14.04,label_exp=(ubuntu)&&(!ubuntu-us1)&&(!ubuntu-eu2)&&(!qnode3)&&(!H23)/4668/display/redirect?page=changes>

Changes:

[bmahler] Fixed a quota headroom violation during quota allocation.

[bmahler] Added a test for quota allocation including non-quota resources.

[bmahler] Added a note about quota fixes in the 1.5.0 CHANGELOG.

[bmahler] Removed a stale TODO in the allocator.

[yujie.jay] Renamed isCommandExecutor to isGeneratedForCommandTask.

[yujie.jay] Updated CHANGELOG about standalone container support.

[yujie.jay] Updated CHANGELOG about CSI support in 1.5.0.

[yujie.jay] Fixed compile error for `make distcheck`.

[yujie.jay] Updated CHANGELOG about MESOS-4945.

[yujie.jay] Made protobuf version 3+ a hard requirement for building Mesos.

------------------------------------------
[...truncated 212.71 KB...]
checking if g++ static flag -static works... yes
checking if g++ supports -c -o file.o... yes
checking if g++ supports -c -o file.o... (cached) yes
checking whether the g++ linker (/usr/bin/ld -m elf_x86_64) supports shared libraries... yes
checking dynamic linker characteristics... (cached) GNU/Linux ld.so
checking how to hardcode library paths into programs... immediate
configure: creating ./config.lt
config.lt: creating libtool
configure: Setting up CXXFLAGS for g++ version >= 4.8
checking whether C++ compiler accepts -fstack-protector-strong... no
checking whether g++ supports C++11 features by default... no
checking whether g++ supports C++11 features with -std=c++11... yes
checking if compiler needs -Werror to reject unknown flags... no
checking for the pthreads library -lpthreads... no
checking whether pthreads work without any flags... no
checking whether pthreads work with -Kthread... no
checking whether pthreads work with -kthread... no
checking for the pthreads library -llthread... no
checking whether pthreads work with -pthread... yes
checking for joinable pthread attribute... PTHREAD_CREATE_JOINABLE
checking if more special flags are required for pthreads... no
checking for PTHREAD_PRIO_INHERIT... yes
configure: Setting up build environment for x86_64 linux-gnu
checking for backtrace in -lunwind... no
checking for main in -lgflags... no
checking for patch... patch
checking fts.h usability... yes
checking fts.h presence... yes
checking for fts.h... yes
checking for library containing fts_close... none required
checking apr_pools.h usability... yes
checking apr_pools.h presence... yes
checking for apr_pools.h... yes
checking for apr_initialize in -lapr-1... yes
checking for curl_global_init in -lcurl... yes
checking for javac... /usr/bin/javac
checking for java... /usr/bin/java
checking value of Java system property 'java.home'... /usr/lib/jvm/java-7-openjdk-amd64/jre
configure: using JAVA_HOME=/usr/lib/jvm/java-7-openjdk-amd64
checking whether or not we can build with JNI... yes
checking for mvn... /usr/bin/mvn
checking event2/event.h usability... yes
checking event2/event.h presence... yes
checking for event2/event.h... yes
checking for event_base_new in -levent... yes
checking event2/thread.h usability... yes
checking event2/thread.h presence... yes
checking for event2/thread.h... yes
checking for evthread_use_pthreads in -levent_pthreads... yes
checking for sasl_done in -lsasl2... yes
checking SASL CRAM-MD5 support... yes
checking for RAND_poll in -lcrypto... yes
checking openssl/ssl.h usability... yes
checking openssl/ssl.h presence... yes
checking for openssl/ssl.h... yes
checking for SSL_CTX_new in -lssl... yes
checking event2/bufferevent_ssl.h usability... yes
checking event2/bufferevent_ssl.h presence... yes
checking for event2/bufferevent_ssl.h... yes
checking for bufferevent_openssl_get_ssl in -levent_openssl... yes
checking svn_version.h usability... yes
checking svn_version.h presence... yes
checking for svn_version.h... yes
checking for svn_stringbuf_create_ensure in -lsvn_subr-1... yes
checking svn_delta.h usability... yes
checking svn_delta.h presence... yes
checking for svn_delta.h... yes
checking for svn_txdelta in -lsvn_delta-1... yes
checking whether to enable the XFS disk isolator... no
checking zlib.h usability... yes
checking zlib.h presence... yes
checking for zlib.h... yes
checking for deflate, gzread, gzwrite, inflate in -lz... yes
checking C++ standard library for undefined behaviour with selected optimization level...
no
checking for a Python interpreter with version >= 2.6... python
checking for python... /usr/bin/python
checking for python version... 2.7
checking for python platform... linux2
checking for python script directory... ${prefix}/lib/python2.7/site-packages
checking for python extension module directory... ${exec_prefix}/lib/python2.7/site-packages
checking for python2.7... (cached) /usr/bin/python
checking for a version of Python >= '2.1.0'... yes
checking for a version of Python >= '2.6'... yes
checking for the distutils Python package... yes
checking for Python include path... -I/usr/include/python2.7
checking for Python library path... -L/usr/lib -lpython2.7
checking for Python site-packages path... /usr/lib/python2.7/dist-packages
checking python extra libraries... -lpthread -ldl  -lutil -lm
checking python extra linking flags... -Xlinker -export-dynamic -Wl,-O1 -Wl,-Bsymbolic-functions
checking consistency of all components of python development environment... yes
checking whether we can build usable Python eggs... cc1plus: warning: command line option
'-Wstrict-prototypes' is valid for C/ObjC but not for C++ [enabled by default]
yes
checking for an old installation of the Mesos egg (before 0.20.0)... no
checking that generated files are newer than configure... done
configure: creating ./config.status
config.status: creating Makefile
config.status: creating mesos.pc
config.status: creating src/Makefile
config.status: creating 3rdparty/Makefile
config.status: creating 3rdparty/libprocess/Makefile
config.status: creating 3rdparty/libprocess/include/Makefile
config.status: creating 3rdparty/stout/Makefile
config.status: creating 3rdparty/stout/include/Makefile
config.status: creating 3rdparty/gmock_sources.cc
config.status: creating bin/mesos.sh
config.status: creating bin/mesos-agent.sh
config.status: creating bin/mesos-local.sh
config.status: creating bin/mesos-master.sh
config.status: creating bin/mesos-slave.sh
config.status: creating bin/mesos-tests.sh
config.status: creating bin/mesos-agent-flags.sh
config.status: creating bin/mesos-local-flags.sh
config.status: creating bin/mesos-master-flags.sh
config.status: creating bin/mesos-slave-flags.sh
config.status: creating bin/mesos-tests-flags.sh
config.status: creating bin/gdb-mesos-agent.sh
config.status: creating bin/gdb-mesos-local.sh
config.status: creating bin/gdb-mesos-master.sh
config.status: creating bin/gdb-mesos-slave.sh
config.status: creating bin/gdb-mesos-tests.sh
config.status: creating bin/lldb-mesos-agent.sh
config.status: creating bin/lldb-mesos-local.sh
config.status: creating bin/lldb-mesos-master.sh
config.status: creating bin/lldb-mesos-slave.sh
config.status: creating bin/lldb-mesos-tests.sh
config.status: creating bin/valgrind-mesos-agent.sh
config.status: creating bin/valgrind-mesos-local.sh
config.status: creating bin/valgrind-mesos-master.sh
config.status: creating bin/valgrind-mesos-slave.sh
config.status: creating bin/valgrind-mesos-tests.sh
config.status: creating src/deploy/mesos-daemon.sh
config.status: creating src/deploy/mesos-start-agents.sh
config.status: creating src/deploy/mesos-start-cluster.sh
config.status: creating src/deploy/mesos-start-masters.sh
config.status: creating src/deploy/mesos-start-slaves.sh
config.status: creating src/deploy/mesos-stop-agents.sh
config.status: creating src/deploy/mesos-stop-cluster.sh
config.status: creating src/deploy/mesos-stop-masters.sh
config.status: creating src/deploy/mesos-stop-slaves.sh
config.status: creating include/mesos/version.hpp
config.status: creating src/java/generated/org/apache/mesos/MesosNativeLibrary.java
config.status: creating mpi/mpiexec-mesos
config.status: creating src/examples/java/test-exception-framework
config.status: creating src/examples/java/test-executor
config.status: creating src/examples/java/test-framework
config.status: creating src/examples/java/test-multiple-executors-framework
config.status: creating src/examples/java/test-log
config.status: creating src/examples/java/v1-test-framework
config.status: creating src/java/mesos.pom
config.status: creating src/examples/python/test-executor
config.status: creating src/examples/python/test-framework
config.status: creating src/python/setup.py
config.status: creating src/python/cli/setup.py
config.status: creating src/python/interface/setup.py
config.status: creating src/python/native_common/ext_modules.py
config.status: creating src/python/executor/setup.py
config.status: creating src/python/native/setup.py
config.status: creating src/python/scheduler/setup.py
config.status: linking src/python/native_common/ext_modules.py to src/python/executor/ext_modules.py
config.status: linking src/python/native_common/ext_modules.py to src/python/scheduler/ext_modules.py
config.status: executing depfiles commands
config.status: executing libtool commands
configure: Build option summary:
    CXX:        g++
    CXXFLAGS:   -g1 -O0 -Wno-unused-local-typedefs -std=c++11
    CPPFLAGS:   -isystem /usr/include/subversion-1 -isystem /usr/include/apr-1 -isystem /usr/include/apr-1.0
      
    LDFLAGS:    
    LIBS:       -lz -lsvn_delta-1 -lsvn_subr-1 -levent_openssl -lssl -lcrypto -lsasl2 -levent_pthreads
-levent -lcurl -lapr-1  -lrt

make  dist-gzip am__post_remove_distdir='@:'
make[1]: Entering directory `/mesos'
if test -d "mesos-1.5.0"; then find "mesos-1.5.0" -type d ! -perm -200 -exec chmod u+w {}
';' && rm -rf "mesos-1.5.0" || { sleep 5 && rm -rf "mesos-1.5.0"; }; else
:; fi
test -d "mesos-1.5.0" || mkdir "mesos-1.5.0"
 (cd 3rdparty && make  top_distdir=../mesos-1.5.0 distdir=../mesos-1.5.0/3rdparty
\
     am__remove_distdir=: am__skip_length_check=: am__skip_mode_fix=: distdir)
make[2]: Entering directory `/mesos/3rdparty'
 (cd stout && make  top_distdir=../../mesos-1.5.0 distdir=../../mesos-1.5.0/3rdparty/stout
\
     am__remove_distdir=: am__skip_length_check=: am__skip_mode_fix=: distdir)
make[3]: Entering directory `/mesos/3rdparty/stout'
 (cd include && make  top_distdir=../../../mesos-1.5.0 distdir=../../../mesos-1.5.0/3rdparty/stout/include
\
     am__remove_distdir=: am__skip_length_check=: am__skip_mode_fix=: distdir)
make[4]: Entering directory `/mesos/3rdparty/stout/include'
make[4]: Leaving directory `/mesos/3rdparty/stout/include'
make  \
	  top_distdir="../../mesos-1.5.0" distdir="../../mesos-1.5.0/3rdparty/stout" \
	  dist-hook
make[4]: Entering directory `/mesos/3rdparty/stout'
cp -r ./3rdparty ../../mesos-1.5.0/3rdparty/stout/
make[4]: Leaving directory `/mesos/3rdparty/stout'
make[3]: Leaving directory `/mesos/3rdparty/stout'
 (cd libprocess && make  top_distdir=../../mesos-1.5.0 distdir=../../mesos-1.5.0/3rdparty/libprocess
\
     am__remove_distdir=: am__skip_length_check=: am__skip_mode_fix=: distdir)
make[3]: Entering directory `/mesos/3rdparty/libprocess'
 (cd include && make  top_distdir=../../../mesos-1.5.0 distdir=../../../mesos-1.5.0/3rdparty/libprocess/include
\
     am__remove_distdir=: am__skip_length_check=: am__skip_mode_fix=: distdir)
make[4]: Entering directory `/mesos/3rdparty/libprocess/include'
make[4]: Leaving directory `/mesos/3rdparty/libprocess/include'
make  \
	  top_distdir="../../mesos-1.5.0" distdir="../../mesos-1.5.0/3rdparty/libprocess" \
	  dist-hook
make[4]: Entering directory `/mesos/3rdparty/libprocess'
cp -r ./3rdparty ../../mesos-1.5.0/3rdparty/libprocess/
make[4]: Leaving directory `/mesos/3rdparty/libprocess'
make[3]: Leaving directory `/mesos/3rdparty/libprocess'
make[2]: Leaving directory `/mesos/3rdparty'
 (cd src && make  top_distdir=../mesos-1.5.0 distdir=../mesos-1.5.0/src \
     am__remove_distdir=: am__skip_length_check=: am__skip_mode_fix=: distdir)
make[2]: Entering directory `/mesos/src'
../3rdparty/protobuf-3.5.0/src/protoc -I../include -I.  --cpp_out=. resource_provider/storage/volume_profile.proto
/bin/bash: ../3rdparty/protobuf-3.5.0/src/protoc: No such file or directory
make[2]: *** [resource_provider/storage/volume_profile.pb.h] Error 127
make[2]: Leaving directory `/mesos/src'
make[1]: *** [distdir] Error 1
make[1]: Leaving directory `/mesos'
make: *** [dist] Error 2
+ docker rmi mesos-1513997922-10749
Untagged: mesos-1513997922-10749:latest
Deleted: sha256:1820c272862b0e3d8fb88dbf45cf921e6b5f9a587a7d8fa55e549d9569b4d931
Deleted: sha256:b87b6ea8992a92eee26707304c2001cbdafd41beeb83b76b88a8be8bc2d47c5a
Deleted: sha256:53228632ec113e06babdfde6c53b68509c9d7175584d1f31ae0534669279673b
Deleted: sha256:0512dd8e6f1568617c286fb6645941cef5abc402ca83e7eef2a65d77d92d3019
Deleted: sha256:3fc5452a70b773e2d86286ef45845d8c678c460cafedf92b86520e68883c057c
Deleted: sha256:e004b26469a445b98156dad4ee51bb39b599182cfddf1a61dcdfc79fe212d8e1
Deleted: sha256:a642c870b2530bb42b2e8082af7de77f9df18f926c93daa93de6d9176b5af175
Deleted: sha256:860f2005bd31841c8f36a692bb0d4d7a693b8fd4b73a126b92ed9c4bda1ad9de
Deleted: sha256:781129b154446485954be63f4f63e46a8653a3e93aed445078bd4897f563ebf4
Deleted: sha256:7ae3c6911d41a4f2769faee5d6a067d266e0ac8293b5c197184cda4a098b7dc4
Deleted: sha256:196bd7f11d8e08e0e0cd923f50ed6a6fc7686e0d94d6c2ce5a871f7f3f785cbe
Deleted: sha256:752c66c01e7645de43a115874821334b1af895823d39efd8d2229319e4f468eb
Deleted: sha256:661860dad60038bf698e3f8f620aec3d796a5ae8d7e20c0af4a870fc2e85836c
Deleted: sha256:2121acb61cd683e31f360f58aa48d69d57996c7c4e65eefa68c53c2d94ac8cb3
Deleted: sha256:82626f3d55ebf17cf61a6b2e79f4aa332fe6b972bc7e005c2571e662e98ab4af
Deleted: sha256:982739647d32344cd5ffae430bf53467d4fb888c58abc608adacf9faf4756860
Deleted: sha256:38591fd6b2a76f30ec21b7a8d4cf1014a1b846548d128048b20c362bb45276dd
Deleted: sha256:ec19a792fae5ccee4e85d34d97e81e15f1d2176ac02c184ec7cd0684f4ee2d33
Deleted: sha256:59b5d5947331e94bb6d27692084bca19596adcbbef074805704dd79f57be3470
Deleted: sha256:df44d615b879aadc1dcb6fc356260204e42da152191e54d1bbd357788bcd72d6
Deleted: sha256:e6593ff0069a1cbe55311ff109634848c410ec2078f099bcce4547a742c691cc
Deleted: sha256:fb6c8699e2ef6ab4e6dcbff535a61073f29ae6db33aaca72ac7766849dacac23
Deleted: sha256:193ea918b3148e3361a57528d484b7ffa0cb2b928fc63a88839f3c23e88e0235
Deleted: sha256:95e5df4095007984b2b0c5cbe5e56b5bff2dc9787d3ceaa0851e4d4a9366bf03
Deleted: sha256:43967ef455d43690195ca22ce4dd9821749e6ffa5fe69c35222b758c0537e23d
Deleted: sha256:fe89627c3fe3d149d8c481ceb38ef15d1e4915abf2a1aaa7d6696ce10702f383
Deleted: sha256:13d0da5d96e64fabb1730a4c20b9104f2d30de83d288214a65b222c10cf0ce8c
Deleted: sha256:76479d558ed070ae1934a929e895048f5181cc118a97dee8736da91e447405e7
Deleted: sha256:d5e7bbf6adb3d4d2f88a3c134328dfa241901dfc6ad3b9d493f8749c25916641
Deleted: sha256:78bcc3dc66e3dd4e1c983ab0286c1155c4d3f5248ca0267ea86f7e99771e0632
Build step 'Execute shell' marked build as failure
Not sending mail to unregistered user yujie.jay@gmail.com

Mime
View raw message