mesos-builds mailing list archives

Site index · List index
Message view « Date » · « Thread »
Top « Date » · « Thread »
From Apache Jenkins Server <jenk...@builds.apache.org>
Subject Build failed in Jenkins: Mesos-Buildbot » autotools,clang,--verbose --disable-libtool-wrappers --enable-libevent --enable-ssl,GLOG_v=1 MESOS_VERBOSE=1,ubuntu:14.04,(ubuntu)&&(!ubuntu-us1)&&(!ubuntu-eu2)&&(!qnode3)&&(!H23) #4629
Date Tue, 19 Dec 2017 23:25:02 GMT
See <https://builds.apache.org/job/Mesos-Buildbot/BUILDTOOL=autotools,COMPILER=clang,CONFIGURATION=--verbose%20--disable-libtool-wrappers%20--enable-libevent%20--enable-ssl,ENVIRONMENT=GLOG_v=1%20MESOS_VERBOSE=1,OS=ubuntu%3A14.04,label_exp=(ubuntu)&&(!ubuntu-us1)&&(!ubuntu-eu2)&&(!qnode3)&&(!H23)/4629/display/redirect>

------------------------------------------
[...truncated 223.94 KB...]
checking if clang++-3.5 supports -c -o file.o... yes
checking if clang++-3.5 supports -c -o file.o... (cached) yes
checking whether the clang++-3.5 linker (/usr/bin/ld -m elf_x86_64) supports shared libraries...
yes
checking dynamic linker characteristics... (cached) GNU/Linux ld.so
checking how to hardcode library paths into programs... immediate
configure: creating ./config.lt
config.lt: creating libtool
checking whether C++ compiler accepts -fstack-protector-strong... yes
checking whether clang++-3.5 supports C++11 features by default... no
checking whether clang++-3.5 supports C++11 features with -std=c++11... yes
checking if compiler needs -Werror to reject unknown flags... yes
checking for the pthreads library -lpthreads... no
checking whether pthreads work without any flags... no
checking whether pthreads work with -Kthread... no
checking whether pthreads work with -kthread... no
checking for the pthreads library -llthread... no
checking whether pthreads work with -pthread... yes
checking for joinable pthread attribute... PTHREAD_CREATE_JOINABLE
checking if more special flags are required for pthreads... no
checking for PTHREAD_PRIO_INHERIT... yes
configure: Setting up build environment for x86_64 linux-gnu
checking for backtrace in -lunwind... no
checking for main in -lgflags... no
checking for patch... patch
checking fts.h usability... yes
checking fts.h presence... yes
checking for fts.h... yes
checking for library containing fts_close... none required
checking apr_pools.h usability... yes
checking apr_pools.h presence... yes
checking for apr_pools.h... yes
checking for apr_initialize in -lapr-1... yes
checking for curl_global_init in -lcurl... yes
checking for javac... /usr/bin/javac
checking for java... /usr/bin/java
checking value of Java system property 'java.home'... /usr/lib/jvm/java-7-openjdk-amd64/jre
configure: using JAVA_HOME=/usr/lib/jvm/java-7-openjdk-amd64
checking whether or not we can build with JNI... yes
checking for mvn... /usr/bin/mvn
checking event2/event.h usability... yes
checking event2/event.h presence... yes
checking for event2/event.h... yes
checking for event_base_new in -levent... yes
checking event2/thread.h usability... yes
checking event2/thread.h presence... yes
checking for event2/thread.h... yes
checking for evthread_use_pthreads in -levent_pthreads... yes
checking for sasl_done in -lsasl2... yes
checking SASL CRAM-MD5 support... yes
checking for RAND_poll in -lcrypto... yes
checking openssl/ssl.h usability... yes
checking openssl/ssl.h presence... yes
checking for openssl/ssl.h... yes
checking for SSL_CTX_new in -lssl... yes
checking event2/bufferevent_ssl.h usability... yes
checking event2/bufferevent_ssl.h presence... yes
checking for event2/bufferevent_ssl.h... yes
checking for bufferevent_openssl_get_ssl in -levent_openssl... yes
checking svn_version.h usability... yes
checking svn_version.h presence... yes
checking for svn_version.h... yes
checking for svn_stringbuf_create_ensure in -lsvn_subr-1... yes
checking svn_delta.h usability... yes
checking svn_delta.h presence... yes
checking for svn_delta.h... yes
checking for svn_txdelta in -lsvn_delta-1... yes
checking whether to enable the XFS disk isolator... no
checking zlib.h usability... yes
checking zlib.h presence... yes
checking for zlib.h... yes
checking for deflate, gzread, gzwrite, inflate in -lz... yes
checking C++ standard library for undefined behaviour with selected optimization level...
no
checking for a Python interpreter with version >= 2.6... python
checking for python... /usr/bin/python
checking for python version... 2.7
checking for python platform... linux2
checking for python script directory... ${prefix}/lib/python2.7/site-packages
checking for python extension module directory... ${exec_prefix}/lib/python2.7/site-packages
checking for python2.7... (cached) /usr/bin/python
checking for a version of Python >= '2.1.0'... yes
checking for a version of Python >= '2.6'... yes
checking for the distutils Python package... yes
checking for Python include path... -I/usr/include/python2.7
checking for Python library path... -L/usr/lib -lpython2.7
checking for Python site-packages path... /usr/lib/python2.7/dist-packages
checking python extra libraries... -lpthread -ldl  -lutil -lm
checking python extra linking flags... -Xlinker -export-dynamic -Wl,-O1 -Wl,-Bsymbolic-functions
checking consistency of all components of python development environment... yes
checking whether we can build usable Python eggs... yes
checking for an old installation of the Mesos egg (before 0.20.0)... no
checking that generated files are newer than configure... done
configure: creating ./config.status
config.status: creating Makefile
config.status: creating mesos.pc
config.status: creating src/Makefile
config.status: creating 3rdparty/Makefile
config.status: creating 3rdparty/libprocess/Makefile
config.status: creating 3rdparty/libprocess/include/Makefile
config.status: creating 3rdparty/stout/Makefile
config.status: creating 3rdparty/stout/include/Makefile
config.status: creating 3rdparty/gmock_sources.cc
config.status: creating bin/mesos.sh
config.status: creating bin/mesos-agent.sh
config.status: creating bin/mesos-local.sh
config.status: creating bin/mesos-master.sh
config.status: creating bin/mesos-slave.sh
config.status: creating bin/mesos-tests.sh
config.status: creating bin/mesos-agent-flags.sh
config.status: creating bin/mesos-local-flags.sh
config.status: creating bin/mesos-master-flags.sh
config.status: creating bin/mesos-slave-flags.sh
config.status: creating bin/mesos-tests-flags.sh
config.status: creating bin/gdb-mesos-agent.sh
config.status: creating bin/gdb-mesos-local.sh
config.status: creating bin/gdb-mesos-master.sh
config.status: creating bin/gdb-mesos-slave.sh
config.status: creating bin/gdb-mesos-tests.sh
config.status: creating bin/lldb-mesos-agent.sh
config.status: creating bin/lldb-mesos-local.sh
config.status: creating bin/lldb-mesos-master.sh
config.status: creating bin/lldb-mesos-slave.sh
config.status: creating bin/lldb-mesos-tests.sh
config.status: creating bin/valgrind-mesos-agent.sh
config.status: creating bin/valgrind-mesos-local.sh
config.status: creating bin/valgrind-mesos-master.sh
config.status: creating bin/valgrind-mesos-slave.sh
config.status: creating bin/valgrind-mesos-tests.sh
config.status: creating src/deploy/mesos-daemon.sh
config.status: creating src/deploy/mesos-start-agents.sh
config.status: creating src/deploy/mesos-start-cluster.sh
config.status: creating src/deploy/mesos-start-masters.sh
config.status: creating src/deploy/mesos-start-slaves.sh
config.status: creating src/deploy/mesos-stop-agents.sh
config.status: creating src/deploy/mesos-stop-cluster.sh
config.status: creating src/deploy/mesos-stop-masters.sh
config.status: creating src/deploy/mesos-stop-slaves.sh
config.status: creating include/mesos/version.hpp
config.status: creating src/java/generated/org/apache/mesos/MesosNativeLibrary.java
config.status: creating mpi/mpiexec-mesos
config.status: creating src/examples/java/test-exception-framework
config.status: creating src/examples/java/test-executor
config.status: creating src/examples/java/test-framework
config.status: creating src/examples/java/test-multiple-executors-framework
config.status: creating src/examples/java/test-log
config.status: creating src/examples/java/v1-test-framework
config.status: creating src/java/mesos.pom
config.status: creating src/examples/python/test-executor
config.status: creating src/examples/python/test-framework
config.status: creating src/python/setup.py
config.status: creating src/python/cli/setup.py
config.status: creating src/python/interface/setup.py
config.status: creating src/python/native_common/ext_modules.py
config.status: creating src/python/executor/setup.py
config.status: creating src/python/native/setup.py
config.status: creating src/python/scheduler/setup.py
config.status: linking src/python/native_common/ext_modules.py to src/python/executor/ext_modules.py
config.status: linking src/python/native_common/ext_modules.py to src/python/scheduler/ext_modules.py
config.status: executing depfiles commands
config.status: executing libtool commands
configure: Build option summary:
    CXX:        clang++-3.5
    CXXFLAGS:   -g1 -O0 -std=c++11
    CPPFLAGS:   -isystem /usr/include/subversion-1 -isystem /usr/include/apr-1 -isystem /usr/include/apr-1.0
      
    LDFLAGS:    
    LIBS:       -lz -lsvn_delta-1 -lsvn_subr-1 -levent_openssl -lssl -lcrypto -lsasl2 -levent_pthreads
-levent -lcurl -lapr-1  -lrt

make  dist-gzip am__post_remove_distdir='@:'
make[1]: Entering directory `/mesos'
if test -d "mesos-1.5.0"; then find "mesos-1.5.0" -type d ! -perm -200 -exec chmod u+w {}
';' && rm -rf "mesos-1.5.0" || { sleep 5 && rm -rf "mesos-1.5.0"; }; else
:; fi
test -d "mesos-1.5.0" || mkdir "mesos-1.5.0"
 (cd 3rdparty && make  top_distdir=../mesos-1.5.0 distdir=../mesos-1.5.0/3rdparty
\
     am__remove_distdir=: am__skip_length_check=: am__skip_mode_fix=: distdir)
make[2]: Entering directory `/mesos/3rdparty'
 (cd stout && make  top_distdir=../../mesos-1.5.0 distdir=../../mesos-1.5.0/3rdparty/stout
\
     am__remove_distdir=: am__skip_length_check=: am__skip_mode_fix=: distdir)
make[3]: Entering directory `/mesos/3rdparty/stout'
 (cd include && make  top_distdir=../../../mesos-1.5.0 distdir=../../../mesos-1.5.0/3rdparty/stout/include
\
     am__remove_distdir=: am__skip_length_check=: am__skip_mode_fix=: distdir)
make[4]: Entering directory `/mesos/3rdparty/stout/include'
make[4]: Leaving directory `/mesos/3rdparty/stout/include'
make  \
	  top_distdir="../../mesos-1.5.0" distdir="../../mesos-1.5.0/3rdparty/stout" \
	  dist-hook
make[4]: Entering directory `/mesos/3rdparty/stout'
cp -r ./3rdparty ../../mesos-1.5.0/3rdparty/stout/
make[4]: Leaving directory `/mesos/3rdparty/stout'
make[3]: Leaving directory `/mesos/3rdparty/stout'
 (cd libprocess && make  top_distdir=../../mesos-1.5.0 distdir=../../mesos-1.5.0/3rdparty/libprocess
\
     am__remove_distdir=: am__skip_length_check=: am__skip_mode_fix=: distdir)
make[3]: Entering directory `/mesos/3rdparty/libprocess'
 (cd include && make  top_distdir=../../../mesos-1.5.0 distdir=../../../mesos-1.5.0/3rdparty/libprocess/include
\
     am__remove_distdir=: am__skip_length_check=: am__skip_mode_fix=: distdir)
make[4]: Entering directory `/mesos/3rdparty/libprocess/include'
make[4]: Leaving directory `/mesos/3rdparty/libprocess/include'
make  \
	  top_distdir="../../mesos-1.5.0" distdir="../../mesos-1.5.0/3rdparty/libprocess" \
	  dist-hook
make[4]: Entering directory `/mesos/3rdparty/libprocess'
cp -r ./3rdparty ../../mesos-1.5.0/3rdparty/libprocess/
make[4]: Leaving directory `/mesos/3rdparty/libprocess'
make[3]: Leaving directory `/mesos/3rdparty/libprocess'
make[2]: Leaving directory `/mesos/3rdparty'
 (cd src && make  top_distdir=../mesos-1.5.0 distdir=../mesos-1.5.0/src \
     am__remove_distdir=: am__skip_length_check=: am__skip_mode_fix=: distdir)
make[2]: Entering directory `/mesos/src'
../3rdparty/protobuf-3.5.0/src/protoc -I../include -I.  --cpp_out=. csi/uri_volume_profile.proto
/bin/bash: ../3rdparty/protobuf-3.5.0/src/protoc: No such file or directory
make[2]: *** [csi/uri_volume_profile.pb.cc] Error 127
make[2]: Leaving directory `/mesos/src'
make[1]: *** [distdir] Error 1
make[1]: Leaving directory `/mesos'
make: *** [dist] Error 2
+ docker rmi mesos-1513725241-20460
Untagged: mesos-1513725241-20460:latest
Deleted: sha256:4806c5a3024727eba0d55c2d894360018edd9bcda7d11a6aeca075df4925d9a1
Deleted: sha256:00c41eb843203f9a1d80fcb424444f2f006df6226f13c31c89a4b5614821ddff
Deleted: sha256:c65ed168bf844cfa80eb11d083149ecfb0a2e8cb9eea0748522c54bf7b1f9fc4
Deleted: sha256:51bf235cc34976f8cc3a08ae1e80c628dccd9076ee3890b34ab85c50b1894659
Deleted: sha256:dca675566c93055c18a9eef2fc4f4d86aebc15e92c2a35c1e97cdde4b5df9c90
Deleted: sha256:bd557500861bd733e2d3cf7e3615fc551eb8bec9745c8256761ef965840c94b1
Deleted: sha256:629e82e8fe3b39ab5a0677c426056e0c1ddf146ff5f863d3c41d0a4cc2bb66a0
Deleted: sha256:95832463d2b12098fd75f12e5ac0901111eaff422e2634c119b70a2c24d32706
Deleted: sha256:1520ee73f57b8f4456f8d44da3b0d7e93b0d300c0b6c0e856e8d02ff561eaad7
Deleted: sha256:eb80feb1abf712d5b11762f41162fe7eadbd8b0381f86d5768c526bdab05a066
Deleted: sha256:d641ee907bbb17ac4956d9c15f752f01ea9a27a50196a5d5fa97e5c3d5766971
Deleted: sha256:4a50e74b808b9af0c58431195bd7a9bef072b5d52844413ec10f24da7d38497d
Deleted: sha256:36b77d0177dc9b5b546783d5c432cc5ec7fc2db75370c7910c87af2f4d3101ed
Deleted: sha256:f9f19829a680d3d10da2be919825f0be937e1ee5f30ff8592692df775c95cfeb
Deleted: sha256:94a89e37675fbfc4345ba0482a940a5b3f33aff1b546907f189f0d0bf3059e18
Deleted: sha256:a9fa023796d92bdc5570c5df7bf4dfa330772a5d94d0d11023bc103bd0b33912
Deleted: sha256:9a94ac397dcd1aa3b240ccdd4afc8b5f73153daa220a0c1abd4d52bec7140595
Deleted: sha256:6d21e7edc0472fe68188ce9d3fbcbd9d807a9ffb76a801f8b0f41bfc621e5a0f
Deleted: sha256:eba4b3570ab50fc6b609129469ed4086afa3d9df78b100c12e4f0e4fe7512148
Deleted: sha256:b539e6070b138bd35516f1b65e0119c45a46997a2cadd4ae48cdf6ca3caacff9
Deleted: sha256:af3cf8d66d49088aa595520111cbab8c8a6104465c80a12a60c0810b2dbb6072
Deleted: sha256:b9d225bd369f997ccaf3a8d7776996e1aa9fdb13a263ce8e2a8e9358e71eaf29
Deleted: sha256:ba54b79b7323997e0749441935a8e3ae6ced51c6cd707eb388993abcba2a3369
Deleted: sha256:0ea3266bec66928d6de359418c82e28ecd9cbd23f33cfc18f9a0c7c1bb6a4f87
Deleted: sha256:3b84d0ade83009142049e8d33253ea5201d2f27155134c2708bb28cab8ce19c4
Deleted: sha256:45807eb05bb4154adc2f58e995a461df5415d2fedd51a29a202bf9b8ce7a4edb
Deleted: sha256:601d6a186479e104cb3ad011d5bdd5e3a23625ac5d1a9f3034a10bc989de5686
Deleted: sha256:53df88d11955e2f486a4eab6ba1623436cbc1af0fe2546efa8fa6d462251dc2a
Deleted: sha256:35f9820d67f69067951bd19485b751b6a7f7d4e95f46300509deb26110a07b9f
Deleted: sha256:b6a0f03ef20db0d74a690800b596f32b4e3ae222d7fdea066938b823b9c6903e
Build step 'Execute shell' marked build as failure
Not sending mail to unregistered user songzihao1990@gmail.com
Not sending mail to unregistered user xujyan@apple.com
Not sending mail to unregistered user gregorywmann@gmail.com
Not sending mail to unregistered user yujie.jay@gmail.com

Mime
View raw message