mesos-builds mailing list archives

Site index · List index
Message view « Date » · « Thread »
Top « Date » · « Thread »
From Apache Jenkins Server <jenk...@builds.apache.org>
Subject Build failed in Jenkins: Mesos-Buildbot » autotools,gcc,--verbose --disable-libtool-wrappers,GLOG_v=1 MESOS_VERBOSE=1,centos:7,(ubuntu)&&(!ubuntu-us1)&&(!ubuntu-eu2)&&(!qnode3)&&(!H23) #4626
Date Tue, 19 Dec 2017 20:11:31 GMT
See <https://builds.apache.org/job/Mesos-Buildbot/BUILDTOOL=autotools,COMPILER=gcc,CONFIGURATION=--verbose%20--disable-libtool-wrappers,ENVIRONMENT=GLOG_v=1%20MESOS_VERBOSE=1,OS=centos%3A7,label_exp=(ubuntu)&&(!ubuntu-us1)&&(!ubuntu-eu2)&&(!qnode3)&&(!H23)/4626/display/redirect?page=changes>

Changes:

[alexr] Added containerClass() to MesosContainerizerProcess::Container.

[alexr] Added logging based on container class.

[alexr] Fixed flaky `ROOT_CGROUPS_RecoverLauncherOrphans` test.

------------------------------------------
[...truncated 152.79 KB...]
checking if g++ static flag -static works... no
checking if g++ supports -c -o file.o... yes
checking if g++ supports -c -o file.o... (cached) yes
checking whether the g++ linker (/usr/bin/ld -m elf_x86_64) supports shared libraries... yes
checking dynamic linker characteristics... (cached) GNU/Linux ld.so
checking how to hardcode library paths into programs... immediate
configure: creating ./config.lt
config.lt: creating libtool
configure: Setting up CXXFLAGS for g++ version >= 4.8
checking whether C++ compiler accepts -fstack-protector-strong... yes
checking whether g++ supports C++11 features by default... no
checking whether g++ supports C++11 features with -std=c++11... yes
checking if compiler needs -Werror to reject unknown flags... no
checking for the pthreads library -lpthreads... no
checking whether pthreads work without any flags... no
checking whether pthreads work with -Kthread... no
checking whether pthreads work with -kthread... no
checking for the pthreads library -llthread... no
checking whether pthreads work with -pthread... yes
checking for joinable pthread attribute... PTHREAD_CREATE_JOINABLE
checking if more special flags are required for pthreads... no
checking for PTHREAD_PRIO_INHERIT... yes
configure: Setting up build environment for x86_64 linux-gnu
checking for backtrace in -lunwind... no
checking for main in -lgflags... no
checking for patch... patch
checking fts.h usability... yes
checking fts.h presence... yes
checking for fts.h... yes
checking for library containing fts_close... none required
checking apr_pools.h usability... yes
checking apr_pools.h presence... yes
checking for apr_pools.h... yes
checking for apr_initialize in -lapr-1... yes
checking for curl_global_init in -lcurl... yes
checking for javac... /usr/bin/javac
checking for java... /usr/bin/java
checking value of Java system property 'java.home'... /usr/lib/jvm/java-1.8.0-openjdk-1.8.0.151-1.b12.el7_4.x86_64/jre
configure: using JAVA_HOME=/usr/lib/jvm/java-1.8.0-openjdk-1.8.0.151-1.b12.el7_4.x86_64
checking whether or not we can build with JNI... yes
checking for mvn... /usr/bin/mvn
checking for sasl_done in -lsasl2... yes
checking SASL CRAM-MD5 support... yes
checking for RAND_poll in -lcrypto... yes
checking openssl/ssl.h usability... yes
checking openssl/ssl.h presence... yes
checking for openssl/ssl.h... yes
checking for SSL_CTX_new in -lssl... yes
checking svn_version.h usability... yes
checking svn_version.h presence... yes
checking for svn_version.h... yes
checking for svn_stringbuf_create_ensure in -lsvn_subr-1... yes
checking svn_delta.h usability... yes
checking svn_delta.h presence... yes
checking for svn_delta.h... yes
checking for svn_txdelta in -lsvn_delta-1... yes
checking whether to enable the XFS disk isolator... no
checking zlib.h usability... yes
checking zlib.h presence... yes
checking for zlib.h... yes
checking for deflate, gzread, gzwrite, inflate in -lz... yes
checking C++ standard library for undefined behaviour with selected optimization level...
no
checking for a Python interpreter with version >= 2.6... python
checking for python... /usr/bin/python
checking for python version... 2.7
checking for python platform... linux2
checking for python script directory... ${prefix}/lib/python2.7/site-packages
checking for python extension module directory... ${exec_prefix}/lib64/python2.7/site-packages
checking for python2.7... (cached) /usr/bin/python
checking for a version of Python >= '2.1.0'... yes
checking for a version of Python >= '2.6'... yes
checking for the distutils Python package... yes
checking for Python include path... -I/usr/include/python2.7
checking for Python library path... -L/usr/lib64 -lpython2.7
checking for Python site-packages path... /usr/lib/python2.7/site-packages
checking python extra libraries... -lpthread -ldl  -lutil -lm
checking python extra linking flags... -Xlinker -export-dynamic
checking consistency of all components of python development environment... yes
checking whether we can build usable Python eggs... In file included from /usr/include/limits.h:26:0,
                 from /usr/lib/gcc/x86_64-redhat-linux/4.8.5/include/limits.h:168,
                 from /usr/lib/gcc/x86_64-redhat-linux/4.8.5/include/syslimits.h:7,
                 from /usr/lib/gcc/x86_64-redhat-linux/4.8.5/include/limits.h:34,
                 from /usr/include/python2.7/Python.h:19,
                 from testpyegg.cpp:1:
/usr/include/features.h:330:4: warning: #warning _FORTIFY_SOURCE requires compiling with optimization
(-O) [-Wcpp]
 #  warning _FORTIFY_SOURCE requires compiling with optimization (-O)
    ^
yes
checking for an old installation of the Mesos egg (before 0.20.0)... no
checking that generated files are newer than configure... done
configure: creating ./config.status
config.status: creating Makefile
config.status: creating mesos.pc
config.status: creating src/Makefile
config.status: creating 3rdparty/Makefile
config.status: creating 3rdparty/libprocess/Makefile
config.status: creating 3rdparty/libprocess/include/Makefile
config.status: creating 3rdparty/stout/Makefile
config.status: creating 3rdparty/stout/include/Makefile
config.status: creating 3rdparty/gmock_sources.cc
config.status: creating bin/mesos.sh
config.status: creating bin/mesos-agent.sh
config.status: creating bin/mesos-local.sh
config.status: creating bin/mesos-master.sh
config.status: creating bin/mesos-slave.sh
config.status: creating bin/mesos-tests.sh
config.status: creating bin/mesos-agent-flags.sh
config.status: creating bin/mesos-local-flags.sh
config.status: creating bin/mesos-master-flags.sh
config.status: creating bin/mesos-slave-flags.sh
config.status: creating bin/mesos-tests-flags.sh
config.status: creating bin/gdb-mesos-agent.sh
config.status: creating bin/gdb-mesos-local.sh
config.status: creating bin/gdb-mesos-master.sh
config.status: creating bin/gdb-mesos-slave.sh
config.status: creating bin/gdb-mesos-tests.sh
config.status: creating bin/lldb-mesos-agent.sh
config.status: creating bin/lldb-mesos-local.sh
config.status: creating bin/lldb-mesos-master.sh
config.status: creating bin/lldb-mesos-slave.sh
config.status: creating bin/lldb-mesos-tests.sh
config.status: creating bin/valgrind-mesos-agent.sh
config.status: creating bin/valgrind-mesos-local.sh
config.status: creating bin/valgrind-mesos-master.sh
config.status: creating bin/valgrind-mesos-slave.sh
config.status: creating bin/valgrind-mesos-tests.sh
config.status: creating src/deploy/mesos-daemon.sh
config.status: creating src/deploy/mesos-start-agents.sh
config.status: creating src/deploy/mesos-start-cluster.sh
config.status: creating src/deploy/mesos-start-masters.sh
config.status: creating src/deploy/mesos-start-slaves.sh
config.status: creating src/deploy/mesos-stop-agents.sh
config.status: creating src/deploy/mesos-stop-cluster.sh
config.status: creating src/deploy/mesos-stop-masters.sh
config.status: creating src/deploy/mesos-stop-slaves.sh
config.status: creating include/mesos/version.hpp
config.status: creating src/java/generated/org/apache/mesos/MesosNativeLibrary.java
config.status: creating mpi/mpiexec-mesos
config.status: creating src/examples/java/test-exception-framework
config.status: creating src/examples/java/test-executor
config.status: creating src/examples/java/test-framework
config.status: creating src/examples/java/test-multiple-executors-framework
config.status: creating src/examples/java/test-log
config.status: creating src/examples/java/v1-test-framework
config.status: creating src/java/mesos.pom
config.status: creating src/examples/python/test-executor
config.status: creating src/examples/python/test-framework
config.status: creating src/python/setup.py
config.status: creating src/python/cli/setup.py
config.status: creating src/python/interface/setup.py
config.status: creating src/python/native_common/ext_modules.py
config.status: creating src/python/executor/setup.py
config.status: creating src/python/native/setup.py
config.status: creating src/python/scheduler/setup.py
config.status: linking src/python/native_common/ext_modules.py to src/python/executor/ext_modules.py
config.status: linking src/python/native_common/ext_modules.py to src/python/scheduler/ext_modules.py
config.status: executing depfiles commands
config.status: executing libtool commands
configure: Build option summary:
    CXX:        g++
    CXXFLAGS:   -g1 -O0 -Wno-unused-local-typedefs -std=c++11
    CPPFLAGS:   -isystem /usr/include/subversion-1 -isystem /usr/include/apr-1 -isystem /usr/include/apr-1.0
      
    LDFLAGS:    
    LIBS:       -lz -lsvn_delta-1 -lsvn_subr-1 -lsasl2 -lcurl -lapr-1  -lrt

make  dist-gzip am__post_remove_distdir='@:'
make[1]: Entering directory `/mesos'
if test -d "mesos-1.5.0"; then find "mesos-1.5.0" -type d ! -perm -200 -exec chmod u+w {}
';' && rm -rf "mesos-1.5.0" || { sleep 5 && rm -rf "mesos-1.5.0"; }; else
:; fi
test -d "mesos-1.5.0" || mkdir "mesos-1.5.0"
 (cd 3rdparty && make  top_distdir=../mesos-1.5.0 distdir=../mesos-1.5.0/3rdparty
\
     am__remove_distdir=: am__skip_length_check=: am__skip_mode_fix=: distdir)
make[2]: Entering directory `/mesos/3rdparty'
 (cd stout && make  top_distdir=../../mesos-1.5.0 distdir=../../mesos-1.5.0/3rdparty/stout
\
     am__remove_distdir=: am__skip_length_check=: am__skip_mode_fix=: distdir)
make[3]: Entering directory `/mesos/3rdparty/stout'
 (cd include && make  top_distdir=../../../mesos-1.5.0 distdir=../../../mesos-1.5.0/3rdparty/stout/include
\
     am__remove_distdir=: am__skip_length_check=: am__skip_mode_fix=: distdir)
make[4]: Entering directory `/mesos/3rdparty/stout/include'
make[4]: Leaving directory `/mesos/3rdparty/stout/include'
make  \
  top_distdir="../../mesos-1.5.0" distdir="../../mesos-1.5.0/3rdparty/stout" \
  dist-hook
make[4]: Entering directory `/mesos/3rdparty/stout'
cp -r ./3rdparty ../../mesos-1.5.0/3rdparty/stout/
make[4]: Leaving directory `/mesos/3rdparty/stout'
make[3]: Leaving directory `/mesos/3rdparty/stout'
 (cd libprocess && make  top_distdir=../../mesos-1.5.0 distdir=../../mesos-1.5.0/3rdparty/libprocess
\
     am__remove_distdir=: am__skip_length_check=: am__skip_mode_fix=: distdir)
make[3]: Entering directory `/mesos/3rdparty/libprocess'
 (cd include && make  top_distdir=../../../mesos-1.5.0 distdir=../../../mesos-1.5.0/3rdparty/libprocess/include
\
     am__remove_distdir=: am__skip_length_check=: am__skip_mode_fix=: distdir)
make[4]: Entering directory `/mesos/3rdparty/libprocess/include'
make[4]: Leaving directory `/mesos/3rdparty/libprocess/include'
make  \
  top_distdir="../../mesos-1.5.0" distdir="../../mesos-1.5.0/3rdparty/libprocess" \
  dist-hook
make[4]: Entering directory `/mesos/3rdparty/libprocess'
cp -r ./3rdparty ../../mesos-1.5.0/3rdparty/libprocess/
make[4]: Leaving directory `/mesos/3rdparty/libprocess'
make[3]: Leaving directory `/mesos/3rdparty/libprocess'
make[2]: Leaving directory `/mesos/3rdparty'
 (cd src && make  top_distdir=../mesos-1.5.0 distdir=../mesos-1.5.0/src \
     am__remove_distdir=: am__skip_length_check=: am__skip_mode_fix=: distdir)
make[2]: Entering directory `/mesos/src'
../3rdparty/protobuf-3.5.0/src/protoc -I../include -I.  --cpp_out=. csi/uri_volume_profile.proto
make[2]: ../3rdparty/protobuf-3.5.0/src/protoc: Command not found
make[2]: *** [csi/uri_volume_profile.pb.cc] Error 127
make[2]: Leaving directory `/mesos/src'
make[1]: *** [distdir] Error 1
make[1]: Leaving directory `/mesos'
make: *** [dist] Error 2
+ docker rmi mesos-1513713742-16899
Untagged: mesos-1513713742-16899:latest
Deleted: sha256:679a28d03070c5cfd7c1ffbb5ab098ad46de5503998cd38bab0cfc3947c76e34
Deleted: sha256:6ca85f5248b97a8c24b8f662634854629a4a2737c340e2012e8b0fe30b5d00e6
Deleted: sha256:30ff5bb1aea70be7ad178a58ef81c0c3da5055038fcb408c88875f331248617e
Deleted: sha256:235333a7f118b4afd331ae4d3c35b1dc16018571a9a26929f73cc6c6ae066313
Deleted: sha256:810fcad4ceb80c294e8924e95aaf18637d8877d2a5c43a39c401759655b1a707
Deleted: sha256:f0a2b0c58c5d002d390ce227e535e0204ce6abda4bdc91ab867e616721946420
Deleted: sha256:5367421fea8c5b0deddb581354e853756fe069dc8cacfdb844b027319f070dfd
Deleted: sha256:7cf115dc8ee0e61dfa9c580edd29480abf71b1b9bd14810dc8602de22003e846
Deleted: sha256:c5bd155fa0b58f1782130c672e5b4e4e9e07e04f426bb79c4d76a17bd89233b8
Deleted: sha256:35f3017c9c410bb378bb89b0a5a61690153c029c80795ccfbd61b18974b8d239
Deleted: sha256:ea8d5dc017f263bf440bc53a1b33faf57937f24db1cee818d1d1cb3f0c189b2e
Deleted: sha256:957fafaada2f71a56fb8fd1a562af27570ee5ed6c9827096b0f0cf9a9e65dabb
Deleted: sha256:9ac738ce7ac5f1c2800d502731e7a9e920068c41c6dfe442d52cc2bb0ea02aef
Deleted: sha256:479ed1f218c95a60df683857c1ebf10cafc6cad7c332cdac35269db313664a3e
Deleted: sha256:7fb95466ecf72c8240b233914d08cbdad019fd6672c8534088d5967c6e22a5fc
Deleted: sha256:a45be9086a9b84ae1fc18510750e7f48e519b2acd9fe317caecbd63d9c4cb92d
Deleted: sha256:40bdf08db0b287b7561239a520548ff3d599a28563e07370085265af06716dc3
Deleted: sha256:be030b0d15820c623e8c4a93a724f23e52e89b8492b859eb54590d427ddae411
Deleted: sha256:b04531264e0cdbf1118a6e413bbdac2c34d616538187cf06290b770de10362de
Deleted: sha256:7a0a1a10fa39f7fa42135291fb4abf99019632904485cc3883af5c082350bbc3
Deleted: sha256:1adbdb7c32017a712c318f17bf3e5fa4c8f484ad46ded9491acf44498bf7f18d
Deleted: sha256:b8c2e8c65d17fbb5d9f4312a56e46e489629746f53a00197027272e93c06d60e
Deleted: sha256:dcf3f7ab6937804c30071eb1bd8dc85db336b02f63d28ad57b18e709578bf823
Deleted: sha256:f0612ca07a1cb5a19ebe9f023253de1f5ffea183a5656ab3d4e559063266c808
Deleted: sha256:32a47c01397c4219007bdd54e5f52b4aa67df9d8fdfeb2e3be6da032ea68ac7e
Deleted: sha256:cb6397dabc34901af555ab8331796e42339376410e238cde500843db2860f831
Deleted: sha256:ea37c9b89f413a7733a533433adeab74eb4aeff33caefbd69f6b63f3f4bed361
Deleted: sha256:70b885f4f04e1ea348339f600b676d30e6be3d94e2c7bde30a1ec015932a552f
Deleted: sha256:5450c9191e2859fd5e6220713b9fc9edf0c5f2726d1b952f05fafd9bb6d97970
Build step 'Execute shell' marked build as failure
Not sending mail to unregistered user songzihao1990@gmail.com
Not sending mail to unregistered user xujyan@apple.com
Not sending mail to unregistered user zhq527725@gmail.com
Not sending mail to unregistered user yujie.jay@gmail.com
Not sending mail to unregistered user benjamin.hindman@gmail.com
Not sending mail to unregistered user gregorywmann@gmail.com

Mime
View raw message