mesos-builds mailing list archives

Site index · List index
Message view « Date » · « Thread »
Top « Date » · « Thread »
From Apache Jenkins Server <jenk...@builds.apache.org>
Subject Build failed in Jenkins: Mesos-Reviewbot #20733
Date Tue, 19 Dec 2017 05:15:04 GMT
See <https://builds.apache.org/job/Mesos-Reviewbot/20733/display/redirect>

------------------------------------------
[...truncated 221.94 KB...]
checking whether -lc should be explicitly linked in... no
checking dynamic linker characteristics... GNU/Linux ld.so
checking how to hardcode library paths into programs... immediate
checking whether stripping libraries is possible... yes
checking if libtool supports shared libraries... yes
checking whether to build shared libraries... yes
checking whether to build static libraries... no
checking how to run the C++ preprocessor... g++ -E
checking for ld used by g++... /usr/bin/ld -m elf_x86_64
checking if the linker (/usr/bin/ld -m elf_x86_64) is GNU ld... yes
checking whether the g++ linker (/usr/bin/ld -m elf_x86_64) supports shared libraries... yes
checking for g++ option to produce PIC... -fPIC -DPIC
checking if g++ PIC flag -fPIC -DPIC works... yes
checking if g++ static flag -static works... yes
checking if g++ supports -c -o file.o... yes
checking if g++ supports -c -o file.o... (cached) yes
checking whether the g++ linker (/usr/bin/ld -m elf_x86_64) supports shared libraries... yes
checking dynamic linker characteristics... (cached) GNU/Linux ld.so
checking how to hardcode library paths into programs... immediate
configure: creating ./config.lt
config.lt: creating libtool
configure: Setting up CXXFLAGS for g++ version >= 4.8
checking whether C++ compiler accepts -fstack-protector-strong... no
checking whether g++ supports C++11 features by default... no
checking whether g++ supports C++11 features with -std=c++11... yes
checking if compiler needs -Werror to reject unknown flags... no
checking for the pthreads library -lpthreads... no
checking whether pthreads work without any flags... no
checking whether pthreads work with -Kthread... no
checking whether pthreads work with -kthread... no
checking for the pthreads library -llthread... no
checking whether pthreads work with -pthread... yes
checking for joinable pthread attribute... PTHREAD_CREATE_JOINABLE
checking if more special flags are required for pthreads... no
checking for PTHREAD_PRIO_INHERIT... yes
configure: Setting up build environment for x86_64 linux-gnu
checking for backtrace in -lunwind... no
checking for main in -lgflags... no
checking for patch... patch
checking fts.h usability... yes
checking fts.h presence... yes
checking for fts.h... yes
checking for library containing fts_close... none required
checking apr_pools.h usability... yes
checking apr_pools.h presence... yes
checking for apr_pools.h... yes
checking for apr_initialize in -lapr-1... yes
checking for curl_global_init in -lcurl... yes
checking for javac... /usr/bin/javac
checking for java... /usr/bin/java
checking value of Java system property 'java.home'... /usr/lib/jvm/java-7-openjdk-amd64/jre
configure: using JAVA_HOME=/usr/lib/jvm/java-7-openjdk-amd64
checking whether or not we can build with JNI... yes
checking for mvn... /usr/bin/mvn
checking for sasl_done in -lsasl2... yes
checking SASL CRAM-MD5 support... yes
checking for RAND_poll in -lcrypto... yes
checking openssl/ssl.h usability... yes
checking openssl/ssl.h presence... yes
checking for openssl/ssl.h... yes
checking for SSL_CTX_new in -lssl... yes
checking svn_version.h usability... yes
checking svn_version.h presence... yes
checking for svn_version.h... yes
checking for svn_stringbuf_create_ensure in -lsvn_subr-1... yes
checking svn_delta.h usability... yes
checking svn_delta.h presence... yes
checking for svn_delta.h... yes
checking for svn_txdelta in -lsvn_delta-1... yes
checking whether to enable the XFS disk isolator... no
checking zlib.h usability... yes
checking zlib.h presence... yes
checking for zlib.h... yes
checking for deflate, gzread, gzwrite, inflate in -lz... yes
checking C++ standard library for undefined behaviour with selected optimization level...
no
checking for a Python interpreter with version >= 2.6... python
checking for python... /usr/bin/python
checking for python version... 2.7
checking for python platform... linux2
checking for python script directory... ${prefix}/lib/python2.7/site-packages
checking for python extension module directory... ${exec_prefix}/lib/python2.7/site-packages
checking for python2.7... (cached) /usr/bin/python
checking for a version of Python >= '2.1.0'... yes
checking for a version of Python >= '2.6'... yes
checking for the distutils Python package... yes
checking for Python include path... -I/usr/include/python2.7
checking for Python library path... -L/usr/lib -lpython2.7
checking for Python site-packages path... /usr/lib/python2.7/dist-packages
checking python extra libraries... -lpthread -ldl  -lutil -lm
checking python extra linking flags... -Xlinker -export-dynamic -Wl,-O1 -Wl,-Bsymbolic-functions
checking consistency of all components of python development environment... yes
checking whether we can build usable Python eggs... cc1plus: warning: command line option
'-Wstrict-prototypes' is valid for C/ObjC but not for C++ [enabled by default]
yes
checking for an old installation of the Mesos egg (before 0.20.0)... no
checking that generated files are newer than configure... done
configure: creating ./config.status
config.status: creating Makefile
config.status: creating mesos.pc
config.status: creating src/Makefile
config.status: creating 3rdparty/Makefile
config.status: creating 3rdparty/libprocess/Makefile
config.status: creating 3rdparty/libprocess/include/Makefile
config.status: creating 3rdparty/stout/Makefile
config.status: creating 3rdparty/stout/include/Makefile
config.status: creating 3rdparty/gmock_sources.cc
config.status: creating bin/mesos.sh
config.status: creating bin/mesos-agent.sh
config.status: creating bin/mesos-local.sh
config.status: creating bin/mesos-master.sh
config.status: creating bin/mesos-slave.sh
config.status: creating bin/mesos-tests.sh
config.status: creating bin/mesos-agent-flags.sh
config.status: creating bin/mesos-local-flags.sh
config.status: creating bin/mesos-master-flags.sh
config.status: creating bin/mesos-slave-flags.sh
config.status: creating bin/mesos-tests-flags.sh
config.status: creating bin/gdb-mesos-agent.sh
config.status: creating bin/gdb-mesos-local.sh
config.status: creating bin/gdb-mesos-master.sh
config.status: creating bin/gdb-mesos-slave.sh
config.status: creating bin/gdb-mesos-tests.sh
config.status: creating bin/lldb-mesos-agent.sh
config.status: creating bin/lldb-mesos-local.sh
config.status: creating bin/lldb-mesos-master.sh
config.status: creating bin/lldb-mesos-slave.sh
config.status: creating bin/lldb-mesos-tests.sh
config.status: creating bin/valgrind-mesos-agent.sh
config.status: creating bin/valgrind-mesos-local.sh
config.status: creating bin/valgrind-mesos-master.sh
config.status: creating bin/valgrind-mesos-slave.sh
config.status: creating bin/valgrind-mesos-tests.sh
config.status: creating src/deploy/mesos-daemon.sh
config.status: creating src/deploy/mesos-start-agents.sh
config.status: creating src/deploy/mesos-start-cluster.sh
config.status: creating src/deploy/mesos-start-masters.sh
config.status: creating src/deploy/mesos-start-slaves.sh
config.status: creating src/deploy/mesos-stop-agents.sh
config.status: creating src/deploy/mesos-stop-cluster.sh
config.status: creating src/deploy/mesos-stop-masters.sh
config.status: creating src/deploy/mesos-stop-slaves.sh
config.status: creating include/mesos/version.hpp
config.status: creating src/java/generated/org/apache/mesos/MesosNativeLibrary.java
config.status: creating mpi/mpiexec-mesos
config.status: creating src/examples/java/test-exception-framework
config.status: creating src/examples/java/test-executor
config.status: creating src/examples/java/test-framework
config.status: creating src/examples/java/test-multiple-executors-framework
config.status: creating src/examples/java/test-log
config.status: creating src/examples/java/v1-test-framework
config.status: creating src/java/mesos.pom
config.status: creating src/examples/python/test-executor
config.status: creating src/examples/python/test-framework
config.status: creating src/python/setup.py
config.status: creating src/python/cli/setup.py
config.status: creating src/python/interface/setup.py
config.status: creating src/python/native_common/ext_modules.py
config.status: creating src/python/executor/setup.py
config.status: creating src/python/native/setup.py
config.status: creating src/python/scheduler/setup.py
config.status: linking src/python/native_common/ext_modules.py to src/python/executor/ext_modules.py
config.status: linking src/python/native_common/ext_modules.py to src/python/scheduler/ext_modules.py
config.status: executing depfiles commands
config.status: executing libtool commands
configure: Build option summary:
    CXX:        g++
    CXXFLAGS:   -g1 -O0 -Wno-unused-local-typedefs -std=c++11
    CPPFLAGS:   -isystem /usr/include/subversion-1 -isystem /usr/include/apr-1 -isystem /usr/include/apr-1.0
      
    LDFLAGS:    
    LIBS:       -lz -lsvn_delta-1 -lsvn_subr-1 -lsasl2 -lcurl -lapr-1  -lrt

make  dist-gzip am__post_remove_distdir='@:'
make[1]: Entering directory `/mesos'
if test -d "mesos-1.5.0"; then find "mesos-1.5.0" -type d ! -perm -200 -exec chmod u+w {}
';' && rm -rf "mesos-1.5.0" || { sleep 5 && rm -rf "mesos-1.5.0"; }; else
:; fi
test -d "mesos-1.5.0" || mkdir "mesos-1.5.0"
 (cd 3rdparty && make  top_distdir=../mesos-1.5.0 distdir=../mesos-1.5.0/3rdparty
\
     am__remove_distdir=: am__skip_length_check=: am__skip_mode_fix=: distdir)
make[2]: Entering directory `/mesos/3rdparty'
 (cd stout && make  top_distdir=../../mesos-1.5.0 distdir=../../mesos-1.5.0/3rdparty/stout
\
     am__remove_distdir=: am__skip_length_check=: am__skip_mode_fix=: distdir)
make[3]: Entering directory `/mesos/3rdparty/stout'
 (cd include && make  top_distdir=../../../mesos-1.5.0 distdir=../../../mesos-1.5.0/3rdparty/stout/include
\
     am__remove_distdir=: am__skip_length_check=: am__skip_mode_fix=: distdir)
make[4]: Entering directory `/mesos/3rdparty/stout/include'
make[4]: Leaving directory `/mesos/3rdparty/stout/include'
make  \
	  top_distdir="../../mesos-1.5.0" distdir="../../mesos-1.5.0/3rdparty/stout" \
	  dist-hook
make[4]: Entering directory `/mesos/3rdparty/stout'
cp -r ./3rdparty ../../mesos-1.5.0/3rdparty/stout/
make[4]: Leaving directory `/mesos/3rdparty/stout'
make[3]: Leaving directory `/mesos/3rdparty/stout'
 (cd libprocess && make  top_distdir=../../mesos-1.5.0 distdir=../../mesos-1.5.0/3rdparty/libprocess
\
     am__remove_distdir=: am__skip_length_check=: am__skip_mode_fix=: distdir)
make[3]: Entering directory `/mesos/3rdparty/libprocess'
 (cd include && make  top_distdir=../../../mesos-1.5.0 distdir=../../../mesos-1.5.0/3rdparty/libprocess/include
\
     am__remove_distdir=: am__skip_length_check=: am__skip_mode_fix=: distdir)
make[4]: Entering directory `/mesos/3rdparty/libprocess/include'
make[4]: Leaving directory `/mesos/3rdparty/libprocess/include'
make  \
	  top_distdir="../../mesos-1.5.0" distdir="../../mesos-1.5.0/3rdparty/libprocess" \
	  dist-hook
make[4]: Entering directory `/mesos/3rdparty/libprocess'
cp -r ./3rdparty ../../mesos-1.5.0/3rdparty/libprocess/
make[4]: Leaving directory `/mesos/3rdparty/libprocess'
make[3]: Leaving directory `/mesos/3rdparty/libprocess'
make[2]: Leaving directory `/mesos/3rdparty'
 (cd src && make  top_distdir=../mesos-1.5.0 distdir=../mesos-1.5.0/src \
     am__remove_distdir=: am__skip_length_check=: am__skip_mode_fix=: distdir)
make[2]: Entering directory `/mesos/src'
../3rdparty/protobuf-3.5.0/src/protoc -I../include -I.  --cpp_out=. csi/uri_volume_profile.proto
/bin/bash: ../3rdparty/protobuf-3.5.0/src/protoc: No such file or directory
make[2]: *** [csi/uri_volume_profile.pb.cc] Error 127
make[2]: Leaving directory `/mesos/src'
make[1]: *** [distdir] Error 1
make[1]: Leaving directory `/mesos'
make: *** [dist] Error 2
+ docker rmi mesos-1513659219-9518
Untagged: mesos-1513659219-9518:latest
Deleted: sha256:2af58e8729ac77fa5abbc85a5e0210d17b4317ac4e154fbeacbfced844c940e3
Deleted: sha256:d9c1c969d9651ac990102c8b0a2912f0195f0be4a0ff54d0e25ad46560a9d106
Deleted: sha256:373f31b192e0a2839143afa1cdaee007e140f2869cace067362757d64672f3d0
Deleted: sha256:9323da657d1730affb08565ccc3b0f64d86e5d3013a83250eac6353b9edb855f
Deleted: sha256:836a7222c0b87f59485129f5b2eb4ab61ba09b4d8d4ab7edbe531e6882e47e60
Deleted: sha256:133733d1cc9a49e00d9510d2e2c0de047e7998be87d3eee13f020934a1cc3659
Deleted: sha256:772a50ef777d0ebf656fb5605250838c5e6b4dce269babfbf78d515f4ebf5706
Deleted: sha256:836994595c534116d6315f4b367d9a7510234701e487b56dd06c78d28618b014
Deleted: sha256:640550c1a3273640b38bf282aa02244d92223bab86b376325876316b2d80b896
Deleted: sha256:acd1b79e36d347652f176d17149b3e1e49eab7aa3ac58766c556387d958dee46
Deleted: sha256:dacc65ec419aca88a3d4ce78cf41ff53b7dd1c5c6e515a1c773b2ee6c47a5db9
Deleted: sha256:ad7659f337ec3b79d5dbed8bdf16dce567f0a384ad94a1ec266f7175bc2ec473
Deleted: sha256:9a32a5bce7fdf99a02ecee2e2ffbc83502f66608182561db5f4f9a3ca31499dc
Deleted: sha256:97a8873d9c268bcc6a813bc786d4839bea82999d2aa9491172e701b3d805b965
Deleted: sha256:068893e63563e0560cfc8b64ba6aea5e56164e14d22ea91f802efe3d1796ba33
Deleted: sha256:4653a9c29b744008038685f4d3a3db99d99038b99745471993b4c33abf199f0f
Deleted: sha256:e538903ce6f4b409e86a4074943eb863ecc900c95d093ab4b5abf267729230a8
Deleted: sha256:3dd07489547cdc2f8706894b35b7fb2d23aafdacaf2203762d1d5166fa3d42da
Deleted: sha256:d450c39aa0ff3bca3af965cb71d51d0730a1866fff20beb48e93d7d25b00d106
Deleted: sha256:cea6f22b64c00fa1b11384d46b39010719185f6b35c8928c32e5da213d91f627
Deleted: sha256:33838f4d90f4c4da5a13b1d9d7b7455dcea2ae57315ecec1696f84fc218e63be
Deleted: sha256:8cfe47ce428a327b86dbe5f2c4dc501adbb28bde21d1c0a9d9e8cc86fe685b3a
Deleted: sha256:a1f5bf0ad6520af450614555b106ae443ed1418ec5db519a2bd81c7426a17a0b
Deleted: sha256:e64da8edd67f22b25d2e6b0f92fc54938fdceab6eabd93407eeaece111c7b545
Deleted: sha256:03a8c8384efd60902be2b6d3c0fb25758579b30e2366129821cef223259dca3d
Deleted: sha256:2aa475e5e737748ad791bd12554b1760153a86fed7e23b440094fb5b17363ead
Deleted: sha256:b189312153b281b432042a63dfbe60cd5d526e3c664b4fe1d95b8bdf0e4d7a0d
Deleted: sha256:a6a3a9227e7c78ac076e25642d61c254d9663948a9bd21080559c67fb855b283
Deleted: sha256:e220d859309a0912d5bed29f7bdb74fe45ce3fb4cc80f3f4eba4938b490bee00
Deleted: sha256:00b88a64fb115b3fb42709920cf0f8f1a2c773def1d8b8d4ab8d643802c19cc0
Build step 'Execute shell' marked build as failure

Mime
View raw message